You are viewing a plain text version of this content. The canonical link for it is here.
Posted to dev@geronimo.apache.org by pr...@apache.org on 2008/01/06 11:09:40 UTC
[BUILD] 2.1: Failed for Revision: 609270
OpenEJB trunk at 609264
Geronimo Revision: 609270 built with tests included
See the full build-0300.log file at http://people.apache.org/~prasad/binaries/trunk/20080106/build-0300.log
Download the binaries from http://people.apache.org/~prasad/binaries/trunk/20080106
[INFO] BUILD SUCCESSFUL
[INFO] ------------------------------------------------------------------------
[INFO] Total time: 28 minutes 46 seconds
[INFO] Finished at: Sun Jan 06 03:36:14 EST 2008
[INFO] Final Memory: 301M/659M
[INFO] ------------------------------------------------------------------------
TESTSUITE RESULTS (Failures only)
=================================
See detailed results at http://people.apache.org/~prasad/testsuite/ResultsSummary.html
Assembly: tomcat
=================================
See the full test.log file at http://people.apache.org/~prasad/binaries/trunk/20080106/logs-0300-tomcat/test.log
[INFO] Running console-testsuite.basic-console
[INFO] Tests run: 38, Failures: 1, Errors: 0, Skipped: 0, Time elapsed: 84.612 sec <<< FAILURE!
[INFO] Running console-testsuite.advance-test
[INFO] Tests run: 12, Failures: 4, Errors: 0, Skipped: 0, Time elapsed: 45.519 sec <<< FAILURE!
Assembly: jetty
=================================
See the full test.log file at http://people.apache.org/~prasad/binaries/trunk/20080106/logs-0300-jetty/test.log
[INFO] Running console-testsuite.basic-console
[INFO] Tests run: 38, Failures: 1, Errors: 0, Skipped: 0, Time elapsed: 86.506 sec <<< FAILURE!
[INFO] Running console-testsuite.advance-test
[INFO] Tests run: 12, Failures: 4, Errors: 0, Skipped: 0, Time elapsed: 44.941 sec <<< FAILURE!