You are viewing a plain text version of this content. The canonical link for it is here.
Posted to dev@kafka.apache.org by Apache Jenkins Server <je...@builds.apache.org> on 2019/06/19 23:31:40 UTC
Build failed in Jenkins: kafka-trunk-jdk11 #645
See <https://builds.apache.org/job/kafka-trunk-jdk11/645/display/redirect?page=changes>
Changes:
[jason] KAFKA-8564; Fix NPE on deleted partition dir when no segments remain
------------------------------------------
[...truncated 2.68 MB...]
org.apache.kafka.connect.transforms.CastTest > castWholeRecordValueWithSchemaBooleanTrue PASSED
org.apache.kafka.connect.transforms.CastTest > castWholeRecordDefaultValue STARTED
org.apache.kafka.connect.transforms.CastTest > castWholeRecordDefaultValue PASSED
org.apache.kafka.connect.transforms.CastTest > castWholeRecordValueWithSchemaInt8 STARTED
org.apache.kafka.connect.transforms.CastTest > castWholeRecordValueWithSchemaInt8 PASSED
org.apache.kafka.connect.transforms.CastTest > castWholeRecordKeyWithSchema STARTED
org.apache.kafka.connect.transforms.CastTest > castWholeRecordKeyWithSchema PASSED
org.apache.kafka.connect.transforms.CastTest > castWholeRecordValueSchemalessInt8 STARTED
org.apache.kafka.connect.transforms.CastTest > castWholeRecordValueSchemalessInt8 PASSED
org.apache.kafka.connect.transforms.CastTest > castWholeRecordValueSchemalessBooleanFalse STARTED
org.apache.kafka.connect.transforms.CastTest > castWholeRecordValueSchemalessBooleanFalse PASSED
org.apache.kafka.connect.transforms.CastTest > testConfigInvalidSchemaType STARTED
org.apache.kafka.connect.transforms.CastTest > testConfigInvalidSchemaType PASSED
org.apache.kafka.connect.transforms.CastTest > castWholeRecordValueSchemalessString STARTED
org.apache.kafka.connect.transforms.CastTest > castWholeRecordValueSchemalessString PASSED
org.apache.kafka.connect.transforms.CastTest > castFieldsWithSchema STARTED
org.apache.kafka.connect.transforms.CastTest > castFieldsWithSchema PASSED
org.apache.kafka.connect.transforms.TimestampConverterTest > testSchemalessFieldConversion STARTED
org.apache.kafka.connect.transforms.TimestampConverterTest > testSchemalessFieldConversion PASSED
org.apache.kafka.connect.transforms.TimestampConverterTest > testConfigInvalidTargetType STARTED
org.apache.kafka.connect.transforms.TimestampConverterTest > testConfigInvalidTargetType PASSED
org.apache.kafka.connect.transforms.TimestampConverterTest > testSchemalessStringToTimestamp STARTED
org.apache.kafka.connect.transforms.TimestampConverterTest > testSchemalessStringToTimestamp PASSED
org.apache.kafka.connect.transforms.TimestampConverterTest > testKey STARTED
org.apache.kafka.connect.transforms.TimestampConverterTest > testKey PASSED
org.apache.kafka.connect.transforms.TimestampConverterTest > testSchemalessDateToTimestamp STARTED
org.apache.kafka.connect.transforms.TimestampConverterTest > testSchemalessDateToTimestamp PASSED
org.apache.kafka.connect.transforms.TimestampConverterTest > testSchemalessTimestampToString STARTED
org.apache.kafka.connect.transforms.TimestampConverterTest > testSchemalessTimestampToString PASSED
org.apache.kafka.connect.transforms.TimestampConverterTest > testSchemalessTimeToTimestamp STARTED
org.apache.kafka.connect.transforms.TimestampConverterTest > testSchemalessTimeToTimestamp PASSED
org.apache.kafka.connect.transforms.TimestampConverterTest > testWithSchemaTimestampToDate STARTED
org.apache.kafka.connect.transforms.TimestampConverterTest > testWithSchemaTimestampToDate PASSED
org.apache.kafka.connect.transforms.TimestampConverterTest > testWithSchemaTimestampToTime STARTED
org.apache.kafka.connect.transforms.TimestampConverterTest > testWithSchemaTimestampToTime PASSED
org.apache.kafka.connect.transforms.TimestampConverterTest > testWithSchemaTimestampToUnix STARTED
org.apache.kafka.connect.transforms.TimestampConverterTest > testWithSchemaTimestampToUnix PASSED
org.apache.kafka.connect.transforms.TimestampConverterTest > testWithSchemaUnixToTimestamp STARTED
org.apache.kafka.connect.transforms.TimestampConverterTest > testWithSchemaUnixToTimestamp PASSED
org.apache.kafka.connect.transforms.TimestampConverterTest > testSchemalessIdentity STARTED
org.apache.kafka.connect.transforms.TimestampConverterTest > testSchemalessIdentity PASSED
org.apache.kafka.connect.transforms.TimestampConverterTest > testWithSchemaFieldConversion STARTED
org.apache.kafka.connect.transforms.TimestampConverterTest > testWithSchemaFieldConversion PASSED
org.apache.kafka.connect.transforms.TimestampConverterTest > testWithSchemaDateToTimestamp STARTED
org.apache.kafka.connect.transforms.TimestampConverterTest > testWithSchemaDateToTimestamp PASSED
org.apache.kafka.connect.transforms.TimestampConverterTest > testWithSchemaIdentity STARTED
org.apache.kafka.connect.transforms.TimestampConverterTest > testWithSchemaIdentity PASSED
org.apache.kafka.connect.transforms.TimestampConverterTest > testSchemalessTimestampToDate STARTED
org.apache.kafka.connect.transforms.TimestampConverterTest > testSchemalessTimestampToDate PASSED
org.apache.kafka.connect.transforms.TimestampConverterTest > testSchemalessTimestampToTime STARTED
org.apache.kafka.connect.transforms.TimestampConverterTest > testSchemalessTimestampToTime PASSED
org.apache.kafka.connect.transforms.TimestampConverterTest > testSchemalessTimestampToUnix STARTED
org.apache.kafka.connect.transforms.TimestampConverterTest > testSchemalessTimestampToUnix PASSED
org.apache.kafka.connect.transforms.TimestampConverterTest > testConfigMissingFormat STARTED
org.apache.kafka.connect.transforms.TimestampConverterTest > testConfigMissingFormat PASSED
org.apache.kafka.connect.transforms.TimestampConverterTest > testConfigNoTargetType STARTED
org.apache.kafka.connect.transforms.TimestampConverterTest > testConfigNoTargetType PASSED
org.apache.kafka.connect.transforms.TimestampConverterTest > testWithSchemaStringToTimestamp STARTED
org.apache.kafka.connect.transforms.TimestampConverterTest > testWithSchemaStringToTimestamp PASSED
org.apache.kafka.connect.transforms.TimestampConverterTest > testWithSchemaTimeToTimestamp STARTED
org.apache.kafka.connect.transforms.TimestampConverterTest > testWithSchemaTimeToTimestamp PASSED
org.apache.kafka.connect.transforms.TimestampConverterTest > testSchemalessUnixToTimestamp STARTED
org.apache.kafka.connect.transforms.TimestampConverterTest > testSchemalessUnixToTimestamp PASSED
org.apache.kafka.connect.transforms.TimestampConverterTest > testWithSchemaTimestampToString STARTED
org.apache.kafka.connect.transforms.TimestampConverterTest > testWithSchemaTimestampToString PASSED
org.apache.kafka.connect.transforms.TimestampConverterTest > testConfigInvalidFormat STARTED
org.apache.kafka.connect.transforms.TimestampConverterTest > testConfigInvalidFormat PASSED
org.apache.kafka.connect.transforms.HoistFieldTest > withSchema STARTED
org.apache.kafka.connect.transforms.HoistFieldTest > withSchema PASSED
org.apache.kafka.connect.transforms.HoistFieldTest > schemaless STARTED
org.apache.kafka.connect.transforms.HoistFieldTest > schemaless PASSED
org.apache.kafka.connect.transforms.RegexRouterTest > doesntMatch STARTED
org.apache.kafka.connect.transforms.RegexRouterTest > doesntMatch PASSED
org.apache.kafka.connect.transforms.RegexRouterTest > identity STARTED
org.apache.kafka.connect.transforms.RegexRouterTest > identity PASSED
org.apache.kafka.connect.transforms.RegexRouterTest > addPrefix STARTED
org.apache.kafka.connect.transforms.RegexRouterTest > addPrefix PASSED
org.apache.kafka.connect.transforms.RegexRouterTest > addSuffix STARTED
org.apache.kafka.connect.transforms.RegexRouterTest > addSuffix PASSED
org.apache.kafka.connect.transforms.RegexRouterTest > slice STARTED
org.apache.kafka.connect.transforms.RegexRouterTest > slice PASSED
org.apache.kafka.connect.transforms.RegexRouterTest > staticReplacement STARTED
org.apache.kafka.connect.transforms.RegexRouterTest > staticReplacement PASSED
org.apache.kafka.connect.transforms.util.NonEmptyListValidatorTest > testNullList STARTED
org.apache.kafka.connect.transforms.util.NonEmptyListValidatorTest > testNullList PASSED
org.apache.kafka.connect.transforms.util.NonEmptyListValidatorTest > testEmptyList STARTED
org.apache.kafka.connect.transforms.util.NonEmptyListValidatorTest > testEmptyList PASSED
org.apache.kafka.connect.transforms.util.NonEmptyListValidatorTest > testValidList STARTED
org.apache.kafka.connect.transforms.util.NonEmptyListValidatorTest > testValidList PASSED
org.apache.kafka.connect.transforms.ExtractFieldTest > withSchema STARTED
org.apache.kafka.connect.transforms.ExtractFieldTest > withSchema PASSED
org.apache.kafka.connect.transforms.ExtractFieldTest > testNullWithSchema STARTED
org.apache.kafka.connect.transforms.ExtractFieldTest > testNullWithSchema PASSED
org.apache.kafka.connect.transforms.ExtractFieldTest > schemaless STARTED
org.apache.kafka.connect.transforms.ExtractFieldTest > schemaless PASSED
org.apache.kafka.connect.transforms.ExtractFieldTest > testNullSchemaless STARTED
org.apache.kafka.connect.transforms.ExtractFieldTest > testNullSchemaless PASSED
org.apache.kafka.connect.transforms.MaskFieldTest > withSchema STARTED
org.apache.kafka.connect.transforms.MaskFieldTest > withSchema PASSED
org.apache.kafka.connect.transforms.MaskFieldTest > schemaless STARTED
org.apache.kafka.connect.transforms.MaskFieldTest > schemaless PASSED
org.apache.kafka.connect.transforms.InsertFieldTest > schemalessInsertConfiguredFields STARTED
org.apache.kafka.connect.transforms.InsertFieldTest > schemalessInsertConfiguredFields PASSED
org.apache.kafka.connect.transforms.InsertFieldTest > topLevelStructRequired STARTED
org.apache.kafka.connect.transforms.InsertFieldTest > topLevelStructRequired PASSED
org.apache.kafka.connect.transforms.InsertFieldTest > copySchemaAndInsertConfiguredFields STARTED
org.apache.kafka.connect.transforms.InsertFieldTest > copySchemaAndInsertConfiguredFields PASSED
org.apache.kafka.connect.transforms.ValueToKeyTest > withSchema STARTED
org.apache.kafka.connect.transforms.ValueToKeyTest > withSchema PASSED
org.apache.kafka.connect.transforms.ValueToKeyTest > schemaless STARTED
org.apache.kafka.connect.transforms.ValueToKeyTest > schemaless PASSED
org.apache.kafka.connect.transforms.TimestampRouterTest > defaultConfiguration STARTED
org.apache.kafka.connect.transforms.TimestampRouterTest > defaultConfiguration PASSED
FAILURE: Build failed with an exception.
* What went wrong:
Execution failed for task ':connect:runtime:test'.
> There were failing tests. See the report at: file://<https://builds.apache.org/job/kafka-trunk-jdk11/ws/connect/runtime/build/reports/tests/test/index.html>
* Try:
Run with --stacktrace option to get the stack trace. Run with --info or --debug option to get more log output. Run with --scan to get full insights.
* Get more help at https://help.gradle.org
Deprecated Gradle features were used in this build, making it incompatible with Gradle 6.0.
Use '--warning-mode all' to show the individual deprecation warnings.
See https://docs.gradle.org/5.4.1/userguide/command_line_interface.html#sec:command_line_warnings
BUILD FAILED in 2h 57m 53s
178 actionable tasks: 152 executed, 26 up-to-date
Build step 'Execute shell' marked build as failure
Recording test results
ERROR: No tool found matching GRADLE_4_10_2_HOME
Setting GRADLE_4_10_3_HOME=/home/jenkins/tools/gradle/4.10.3
ERROR: No tool found matching GRADLE_4_10_2_HOME
Setting GRADLE_4_10_3_HOME=/home/jenkins/tools/gradle/4.10.3
Jenkins build is back to normal : kafka-trunk-jdk11 #650
Posted by Apache Jenkins Server <je...@builds.apache.org>.
See <https://builds.apache.org/job/kafka-trunk-jdk11/650/display/redirect?page=changes>
Build failed in Jenkins: kafka-trunk-jdk11 #649
Posted by Apache Jenkins Server <je...@builds.apache.org>.
See <https://builds.apache.org/job/kafka-trunk-jdk11/649/display/redirect?page=changes>
Changes:
[github] KAFKA-8519 Add trogdor action to slow down a network (#6912)
------------------------------------------
[...truncated 2.52 MB...]
org.apache.kafka.connect.runtime.distributed.WorkerCoordinatorTest > testLeaderPerformAssignment1[1] STARTED
org.apache.kafka.connect.runtime.distributed.WorkerCoordinatorTest > testLeaderPerformAssignment1[1] PASSED
org.apache.kafka.connect.runtime.distributed.WorkerCoordinatorTest > testLeaderPerformAssignment2[1] STARTED
org.apache.kafka.connect.runtime.distributed.WorkerCoordinatorTest > testLeaderPerformAssignment2[1] PASSED
org.apache.kafka.connect.runtime.distributed.WorkerCoordinatorTest > testJoinLeaderCannotAssign[1] STARTED
org.apache.kafka.connect.runtime.distributed.WorkerCoordinatorTest > testJoinLeaderCannotAssign[1] PASSED
org.apache.kafka.connect.runtime.distributed.WorkerCoordinatorTest > testRejoinGroup[1] STARTED
org.apache.kafka.connect.runtime.distributed.WorkerCoordinatorTest > testRejoinGroup[1] PASSED
org.apache.kafka.connect.runtime.distributed.WorkerCoordinatorTest > testNormalJoinGroupLeader[1] STARTED
org.apache.kafka.connect.runtime.distributed.WorkerCoordinatorTest > testNormalJoinGroupLeader[1] PASSED
org.apache.kafka.connect.runtime.distributed.WorkerCoordinatorIncrementalTest > testMetadataWithExistingAssignmentButOlderProtocolSelection[0] STARTED
org.apache.kafka.connect.runtime.distributed.WorkerCoordinatorIncrementalTest > testMetadataWithExistingAssignmentButOlderProtocolSelection[0] PASSED
org.apache.kafka.connect.runtime.distributed.WorkerCoordinatorIncrementalTest > testMetadataWithExistingAssignment[0] STARTED
org.apache.kafka.connect.runtime.distributed.WorkerCoordinatorIncrementalTest > testMetadataWithExistingAssignment[0] PASSED
org.apache.kafka.connect.runtime.distributed.WorkerCoordinatorIncrementalTest > testTaskAssignmentWhenWorkerBounces[0] STARTED
org.apache.kafka.connect.runtime.distributed.WorkerCoordinatorIncrementalTest > testTaskAssignmentWhenWorkerBounces[0] PASSED
org.apache.kafka.connect.runtime.distributed.WorkerCoordinatorIncrementalTest > testTaskAssignmentWhenWorkerJoins[0] STARTED
org.apache.kafka.connect.runtime.distributed.WorkerCoordinatorIncrementalTest > testTaskAssignmentWhenWorkerJoins[0] PASSED
org.apache.kafka.connect.runtime.distributed.WorkerCoordinatorIncrementalTest > testTaskAssignmentWhenWorkerLeavesPermanently[0] STARTED
org.apache.kafka.connect.runtime.distributed.WorkerCoordinatorIncrementalTest > testTaskAssignmentWhenWorkerLeavesPermanently[0] PASSED
org.apache.kafka.connect.runtime.distributed.WorkerCoordinatorIncrementalTest > testMetadata[0] STARTED
org.apache.kafka.connect.runtime.distributed.WorkerCoordinatorIncrementalTest > testMetadata[0] PASSED
org.apache.kafka.connect.runtime.distributed.IncrementalCooperativeAssignorTest > testLostAssignmentHandlingWhenWorkerLeavesPermanently STARTED
org.apache.kafka.connect.runtime.distributed.IncrementalCooperativeAssignorTest > testLostAssignmentHandlingWhenWorkerLeavesPermanently PASSED
org.apache.kafka.connect.runtime.distributed.IncrementalCooperativeAssignorTest > testTaskAssignmentWhenLeaderBounces STARTED
org.apache.kafka.connect.runtime.distributed.IncrementalCooperativeAssignorTest > testTaskAssignmentWhenLeaderBounces PASSED
org.apache.kafka.connect.runtime.distributed.IncrementalCooperativeAssignorTest > testTaskAssignmentWhenWorkerBounces STARTED
org.apache.kafka.connect.runtime.distributed.IncrementalCooperativeAssignorTest > testTaskAssignmentWhenWorkerBounces PASSED
org.apache.kafka.connect.runtime.distributed.IncrementalCooperativeAssignorTest > testLostAssignmentHandlingWhenWorkerBouncesBackButFinallyLeaves STARTED
org.apache.kafka.connect.runtime.distributed.IncrementalCooperativeAssignorTest > testLostAssignmentHandlingWhenWorkerBouncesBackButFinallyLeaves PASSED
org.apache.kafka.connect.runtime.distributed.IncrementalCooperativeAssignorTest > testLostAssignmentHandlingWhenWorkerBounces STARTED
org.apache.kafka.connect.runtime.distributed.IncrementalCooperativeAssignorTest > testLostAssignmentHandlingWhenWorkerBounces PASSED
org.apache.kafka.connect.runtime.distributed.IncrementalCooperativeAssignorTest > testTaskAssignmentWhenWorkerJoins STARTED
org.apache.kafka.connect.runtime.distributed.IncrementalCooperativeAssignorTest > testTaskAssignmentWhenWorkerJoins PASSED
org.apache.kafka.connect.runtime.distributed.IncrementalCooperativeAssignorTest > testLostAssignmentHandlingWithMoreThanOneCandidates STARTED
org.apache.kafka.connect.runtime.distributed.IncrementalCooperativeAssignorTest > testLostAssignmentHandlingWithMoreThanOneCandidates PASSED
org.apache.kafka.connect.runtime.distributed.IncrementalCooperativeAssignorTest > testAssignTasksWhenBalanced STARTED
org.apache.kafka.connect.runtime.distributed.IncrementalCooperativeAssignorTest > testAssignTasksWhenBalanced PASSED
org.apache.kafka.connect.runtime.distributed.IncrementalCooperativeAssignorTest > testTaskAssignmentWhenWorkerLeavesPermanently STARTED
org.apache.kafka.connect.runtime.distributed.IncrementalCooperativeAssignorTest > testTaskAssignmentWhenWorkerLeavesPermanently PASSED
org.apache.kafka.connect.runtime.distributed.IncrementalCooperativeAssignorTest > testAssignConnectorsWhenImbalanced STARTED
org.apache.kafka.connect.runtime.distributed.IncrementalCooperativeAssignorTest > testAssignConnectorsWhenImbalanced PASSED
org.apache.kafka.connect.runtime.distributed.IncrementalCooperativeAssignorTest > testTaskAssignmentWhenConnectorsAreDeleted STARTED
org.apache.kafka.connect.runtime.distributed.IncrementalCooperativeAssignorTest > testTaskAssignmentWhenConnectorsAreDeleted PASSED
org.apache.kafka.connect.runtime.distributed.IncrementalCooperativeAssignorTest > testAssignConnectorsWhenBalanced STARTED
org.apache.kafka.connect.runtime.distributed.IncrementalCooperativeAssignorTest > testAssignConnectorsWhenBalanced PASSED
org.apache.kafka.connect.runtime.distributed.IncrementalCooperativeAssignorTest > testTaskAssignmentWhenSubsequentAssignmentAttemptFails STARTED
org.apache.kafka.connect.runtime.distributed.IncrementalCooperativeAssignorTest > testTaskAssignmentWhenSubsequentAssignmentAttemptFails PASSED
org.apache.kafka.connect.runtime.distributed.IncrementalCooperativeAssignorTest > testTaskAssignmentWhenFirstAssignmentAttemptFails STARTED
org.apache.kafka.connect.runtime.distributed.IncrementalCooperativeAssignorTest > testTaskAssignmentWhenFirstAssignmentAttemptFails PASSED
org.apache.kafka.connect.runtime.distributed.IncrementalCooperativeAssignorTest > testTaskAssignmentWhenLeaderLeavesPermanently STARTED
org.apache.kafka.connect.runtime.distributed.IncrementalCooperativeAssignorTest > testTaskAssignmentWhenLeaderLeavesPermanently PASSED
org.apache.kafka.connect.runtime.distributed.ConnectProtocolCompatibilityTest > testCoopToCoopMetadata STARTED
org.apache.kafka.connect.runtime.distributed.ConnectProtocolCompatibilityTest > testCoopToCoopMetadata PASSED
org.apache.kafka.connect.runtime.distributed.ConnectProtocolCompatibilityTest > testCoopToEagerAssignment STARTED
org.apache.kafka.connect.runtime.distributed.ConnectProtocolCompatibilityTest > testCoopToEagerAssignment PASSED
org.apache.kafka.connect.runtime.distributed.ConnectProtocolCompatibilityTest > testCoopToCoopAssignment STARTED
org.apache.kafka.connect.runtime.distributed.ConnectProtocolCompatibilityTest > testCoopToCoopAssignment PASSED
org.apache.kafka.connect.runtime.distributed.ConnectProtocolCompatibilityTest > testEagerToCoopAssignment STARTED
org.apache.kafka.connect.runtime.distributed.ConnectProtocolCompatibilityTest > testEagerToCoopAssignment PASSED
org.apache.kafka.connect.runtime.distributed.ConnectProtocolCompatibilityTest > testEagerToEagerAssignment STARTED
org.apache.kafka.connect.runtime.distributed.ConnectProtocolCompatibilityTest > testEagerToEagerAssignment PASSED
org.apache.kafka.connect.runtime.distributed.ConnectProtocolCompatibilityTest > testCoopToEagerMetadata STARTED
org.apache.kafka.connect.runtime.distributed.ConnectProtocolCompatibilityTest > testCoopToEagerMetadata PASSED
org.apache.kafka.connect.runtime.distributed.ConnectProtocolCompatibilityTest > testEagerToEagerMetadata STARTED
org.apache.kafka.connect.runtime.distributed.ConnectProtocolCompatibilityTest > testEagerToEagerMetadata PASSED
org.apache.kafka.connect.runtime.distributed.ConnectProtocolCompatibilityTest > testEagerToCoopMetadata STARTED
org.apache.kafka.connect.runtime.distributed.ConnectProtocolCompatibilityTest > testEagerToCoopMetadata PASSED
org.apache.kafka.connect.runtime.WorkerTaskTest > standardStartup STARTED
org.apache.kafka.connect.runtime.WorkerTaskTest > standardStartup PASSED
org.apache.kafka.connect.runtime.WorkerTaskTest > stopBeforeStarting STARTED
org.apache.kafka.connect.runtime.WorkerTaskTest > stopBeforeStarting PASSED
org.apache.kafka.connect.runtime.WorkerTaskTest > cancelBeforeStopping STARTED
org.apache.kafka.connect.runtime.WorkerTaskTest > cancelBeforeStopping PASSED
org.apache.kafka.connect.runtime.WorkerTaskTest > updateMetricsOnListenerEventsForStartupPauseResumeAndShutdown STARTED
org.apache.kafka.connect.runtime.WorkerTaskTest > updateMetricsOnListenerEventsForStartupPauseResumeAndShutdown PASSED
org.apache.kafka.connect.runtime.WorkerTaskTest > updateMetricsOnListenerEventsForStartupPauseResumeAndFailure STARTED
org.apache.kafka.connect.runtime.WorkerTaskTest > updateMetricsOnListenerEventsForStartupPauseResumeAndFailure PASSED
org.apache.kafka.connect.connector.policy.NoneConnectorClientConfigOverridePolicyTest > testNoOverrides STARTED
org.apache.kafka.connect.connector.policy.NoneConnectorClientConfigOverridePolicyTest > testNoOverrides PASSED
org.apache.kafka.connect.connector.policy.NoneConnectorClientConfigOverridePolicyTest > testWithOverrides STARTED
org.apache.kafka.connect.connector.policy.NoneConnectorClientConfigOverridePolicyTest > testWithOverrides PASSED
org.apache.kafka.connect.connector.policy.PrincipalConnectorClientConfigOverridePolicyTest > testPrincipalPlusOtherConfigs STARTED
org.apache.kafka.connect.connector.policy.PrincipalConnectorClientConfigOverridePolicyTest > testPrincipalPlusOtherConfigs PASSED
org.apache.kafka.connect.connector.policy.PrincipalConnectorClientConfigOverridePolicyTest > testPrincipalOnly STARTED
org.apache.kafka.connect.connector.policy.PrincipalConnectorClientConfigOverridePolicyTest > testPrincipalOnly PASSED
470 tests completed, 1 failed
> Task :connect:runtime:test FAILED
> Task :connect:basic-auth-extension:test
org.apache.kafka.connect.rest.basic.auth.extension.JaasBasicAuthFilterTest > testSuccess STARTED
WARNING: An illegal reflective access operation has occurred
WARNING: Illegal reflective access by org.powermock.reflect.internal.WhiteboxImpl (file:/home/jenkins/.gradle/caches/modules-2/files-2.1/org.powermock/powermock-reflect/2.0.2/79df0e5792fba38278b90f9e22617f5684313017/powermock-reflect-2.0.2.jar) to method java.lang.Object.clone()
WARNING: Please consider reporting this to the maintainers of org.powermock.reflect.internal.WhiteboxImpl
WARNING: Use --illegal-access=warn to enable warnings of further illegal reflective access operations
WARNING: All illegal access operations will be denied in a future release
org.apache.kafka.connect.rest.basic.auth.extension.JaasBasicAuthFilterTest > testSuccess PASSED
org.apache.kafka.connect.rest.basic.auth.extension.JaasBasicAuthFilterTest > testBadCredential STARTED
org.apache.kafka.connect.rest.basic.auth.extension.JaasBasicAuthFilterTest > testBadCredential PASSED
org.apache.kafka.connect.rest.basic.auth.extension.JaasBasicAuthFilterTest > testBadPassword STARTED
org.apache.kafka.connect.rest.basic.auth.extension.JaasBasicAuthFilterTest > testBadPassword PASSED
org.apache.kafka.connect.rest.basic.auth.extension.JaasBasicAuthFilterTest > testUnknownBearer STARTED
org.apache.kafka.connect.rest.basic.auth.extension.JaasBasicAuthFilterTest > testUnknownBearer PASSED
org.apache.kafka.connect.rest.basic.auth.extension.JaasBasicAuthFilterTest > testUnknownLoginModule STARTED
org.apache.kafka.connect.rest.basic.auth.extension.JaasBasicAuthFilterTest > testUnknownLoginModule PASSED
org.apache.kafka.connect.rest.basic.auth.extension.JaasBasicAuthFilterTest > testUnknownCredentialsFile STARTED
org.apache.kafka.connect.rest.basic.auth.extension.JaasBasicAuthFilterTest > testUnknownCredentialsFile PASSED
org.apache.kafka.connect.rest.basic.auth.extension.JaasBasicAuthFilterTest > testEmptyCredentialsFile STARTED
org.apache.kafka.connect.rest.basic.auth.extension.JaasBasicAuthFilterTest > testEmptyCredentialsFile PASSED
org.apache.kafka.connect.rest.basic.auth.extension.JaasBasicAuthFilterTest > testNoFileOption STARTED
org.apache.kafka.connect.rest.basic.auth.extension.JaasBasicAuthFilterTest > testNoFileOption PASSED
org.apache.kafka.connect.rest.basic.auth.extension.JaasBasicAuthFilterTest > testPostNotChangingConnectorTask STARTED
org.apache.kafka.connect.rest.basic.auth.extension.JaasBasicAuthFilterTest > testPostNotChangingConnectorTask PASSED
org.apache.kafka.connect.rest.basic.auth.extension.JaasBasicAuthFilterTest > testPostWithoutAppropriateCredential STARTED
org.apache.kafka.connect.rest.basic.auth.extension.JaasBasicAuthFilterTest > testPostWithoutAppropriateCredential PASSED
FAILURE: Build failed with an exception.
* What went wrong:
Execution failed for task ':connect:runtime:test'.
> There were failing tests. See the report at: file://<https://builds.apache.org/job/kafka-trunk-jdk11/ws/connect/runtime/build/reports/tests/test/index.html>
* Try:
Run with --stacktrace option to get the stack trace. Run with --info or --debug option to get more log output. Run with --scan to get full insights.
* Get more help at https://help.gradle.org
Deprecated Gradle features were used in this build, making it incompatible with Gradle 6.0.
Use '--warning-mode all' to show the individual deprecation warnings.
See https://docs.gradle.org/5.4.1/userguide/command_line_interface.html#sec:command_line_warnings
BUILD FAILED in 3h 12m 24s
178 actionable tasks: 152 executed, 26 up-to-date
Build step 'Execute shell' marked build as failure
Recording test results
ERROR: No tool found matching GRADLE_4_10_2_HOME
Setting GRADLE_4_10_3_HOME=/home/jenkins/tools/gradle/4.10.3
ERROR: No tool found matching GRADLE_4_10_2_HOME
Setting GRADLE_4_10_3_HOME=/home/jenkins/tools/gradle/4.10.3
Not sending mail to unregistered user noreply@github.com
Not sending mail to unregistered user wangguoz@gmail.com
Build failed in Jenkins: kafka-trunk-jdk11 #648
Posted by Apache Jenkins Server <je...@builds.apache.org>.
See <https://builds.apache.org/job/kafka-trunk-jdk11/648/display/redirect?page=changes>
Changes:
[github] MINOR: Remove legacy kafka.admin.AdminClient (#6947)
------------------------------------------
[...truncated 2.43 MB...]
org.apache.kafka.streams.test.OutputVerifierTest > shouldFailIfValueIsDifferentWithNullForCompareKeyValue STARTED
org.apache.kafka.streams.test.OutputVerifierTest > shouldFailIfValueIsDifferentWithNullForCompareKeyValue PASSED
org.apache.kafka.streams.test.OutputVerifierTest > shouldFailIfKeyIsDifferentWithNullForCompareKeyValueTimestamp STARTED
org.apache.kafka.streams.test.OutputVerifierTest > shouldFailIfKeyIsDifferentWithNullForCompareKeyValueTimestamp PASSED
org.apache.kafka.streams.test.OutputVerifierTest > shouldFailIfKeyIsDifferentForCompareKeyValueWithProducerRecord STARTED
org.apache.kafka.streams.test.OutputVerifierTest > shouldFailIfKeyIsDifferentForCompareKeyValueWithProducerRecord PASSED
org.apache.kafka.streams.test.OutputVerifierTest > shouldFailIfValueIsDifferentWithNullForCompareKeyValueTimestamp STARTED
org.apache.kafka.streams.test.OutputVerifierTest > shouldFailIfValueIsDifferentWithNullForCompareKeyValueTimestamp PASSED
org.apache.kafka.streams.test.OutputVerifierTest > shouldFailIfTimestampIsDifferentForCompareValueTimestampWithProducerRecord STARTED
org.apache.kafka.streams.test.OutputVerifierTest > shouldFailIfTimestampIsDifferentForCompareValueTimestampWithProducerRecord PASSED
org.apache.kafka.streams.test.OutputVerifierTest > shouldPassIfKeyAndValueIsEqualForCompareKeyValue STARTED
org.apache.kafka.streams.test.OutputVerifierTest > shouldPassIfKeyAndValueIsEqualForCompareKeyValue PASSED
org.apache.kafka.streams.test.OutputVerifierTest > shouldNotAllowNullProducerRecordForCompareKeyValueTimestamp STARTED
org.apache.kafka.streams.test.OutputVerifierTest > shouldNotAllowNullProducerRecordForCompareKeyValueTimestamp PASSED
org.apache.kafka.streams.test.OutputVerifierTest > shouldPassIfKeyAndValueIsEqualWithNullForCompareKeyValueTimestamp STARTED
org.apache.kafka.streams.test.OutputVerifierTest > shouldPassIfKeyAndValueIsEqualWithNullForCompareKeyValueTimestamp PASSED
org.apache.kafka.streams.test.OutputVerifierTest > shouldPassIfValueAndTimestampIsEqualForCompareValueTimestamp STARTED
org.apache.kafka.streams.test.OutputVerifierTest > shouldPassIfValueAndTimestampIsEqualForCompareValueTimestamp PASSED
org.apache.kafka.streams.test.OutputVerifierTest > shouldNotAllowNullExpectedRecordForCompareKeyValue STARTED
org.apache.kafka.streams.test.OutputVerifierTest > shouldNotAllowNullExpectedRecordForCompareKeyValue PASSED
org.apache.kafka.streams.test.OutputVerifierTest > shouldFailIfValueIsDifferentForCompareValueTimestampWithProducerRecord STARTED
org.apache.kafka.streams.test.OutputVerifierTest > shouldFailIfValueIsDifferentForCompareValueTimestampWithProducerRecord PASSED
org.apache.kafka.streams.test.OutputVerifierTest > shouldFailIfValueIsDifferentWithNullReversForCompareKeyValue STARTED
org.apache.kafka.streams.test.OutputVerifierTest > shouldFailIfValueIsDifferentWithNullReversForCompareKeyValue PASSED
org.apache.kafka.streams.test.OutputVerifierTest > shouldNotAllowNullExpectedRecordForCompareKeyValueTimestamp STARTED
org.apache.kafka.streams.test.OutputVerifierTest > shouldNotAllowNullExpectedRecordForCompareKeyValueTimestamp PASSED
org.apache.kafka.streams.test.OutputVerifierTest > shouldFailIfValueIsDifferentForCompareValueWithProducerRecord STARTED
org.apache.kafka.streams.test.OutputVerifierTest > shouldFailIfValueIsDifferentForCompareValueWithProducerRecord PASSED
org.apache.kafka.streams.test.OutputVerifierTest > shouldPassIfValueIsEqualForCompareValue STARTED
org.apache.kafka.streams.test.OutputVerifierTest > shouldPassIfValueIsEqualForCompareValue PASSED
org.apache.kafka.streams.test.OutputVerifierTest > shouldNotAllowNullProducerRecordWithExpectedRecordForCompareKeyValueTimestamp STARTED
org.apache.kafka.streams.test.OutputVerifierTest > shouldNotAllowNullProducerRecordWithExpectedRecordForCompareKeyValueTimestamp PASSED
org.apache.kafka.streams.test.OutputVerifierTest > shouldFailIfKeyIsDifferentForCompareKeyValue STARTED
org.apache.kafka.streams.test.OutputVerifierTest > shouldFailIfKeyIsDifferentForCompareKeyValue PASSED
org.apache.kafka.streams.test.OutputVerifierTest > shouldNotAllowNullProducerRecordWithExpectedRecordForCompareKeyValue STARTED
org.apache.kafka.streams.test.OutputVerifierTest > shouldNotAllowNullProducerRecordWithExpectedRecordForCompareKeyValue PASSED
org.apache.kafka.streams.test.OutputVerifierTest > shouldFailIfKeyIsDifferentWithNullForCompareKeyValueWithProducerRecord STARTED
org.apache.kafka.streams.test.OutputVerifierTest > shouldFailIfKeyIsDifferentWithNullForCompareKeyValueWithProducerRecord PASSED
org.apache.kafka.streams.test.OutputVerifierTest > shouldPassIfKeyAndValueAndTimestampIsEqualForCompareKeyValueTimestampWithProducerRecord STARTED
org.apache.kafka.streams.test.OutputVerifierTest > shouldPassIfKeyAndValueAndTimestampIsEqualForCompareKeyValueTimestampWithProducerRecord PASSED
org.apache.kafka.streams.test.OutputVerifierTest > shouldPassIfValueIsEqualWithNullForCompareValue STARTED
org.apache.kafka.streams.test.OutputVerifierTest > shouldPassIfValueIsEqualWithNullForCompareValue PASSED
org.apache.kafka.streams.test.OutputVerifierTest > shouldPassIfValueAndTimestampIsEqualWithNullForCompareValueTimestamp STARTED
org.apache.kafka.streams.test.OutputVerifierTest > shouldPassIfValueAndTimestampIsEqualWithNullForCompareValueTimestamp PASSED
org.apache.kafka.streams.test.OutputVerifierTest > shouldFailIfValueIsDifferentWithNullForCompareValueTimestampWithProducerRecord STARTED
org.apache.kafka.streams.test.OutputVerifierTest > shouldFailIfValueIsDifferentWithNullForCompareValueTimestampWithProducerRecord PASSED
org.apache.kafka.streams.test.OutputVerifierTest > shouldFailIfValueIsDifferentWithNullForCompareValueWithProducerRecord STARTED
org.apache.kafka.streams.test.OutputVerifierTest > shouldFailIfValueIsDifferentWithNullForCompareValueWithProducerRecord PASSED
org.apache.kafka.streams.test.OutputVerifierTest > shouldFailIfKeyIsDifferentWithNullReversForCompareKeyValueTimestampWithProducerRecord STARTED
org.apache.kafka.streams.test.OutputVerifierTest > shouldFailIfKeyIsDifferentWithNullReversForCompareKeyValueTimestampWithProducerRecord PASSED
org.apache.kafka.streams.test.OutputVerifierTest > shouldFailIfKeyIsDifferentWithNullReversForCompareKeyValue STARTED
org.apache.kafka.streams.test.OutputVerifierTest > shouldFailIfKeyIsDifferentWithNullReversForCompareKeyValue PASSED
org.apache.kafka.streams.test.OutputVerifierTest > shouldPassIfKeyAndValueIsEqualForCompareKeyValueWithProducerRecord STARTED
org.apache.kafka.streams.test.OutputVerifierTest > shouldPassIfKeyAndValueIsEqualForCompareKeyValueWithProducerRecord PASSED
org.apache.kafka.streams.test.OutputVerifierTest > shouldFailIfValueIsDifferentForCompareKeyValueWithProducerRecord STARTED
org.apache.kafka.streams.test.OutputVerifierTest > shouldFailIfValueIsDifferentForCompareKeyValueWithProducerRecord PASSED
org.apache.kafka.streams.test.OutputVerifierTest > shouldFailIfValueIsDifferentForCompareValueTimestamp STARTED
org.apache.kafka.streams.test.OutputVerifierTest > shouldFailIfValueIsDifferentForCompareValueTimestamp PASSED
org.apache.kafka.streams.test.OutputVerifierTest > shouldNotAllowNullProducerRecordForCompareValue STARTED
org.apache.kafka.streams.test.OutputVerifierTest > shouldNotAllowNullProducerRecordForCompareValue PASSED
org.apache.kafka.streams.test.OutputVerifierTest > shouldFailIfValueIsDifferentWithNullForCompareValueTimestamp STARTED
org.apache.kafka.streams.test.OutputVerifierTest > shouldFailIfValueIsDifferentWithNullForCompareValueTimestamp PASSED
org.apache.kafka.streams.test.OutputVerifierTest > shouldFailIfKeyIsDifferentForCompareKeyValueTimestamp STARTED
org.apache.kafka.streams.test.OutputVerifierTest > shouldFailIfKeyIsDifferentForCompareKeyValueTimestamp PASSED
org.apache.kafka.streams.test.OutputVerifierTest > shouldFailIfKeyIsDifferentForCompareKeyValueTimestampWithProducerRecord STARTED
org.apache.kafka.streams.test.OutputVerifierTest > shouldFailIfKeyIsDifferentForCompareKeyValueTimestampWithProducerRecord PASSED
org.apache.kafka.streams.test.OutputVerifierTest > shouldPassIfValueIsEqualWithNullForCompareValueWithProducerRecord STARTED
org.apache.kafka.streams.test.OutputVerifierTest > shouldPassIfValueIsEqualWithNullForCompareValueWithProducerRecord PASSED
org.apache.kafka.streams.test.OutputVerifierTest > shouldFailIfValueIsDifferentWithNullReverseForCompareValueTimestamp STARTED
org.apache.kafka.streams.test.OutputVerifierTest > shouldFailIfValueIsDifferentWithNullReverseForCompareValueTimestamp PASSED
org.apache.kafka.streams.test.OutputVerifierTest > shouldFailIfValueIsDifferentWithNullReverseForCompareValue STARTED
org.apache.kafka.streams.test.OutputVerifierTest > shouldFailIfValueIsDifferentWithNullReverseForCompareValue PASSED
org.apache.kafka.streams.test.OutputVerifierTest > shouldFailIfTimestampIsDifferentForCompareValueTimestamp STARTED
org.apache.kafka.streams.test.OutputVerifierTest > shouldFailIfTimestampIsDifferentForCompareValueTimestamp PASSED
org.apache.kafka.streams.test.OutputVerifierTest > shouldPassIfKeyAndValueAndTimestampIsEqualWithNullForCompareKeyValueTimestampWithProducerRecord STARTED
org.apache.kafka.streams.test.OutputVerifierTest > shouldPassIfKeyAndValueAndTimestampIsEqualWithNullForCompareKeyValueTimestampWithProducerRecord PASSED
org.apache.kafka.streams.test.OutputVerifierTest > shouldFailIfValueIsDifferentWithNullForCompareKeyValueWithProducerRecord STARTED
org.apache.kafka.streams.test.OutputVerifierTest > shouldFailIfValueIsDifferentWithNullForCompareKeyValueWithProducerRecord PASSED
org.apache.kafka.streams.test.OutputVerifierTest > shouldFailIfValueIsDifferentForCompareKeyValueTimestampWithProducerRecord STARTED
org.apache.kafka.streams.test.OutputVerifierTest > shouldFailIfValueIsDifferentForCompareKeyValueTimestampWithProducerRecord PASSED
org.apache.kafka.streams.test.OutputVerifierTest > shouldNotAllowNullProducerRecordWithExpectedRecordForCompareValueTimestamp STARTED
org.apache.kafka.streams.test.OutputVerifierTest > shouldNotAllowNullProducerRecordWithExpectedRecordForCompareValueTimestamp PASSED
org.apache.kafka.streams.test.OutputVerifierTest > shouldNotAllowNullExpectedRecordForCompareValue STARTED
org.apache.kafka.streams.test.OutputVerifierTest > shouldNotAllowNullExpectedRecordForCompareValue PASSED
org.apache.kafka.streams.test.OutputVerifierTest > shouldFailIfValueIsDifferentWithNullReversForCompareKeyValueTimestampWithProducerRecord STARTED
org.apache.kafka.streams.test.OutputVerifierTest > shouldFailIfValueIsDifferentWithNullReversForCompareKeyValueTimestampWithProducerRecord PASSED
org.apache.kafka.streams.test.OutputVerifierTest > shouldNotAllowNullProducerRecordForCompareKeyValue STARTED
org.apache.kafka.streams.test.OutputVerifierTest > shouldNotAllowNullProducerRecordForCompareKeyValue PASSED
org.apache.kafka.streams.test.OutputVerifierTest > shouldFailIfValueIsDifferentWithNullReversForCompareKeyValueWithProducerRecord STARTED
org.apache.kafka.streams.test.OutputVerifierTest > shouldFailIfValueIsDifferentWithNullReversForCompareKeyValueWithProducerRecord PASSED
org.apache.kafka.streams.test.OutputVerifierTest > shouldPassIfKeyAndValueAndTimestampIsEqualForCompareKeyValueTimestamp STARTED
org.apache.kafka.streams.test.OutputVerifierTest > shouldPassIfKeyAndValueAndTimestampIsEqualForCompareKeyValueTimestamp PASSED
org.apache.kafka.streams.test.OutputVerifierTest > shouldFailIfValueIsDifferentWithNullForCompareKeyValueTimestampWithProducerRecord STARTED
org.apache.kafka.streams.test.OutputVerifierTest > shouldFailIfValueIsDifferentWithNullForCompareKeyValueTimestampWithProducerRecord PASSED
org.apache.kafka.streams.test.OutputVerifierTest > shouldFailIfKeyIsDifferentWithNullReversForCompareKeyValueWithProducerRecord STARTED
org.apache.kafka.streams.test.OutputVerifierTest > shouldFailIfKeyIsDifferentWithNullReversForCompareKeyValueWithProducerRecord PASSED
org.apache.kafka.streams.test.OutputVerifierTest > shouldPassIfKeyAndValueIsEqualWithNullForCompareKeyValueWithProducerRecord STARTED
org.apache.kafka.streams.test.OutputVerifierTest > shouldPassIfKeyAndValueIsEqualWithNullForCompareKeyValueWithProducerRecord PASSED
org.apache.kafka.streams.test.OutputVerifierTest > shouldFailIfKeyIsDifferentWithNullForCompareKeyValueTimestampWithProducerRecord STARTED
org.apache.kafka.streams.test.OutputVerifierTest > shouldFailIfKeyIsDifferentWithNullForCompareKeyValueTimestampWithProducerRecord PASSED
org.apache.kafka.streams.test.OutputVerifierTest > shouldFailIfValueIsDifferentForCompareKeyValueTimestamp STARTED
org.apache.kafka.streams.test.OutputVerifierTest > shouldFailIfValueIsDifferentForCompareKeyValueTimestamp PASSED
org.apache.kafka.streams.test.OutputVerifierTest > shouldPassIfValueAndTimestampIsEqualForCompareValueTimestampWithProducerRecord STARTED
org.apache.kafka.streams.test.OutputVerifierTest > shouldPassIfValueAndTimestampIsEqualForCompareValueTimestampWithProducerRecord PASSED
org.apache.kafka.streams.test.OutputVerifierTest > shouldFailIfValueIsDifferentWithNullReversForCompareKeyValueTimestamp STARTED
org.apache.kafka.streams.test.OutputVerifierTest > shouldFailIfValueIsDifferentWithNullReversForCompareKeyValueTimestamp PASSED
org.apache.kafka.streams.test.OutputVerifierTest > shouldFailIfValueIsDifferentWithNullReverseForCompareValueTimestampWithProducerRecord STARTED
org.apache.kafka.streams.test.OutputVerifierTest > shouldFailIfValueIsDifferentWithNullReverseForCompareValueTimestampWithProducerRecord PASSED
> Task :streams:examples:test
org.apache.kafka.streams.examples.wordcount.WordCountProcessorTest > test STARTED
org.apache.kafka.streams.examples.wordcount.WordCountProcessorTest > test PASSED
FAILURE: Build failed with an exception.
* What went wrong:
Execution failed for task ':connect:runtime:test'.
> Process 'Gradle Test Executor 17' finished with non-zero exit value 1
This problem might be caused by incorrect test process configuration.
Please refer to the test execution section in the User Manual at https://docs.gradle.org/5.4.1/userguide/java_testing.html#sec:test_execution
* Try:
Run with --stacktrace option to get the stack trace. Run with --info or --debug option to get more log output. Run with --scan to get full insights.
* Get more help at https://help.gradle.org
Deprecated Gradle features were used in this build, making it incompatible with Gradle 6.0.
Use '--warning-mode all' to show the individual deprecation warnings.
See https://docs.gradle.org/5.4.1/userguide/command_line_interface.html#sec:command_line_warnings
BUILD FAILED in 2h 39m 8s
178 actionable tasks: 152 executed, 26 up-to-date
Build step 'Execute shell' marked build as failure
Recording test results
ERROR: No tool found matching GRADLE_4_10_2_HOME
Setting GRADLE_4_10_3_HOME=/home/jenkins/tools/gradle/4.10.3
ERROR: No tool found matching GRADLE_4_10_2_HOME
Setting GRADLE_4_10_3_HOME=/home/jenkins/tools/gradle/4.10.3
Not sending mail to unregistered user noreply@github.com
Not sending mail to unregistered user wangguoz@gmail.com
Build failed in Jenkins: kafka-trunk-jdk11 #647
Posted by Apache Jenkins Server <je...@builds.apache.org>.
See <https://builds.apache.org/job/kafka-trunk-jdk11/647/display/redirect?page=changes>
Changes:
[wangguoz] KAFKA-8569: integrate warning message under static membership (#6972)
------------------------------------------
[...truncated 2.52 MB...]
org.apache.kafka.streams.test.OutputVerifierTest > shouldPassIfValueAndTimestampIsEqualWithNullForCompareValueTimestampWithProducerRecord PASSED
org.apache.kafka.streams.test.OutputVerifierTest > shouldFailIfValueIsDifferentWithNullForCompareKeyValue STARTED
org.apache.kafka.streams.test.OutputVerifierTest > shouldFailIfValueIsDifferentWithNullForCompareKeyValue PASSED
org.apache.kafka.streams.test.OutputVerifierTest > shouldFailIfKeyIsDifferentWithNullForCompareKeyValueTimestamp STARTED
org.apache.kafka.streams.test.OutputVerifierTest > shouldFailIfKeyIsDifferentWithNullForCompareKeyValueTimestamp PASSED
org.apache.kafka.streams.test.OutputVerifierTest > shouldFailIfKeyIsDifferentForCompareKeyValueWithProducerRecord STARTED
org.apache.kafka.streams.test.OutputVerifierTest > shouldFailIfKeyIsDifferentForCompareKeyValueWithProducerRecord PASSED
org.apache.kafka.streams.test.OutputVerifierTest > shouldFailIfValueIsDifferentWithNullForCompareKeyValueTimestamp STARTED
org.apache.kafka.streams.test.OutputVerifierTest > shouldFailIfValueIsDifferentWithNullForCompareKeyValueTimestamp PASSED
org.apache.kafka.streams.test.OutputVerifierTest > shouldFailIfTimestampIsDifferentForCompareValueTimestampWithProducerRecord STARTED
org.apache.kafka.streams.test.OutputVerifierTest > shouldFailIfTimestampIsDifferentForCompareValueTimestampWithProducerRecord PASSED
org.apache.kafka.streams.test.OutputVerifierTest > shouldPassIfKeyAndValueIsEqualForCompareKeyValue STARTED
org.apache.kafka.streams.test.OutputVerifierTest > shouldPassIfKeyAndValueIsEqualForCompareKeyValue PASSED
org.apache.kafka.streams.test.OutputVerifierTest > shouldNotAllowNullProducerRecordForCompareKeyValueTimestamp STARTED
org.apache.kafka.streams.test.OutputVerifierTest > shouldNotAllowNullProducerRecordForCompareKeyValueTimestamp PASSED
org.apache.kafka.streams.test.OutputVerifierTest > shouldPassIfKeyAndValueIsEqualWithNullForCompareKeyValueTimestamp STARTED
org.apache.kafka.streams.test.OutputVerifierTest > shouldPassIfKeyAndValueIsEqualWithNullForCompareKeyValueTimestamp PASSED
org.apache.kafka.streams.test.OutputVerifierTest > shouldPassIfValueAndTimestampIsEqualForCompareValueTimestamp STARTED
org.apache.kafka.streams.test.OutputVerifierTest > shouldPassIfValueAndTimestampIsEqualForCompareValueTimestamp PASSED
org.apache.kafka.streams.test.OutputVerifierTest > shouldNotAllowNullExpectedRecordForCompareKeyValue STARTED
org.apache.kafka.streams.test.OutputVerifierTest > shouldNotAllowNullExpectedRecordForCompareKeyValue PASSED
org.apache.kafka.streams.test.OutputVerifierTest > shouldFailIfValueIsDifferentForCompareValueTimestampWithProducerRecord STARTED
org.apache.kafka.streams.test.OutputVerifierTest > shouldFailIfValueIsDifferentForCompareValueTimestampWithProducerRecord PASSED
org.apache.kafka.streams.test.OutputVerifierTest > shouldFailIfValueIsDifferentWithNullReversForCompareKeyValue STARTED
org.apache.kafka.streams.test.OutputVerifierTest > shouldFailIfValueIsDifferentWithNullReversForCompareKeyValue PASSED
org.apache.kafka.streams.test.OutputVerifierTest > shouldNotAllowNullExpectedRecordForCompareKeyValueTimestamp STARTED
org.apache.kafka.streams.test.OutputVerifierTest > shouldNotAllowNullExpectedRecordForCompareKeyValueTimestamp PASSED
org.apache.kafka.streams.test.OutputVerifierTest > shouldFailIfValueIsDifferentForCompareValueWithProducerRecord STARTED
org.apache.kafka.streams.test.OutputVerifierTest > shouldFailIfValueIsDifferentForCompareValueWithProducerRecord PASSED
org.apache.kafka.streams.test.OutputVerifierTest > shouldPassIfValueIsEqualForCompareValue STARTED
org.apache.kafka.streams.test.OutputVerifierTest > shouldPassIfValueIsEqualForCompareValue PASSED
org.apache.kafka.streams.test.OutputVerifierTest > shouldNotAllowNullProducerRecordWithExpectedRecordForCompareKeyValueTimestamp STARTED
org.apache.kafka.streams.test.OutputVerifierTest > shouldNotAllowNullProducerRecordWithExpectedRecordForCompareKeyValueTimestamp PASSED
org.apache.kafka.streams.test.OutputVerifierTest > shouldFailIfKeyIsDifferentForCompareKeyValue STARTED
org.apache.kafka.streams.test.OutputVerifierTest > shouldFailIfKeyIsDifferentForCompareKeyValue PASSED
org.apache.kafka.streams.test.OutputVerifierTest > shouldNotAllowNullProducerRecordWithExpectedRecordForCompareKeyValue STARTED
org.apache.kafka.streams.test.OutputVerifierTest > shouldNotAllowNullProducerRecordWithExpectedRecordForCompareKeyValue PASSED
org.apache.kafka.streams.test.OutputVerifierTest > shouldFailIfKeyIsDifferentWithNullForCompareKeyValueWithProducerRecord STARTED
org.apache.kafka.streams.test.OutputVerifierTest > shouldFailIfKeyIsDifferentWithNullForCompareKeyValueWithProducerRecord PASSED
org.apache.kafka.streams.test.OutputVerifierTest > shouldPassIfKeyAndValueAndTimestampIsEqualForCompareKeyValueTimestampWithProducerRecord STARTED
org.apache.kafka.streams.test.OutputVerifierTest > shouldPassIfKeyAndValueAndTimestampIsEqualForCompareKeyValueTimestampWithProducerRecord PASSED
org.apache.kafka.streams.test.OutputVerifierTest > shouldPassIfValueIsEqualWithNullForCompareValue STARTED
org.apache.kafka.streams.test.OutputVerifierTest > shouldPassIfValueIsEqualWithNullForCompareValue PASSED
org.apache.kafka.streams.test.OutputVerifierTest > shouldPassIfValueAndTimestampIsEqualWithNullForCompareValueTimestamp STARTED
org.apache.kafka.streams.test.OutputVerifierTest > shouldPassIfValueAndTimestampIsEqualWithNullForCompareValueTimestamp PASSED
org.apache.kafka.streams.test.OutputVerifierTest > shouldFailIfValueIsDifferentWithNullForCompareValueTimestampWithProducerRecord STARTED
org.apache.kafka.streams.test.OutputVerifierTest > shouldFailIfValueIsDifferentWithNullForCompareValueTimestampWithProducerRecord PASSED
org.apache.kafka.streams.test.OutputVerifierTest > shouldFailIfValueIsDifferentWithNullForCompareValueWithProducerRecord STARTED
org.apache.kafka.streams.test.OutputVerifierTest > shouldFailIfValueIsDifferentWithNullForCompareValueWithProducerRecord PASSED
org.apache.kafka.streams.test.OutputVerifierTest > shouldFailIfKeyIsDifferentWithNullReversForCompareKeyValueTimestampWithProducerRecord STARTED
org.apache.kafka.streams.test.OutputVerifierTest > shouldFailIfKeyIsDifferentWithNullReversForCompareKeyValueTimestampWithProducerRecord PASSED
org.apache.kafka.streams.test.OutputVerifierTest > shouldFailIfKeyIsDifferentWithNullReversForCompareKeyValue STARTED
org.apache.kafka.streams.test.OutputVerifierTest > shouldFailIfKeyIsDifferentWithNullReversForCompareKeyValue PASSED
org.apache.kafka.streams.test.OutputVerifierTest > shouldPassIfKeyAndValueIsEqualForCompareKeyValueWithProducerRecord STARTED
org.apache.kafka.streams.test.OutputVerifierTest > shouldPassIfKeyAndValueIsEqualForCompareKeyValueWithProducerRecord PASSED
org.apache.kafka.streams.test.OutputVerifierTest > shouldFailIfValueIsDifferentForCompareKeyValueWithProducerRecord STARTED
org.apache.kafka.streams.test.OutputVerifierTest > shouldFailIfValueIsDifferentForCompareKeyValueWithProducerRecord PASSED
org.apache.kafka.streams.test.OutputVerifierTest > shouldFailIfValueIsDifferentForCompareValueTimestamp STARTED
org.apache.kafka.streams.test.OutputVerifierTest > shouldFailIfValueIsDifferentForCompareValueTimestamp PASSED
org.apache.kafka.streams.test.OutputVerifierTest > shouldNotAllowNullProducerRecordForCompareValue STARTED
org.apache.kafka.streams.test.OutputVerifierTest > shouldNotAllowNullProducerRecordForCompareValue PASSED
org.apache.kafka.streams.test.OutputVerifierTest > shouldFailIfValueIsDifferentWithNullForCompareValueTimestamp STARTED
org.apache.kafka.streams.test.OutputVerifierTest > shouldFailIfValueIsDifferentWithNullForCompareValueTimestamp PASSED
org.apache.kafka.streams.test.OutputVerifierTest > shouldFailIfKeyIsDifferentForCompareKeyValueTimestamp STARTED
org.apache.kafka.streams.test.OutputVerifierTest > shouldFailIfKeyIsDifferentForCompareKeyValueTimestamp PASSED
org.apache.kafka.streams.test.OutputVerifierTest > shouldFailIfKeyIsDifferentForCompareKeyValueTimestampWithProducerRecord STARTED
org.apache.kafka.streams.test.OutputVerifierTest > shouldFailIfKeyIsDifferentForCompareKeyValueTimestampWithProducerRecord PASSED
org.apache.kafka.streams.test.OutputVerifierTest > shouldPassIfValueIsEqualWithNullForCompareValueWithProducerRecord STARTED
org.apache.kafka.streams.test.OutputVerifierTest > shouldPassIfValueIsEqualWithNullForCompareValueWithProducerRecord PASSED
org.apache.kafka.streams.test.OutputVerifierTest > shouldFailIfValueIsDifferentWithNullReverseForCompareValueTimestamp STARTED
org.apache.kafka.streams.test.OutputVerifierTest > shouldFailIfValueIsDifferentWithNullReverseForCompareValueTimestamp PASSED
org.apache.kafka.streams.test.OutputVerifierTest > shouldFailIfValueIsDifferentWithNullReverseForCompareValue STARTED
org.apache.kafka.streams.test.OutputVerifierTest > shouldFailIfValueIsDifferentWithNullReverseForCompareValue PASSED
org.apache.kafka.streams.test.OutputVerifierTest > shouldFailIfTimestampIsDifferentForCompareValueTimestamp STARTED
org.apache.kafka.streams.test.OutputVerifierTest > shouldFailIfTimestampIsDifferentForCompareValueTimestamp PASSED
org.apache.kafka.streams.test.OutputVerifierTest > shouldPassIfKeyAndValueAndTimestampIsEqualWithNullForCompareKeyValueTimestampWithProducerRecord STARTED
org.apache.kafka.streams.test.OutputVerifierTest > shouldPassIfKeyAndValueAndTimestampIsEqualWithNullForCompareKeyValueTimestampWithProducerRecord PASSED
org.apache.kafka.streams.test.OutputVerifierTest > shouldFailIfValueIsDifferentWithNullForCompareKeyValueWithProducerRecord STARTED
org.apache.kafka.streams.test.OutputVerifierTest > shouldFailIfValueIsDifferentWithNullForCompareKeyValueWithProducerRecord PASSED
org.apache.kafka.streams.test.OutputVerifierTest > shouldFailIfValueIsDifferentForCompareKeyValueTimestampWithProducerRecord STARTED
org.apache.kafka.streams.test.OutputVerifierTest > shouldFailIfValueIsDifferentForCompareKeyValueTimestampWithProducerRecord PASSED
org.apache.kafka.streams.test.OutputVerifierTest > shouldNotAllowNullProducerRecordWithExpectedRecordForCompareValueTimestamp STARTED
org.apache.kafka.streams.test.OutputVerifierTest > shouldNotAllowNullProducerRecordWithExpectedRecordForCompareValueTimestamp PASSED
org.apache.kafka.streams.test.OutputVerifierTest > shouldNotAllowNullExpectedRecordForCompareValue STARTED
org.apache.kafka.streams.test.OutputVerifierTest > shouldNotAllowNullExpectedRecordForCompareValue PASSED
org.apache.kafka.streams.test.OutputVerifierTest > shouldFailIfValueIsDifferentWithNullReversForCompareKeyValueTimestampWithProducerRecord STARTED
org.apache.kafka.streams.test.OutputVerifierTest > shouldFailIfValueIsDifferentWithNullReversForCompareKeyValueTimestampWithProducerRecord PASSED
org.apache.kafka.streams.test.OutputVerifierTest > shouldNotAllowNullProducerRecordForCompareKeyValue STARTED
org.apache.kafka.streams.test.OutputVerifierTest > shouldNotAllowNullProducerRecordForCompareKeyValue PASSED
org.apache.kafka.streams.test.OutputVerifierTest > shouldFailIfValueIsDifferentWithNullReversForCompareKeyValueWithProducerRecord STARTED
org.apache.kafka.streams.test.OutputVerifierTest > shouldFailIfValueIsDifferentWithNullReversForCompareKeyValueWithProducerRecord PASSED
org.apache.kafka.streams.test.OutputVerifierTest > shouldPassIfKeyAndValueAndTimestampIsEqualForCompareKeyValueTimestamp STARTED
org.apache.kafka.streams.test.OutputVerifierTest > shouldPassIfKeyAndValueAndTimestampIsEqualForCompareKeyValueTimestamp PASSED
org.apache.kafka.streams.test.OutputVerifierTest > shouldFailIfValueIsDifferentWithNullForCompareKeyValueTimestampWithProducerRecord STARTED
org.apache.kafka.streams.test.OutputVerifierTest > shouldFailIfValueIsDifferentWithNullForCompareKeyValueTimestampWithProducerRecord PASSED
org.apache.kafka.streams.test.OutputVerifierTest > shouldFailIfKeyIsDifferentWithNullReversForCompareKeyValueWithProducerRecord STARTED
org.apache.kafka.streams.test.OutputVerifierTest > shouldFailIfKeyIsDifferentWithNullReversForCompareKeyValueWithProducerRecord PASSED
org.apache.kafka.streams.test.OutputVerifierTest > shouldPassIfKeyAndValueIsEqualWithNullForCompareKeyValueWithProducerRecord STARTED
org.apache.kafka.streams.test.OutputVerifierTest > shouldPassIfKeyAndValueIsEqualWithNullForCompareKeyValueWithProducerRecord PASSED
org.apache.kafka.streams.test.OutputVerifierTest > shouldFailIfKeyIsDifferentWithNullForCompareKeyValueTimestampWithProducerRecord STARTED
org.apache.kafka.streams.test.OutputVerifierTest > shouldFailIfKeyIsDifferentWithNullForCompareKeyValueTimestampWithProducerRecord PASSED
org.apache.kafka.streams.test.OutputVerifierTest > shouldFailIfValueIsDifferentForCompareKeyValueTimestamp STARTED
org.apache.kafka.streams.test.OutputVerifierTest > shouldFailIfValueIsDifferentForCompareKeyValueTimestamp PASSED
org.apache.kafka.streams.test.OutputVerifierTest > shouldPassIfValueAndTimestampIsEqualForCompareValueTimestampWithProducerRecord STARTED
org.apache.kafka.streams.test.OutputVerifierTest > shouldPassIfValueAndTimestampIsEqualForCompareValueTimestampWithProducerRecord PASSED
org.apache.kafka.streams.test.OutputVerifierTest > shouldFailIfValueIsDifferentWithNullReversForCompareKeyValueTimestamp STARTED
org.apache.kafka.streams.test.OutputVerifierTest > shouldFailIfValueIsDifferentWithNullReversForCompareKeyValueTimestamp PASSED
org.apache.kafka.streams.test.OutputVerifierTest > shouldFailIfValueIsDifferentWithNullReverseForCompareValueTimestampWithProducerRecord STARTED
org.apache.kafka.streams.test.OutputVerifierTest > shouldFailIfValueIsDifferentWithNullReverseForCompareValueTimestampWithProducerRecord PASSED
> Task :streams:examples:test
org.apache.kafka.streams.examples.wordcount.WordCountProcessorTest > test STARTED
org.apache.kafka.streams.examples.wordcount.WordCountProcessorTest > test PASSED
FAILURE: Build failed with an exception.
* What went wrong:
Execution failed for task ':connect:runtime:test'.
> There were failing tests. See the report at: file://<https://builds.apache.org/job/kafka-trunk-jdk11/ws/connect/runtime/build/reports/tests/test/index.html>
* Try:
Run with --stacktrace option to get the stack trace. Run with --info or --debug option to get more log output. Run with --scan to get full insights.
* Get more help at https://help.gradle.org
Deprecated Gradle features were used in this build, making it incompatible with Gradle 6.0.
Use '--warning-mode all' to show the individual deprecation warnings.
See https://docs.gradle.org/5.4.1/userguide/command_line_interface.html#sec:command_line_warnings
BUILD FAILED in 2h 48m 12s
178 actionable tasks: 152 executed, 26 up-to-date
Build step 'Execute shell' marked build as failure
Recording test results
ERROR: No tool found matching GRADLE_4_10_2_HOME
Setting GRADLE_4_10_3_HOME=/home/jenkins/tools/gradle/4.10.3
ERROR: No tool found matching GRADLE_4_10_2_HOME
Setting GRADLE_4_10_3_HOME=/home/jenkins/tools/gradle/4.10.3
Not sending mail to unregistered user wangguoz@gmail.com
Build failed in Jenkins: kafka-trunk-jdk11 #646
Posted by Apache Jenkins Server <je...@builds.apache.org>.
See <https://builds.apache.org/job/kafka-trunk-jdk11/646/display/redirect?page=changes>
Changes:
[jason] MINOR: Fix Partition::toString method (#6971)
------------------------------------------
[...truncated 2.43 MB...]
org.apache.kafka.streams.scala.kstream.SuppressedTest > Suppressed.untilWindowCloses should produce the correct suppression STARTED
org.apache.kafka.streams.scala.kstream.SuppressedTest > Suppressed.untilWindowCloses should produce the correct suppression PASSED
org.apache.kafka.streams.scala.kstream.SuppressedTest > Suppressed.untilTimeLimit should produce the correct suppression STARTED
org.apache.kafka.streams.scala.kstream.SuppressedTest > Suppressed.untilTimeLimit should produce the correct suppression PASSED
org.apache.kafka.streams.scala.kstream.SuppressedTest > BufferConfig.maxRecords should produce the correct buffer config STARTED
org.apache.kafka.streams.scala.kstream.SuppressedTest > BufferConfig.maxRecords should produce the correct buffer config PASSED
org.apache.kafka.streams.scala.kstream.SuppressedTest > BufferConfig.maxBytes should produce the correct buffer config STARTED
org.apache.kafka.streams.scala.kstream.SuppressedTest > BufferConfig.maxBytes should produce the correct buffer config PASSED
org.apache.kafka.streams.scala.kstream.SuppressedTest > BufferConfig.unbounded should produce the correct buffer config STARTED
org.apache.kafka.streams.scala.kstream.SuppressedTest > BufferConfig.unbounded should produce the correct buffer config PASSED
org.apache.kafka.streams.scala.kstream.SuppressedTest > BufferConfig should support very long chains of factory methods STARTED
org.apache.kafka.streams.scala.kstream.SuppressedTest > BufferConfig should support very long chains of factory methods PASSED
org.apache.kafka.streams.scala.kstream.ConsumedTest > Create a Consumed should create a Consumed with Serdes STARTED
org.apache.kafka.streams.scala.kstream.ConsumedTest > Create a Consumed should create a Consumed with Serdes PASSED
org.apache.kafka.streams.scala.kstream.ConsumedTest > Create a Consumed with timestampExtractor and resetPolicy should create a Consumed with Serdes, timestampExtractor and resetPolicy STARTED
org.apache.kafka.streams.scala.kstream.ConsumedTest > Create a Consumed with timestampExtractor and resetPolicy should create a Consumed with Serdes, timestampExtractor and resetPolicy PASSED
org.apache.kafka.streams.scala.kstream.ConsumedTest > Create a Consumed with timestampExtractor should create a Consumed with Serdes and timestampExtractor STARTED
org.apache.kafka.streams.scala.kstream.ConsumedTest > Create a Consumed with timestampExtractor should create a Consumed with Serdes and timestampExtractor PASSED
org.apache.kafka.streams.scala.kstream.ConsumedTest > Create a Consumed with resetPolicy should create a Consumed with Serdes and resetPolicy STARTED
org.apache.kafka.streams.scala.kstream.ConsumedTest > Create a Consumed with resetPolicy should create a Consumed with Serdes and resetPolicy PASSED
org.apache.kafka.streams.scala.kstream.ProducedTest > Create a Produced should create a Produced with Serdes STARTED
org.apache.kafka.streams.scala.kstream.ProducedTest > Create a Produced should create a Produced with Serdes PASSED
org.apache.kafka.streams.scala.kstream.ProducedTest > Create a Produced with timestampExtractor and resetPolicy should create a Consumed with Serdes, timestampExtractor and resetPolicy STARTED
org.apache.kafka.streams.scala.kstream.ProducedTest > Create a Produced with timestampExtractor and resetPolicy should create a Consumed with Serdes, timestampExtractor and resetPolicy PASSED
org.apache.kafka.streams.scala.kstream.GroupedTest > Create a Grouped should create a Grouped with Serdes STARTED
org.apache.kafka.streams.scala.kstream.GroupedTest > Create a Grouped should create a Grouped with Serdes PASSED
org.apache.kafka.streams.scala.kstream.GroupedTest > Create a Grouped with repartition topic name should create a Grouped with Serdes, and repartition topic name STARTED
org.apache.kafka.streams.scala.kstream.GroupedTest > Create a Grouped with repartition topic name should create a Grouped with Serdes, and repartition topic name PASSED
org.apache.kafka.streams.scala.kstream.JoinedTest > Create a Joined should create a Joined with Serdes STARTED
org.apache.kafka.streams.scala.kstream.JoinedTest > Create a Joined should create a Joined with Serdes PASSED
org.apache.kafka.streams.scala.kstream.JoinedTest > Create a Joined should create a Joined with Serdes and repartition topic name STARTED
org.apache.kafka.streams.scala.kstream.JoinedTest > Create a Joined should create a Joined with Serdes and repartition topic name PASSED
org.apache.kafka.streams.scala.kstream.KTableTest > filter a KTable should filter records satisfying the predicate STARTED
org.apache.kafka.streams.scala.kstream.KTableTest > filter a KTable should filter records satisfying the predicate PASSED
org.apache.kafka.streams.scala.kstream.KTableTest > filterNot a KTable should filter records not satisfying the predicate STARTED
org.apache.kafka.streams.scala.kstream.KTableTest > filterNot a KTable should filter records not satisfying the predicate PASSED
org.apache.kafka.streams.scala.kstream.KTableTest > join 2 KTables should join correctly records STARTED
org.apache.kafka.streams.scala.kstream.KTableTest > join 2 KTables should join correctly records PASSED
org.apache.kafka.streams.scala.kstream.KTableTest > join 2 KTables with a Materialized should join correctly records and state store STARTED
org.apache.kafka.streams.scala.kstream.KTableTest > join 2 KTables with a Materialized should join correctly records and state store PASSED
org.apache.kafka.streams.scala.kstream.KTableTest > windowed KTable#suppress should correctly suppress results using Suppressed.untilTimeLimit STARTED
org.apache.kafka.streams.scala.kstream.KTableTest > windowed KTable#suppress should correctly suppress results using Suppressed.untilTimeLimit PASSED
org.apache.kafka.streams.scala.kstream.KTableTest > windowed KTable#suppress should correctly suppress results using Suppressed.untilWindowCloses STARTED
org.apache.kafka.streams.scala.kstream.KTableTest > windowed KTable#suppress should correctly suppress results using Suppressed.untilWindowCloses PASSED
org.apache.kafka.streams.scala.kstream.KTableTest > session windowed KTable#suppress should correctly suppress results using Suppressed.untilWindowCloses STARTED
org.apache.kafka.streams.scala.kstream.KTableTest > session windowed KTable#suppress should correctly suppress results using Suppressed.untilWindowCloses PASSED
org.apache.kafka.streams.scala.kstream.KTableTest > non-windowed KTable#suppress should correctly suppress results using Suppressed.untilTimeLimit STARTED
org.apache.kafka.streams.scala.kstream.KTableTest > non-windowed KTable#suppress should correctly suppress results using Suppressed.untilTimeLimit PASSED
org.apache.kafka.streams.scala.kstream.MaterializedTest > Create a Materialized should create a Materialized with Serdes STARTED
org.apache.kafka.streams.scala.kstream.MaterializedTest > Create a Materialized should create a Materialized with Serdes PASSED
org.apache.kafka.streams.scala.kstream.MaterializedTest > Create a Materialize with a store name should create a Materialized with Serdes and a store name STARTED
org.apache.kafka.streams.scala.kstream.MaterializedTest > Create a Materialize with a store name should create a Materialized with Serdes and a store name PASSED
org.apache.kafka.streams.scala.kstream.MaterializedTest > Create a Materialize with a window store supplier should create a Materialized with Serdes and a store supplier STARTED
org.apache.kafka.streams.scala.kstream.MaterializedTest > Create a Materialize with a window store supplier should create a Materialized with Serdes and a store supplier PASSED
org.apache.kafka.streams.scala.kstream.MaterializedTest > Create a Materialize with a key value store supplier should create a Materialized with Serdes and a store supplier STARTED
org.apache.kafka.streams.scala.kstream.MaterializedTest > Create a Materialize with a key value store supplier should create a Materialized with Serdes and a store supplier PASSED
org.apache.kafka.streams.scala.kstream.MaterializedTest > Create a Materialize with a session store supplier should create a Materialized with Serdes and a store supplier STARTED
org.apache.kafka.streams.scala.kstream.MaterializedTest > Create a Materialize with a session store supplier should create a Materialized with Serdes and a store supplier PASSED
org.apache.kafka.streams.scala.kstream.KStreamTest > filter a KStream should filter records satisfying the predicate STARTED
org.apache.kafka.streams.scala.kstream.KStreamTest > filter a KStream should filter records satisfying the predicate PASSED
org.apache.kafka.streams.scala.kstream.KStreamTest > filterNot a KStream should filter records not satisfying the predicate STARTED
org.apache.kafka.streams.scala.kstream.KStreamTest > filterNot a KStream should filter records not satisfying the predicate PASSED
org.apache.kafka.streams.scala.kstream.KStreamTest > foreach a KStream should run foreach actions on records STARTED
org.apache.kafka.streams.scala.kstream.KStreamTest > foreach a KStream should run foreach actions on records PASSED
org.apache.kafka.streams.scala.kstream.KStreamTest > peek a KStream should run peek actions on records STARTED
org.apache.kafka.streams.scala.kstream.KStreamTest > peek a KStream should run peek actions on records PASSED
org.apache.kafka.streams.scala.kstream.KStreamTest > selectKey a KStream should select a new key STARTED
org.apache.kafka.streams.scala.kstream.KStreamTest > selectKey a KStream should select a new key PASSED
org.apache.kafka.streams.scala.kstream.KStreamTest > join 2 KStreams should join correctly records STARTED
org.apache.kafka.streams.scala.kstream.KStreamTest > join 2 KStreams should join correctly records PASSED
org.apache.kafka.streams.scala.WordCountTest > testShouldCountWordsMaterialized STARTED
org.apache.kafka.streams.scala.WordCountTest > testShouldCountWordsMaterialized PASSED
org.apache.kafka.streams.scala.WordCountTest > testShouldCountWordsJava STARTED
org.apache.kafka.streams.scala.WordCountTest > testShouldCountWordsJava PASSED
org.apache.kafka.streams.scala.WordCountTest > testShouldCountWords STARTED
org.apache.kafka.streams.scala.WordCountTest > testShouldCountWords PASSED
org.apache.kafka.streams.scala.TopologyTest > shouldBuildIdenticalTopologyInJavaNScalaJoin STARTED
org.apache.kafka.streams.scala.TopologyTest > shouldBuildIdenticalTopologyInJavaNScalaJoin PASSED
org.apache.kafka.streams.scala.TopologyTest > shouldBuildIdenticalTopologyInJavaNScalaSimple STARTED
org.apache.kafka.streams.scala.TopologyTest > shouldBuildIdenticalTopologyInJavaNScalaSimple PASSED
org.apache.kafka.streams.scala.TopologyTest > shouldBuildIdenticalTopologyInJavaNScalaAggregate STARTED
org.apache.kafka.streams.scala.TopologyTest > shouldBuildIdenticalTopologyInJavaNScalaAggregate PASSED
org.apache.kafka.streams.scala.TopologyTest > shouldBuildIdenticalTopologyInJavaNScalaProperties STARTED
org.apache.kafka.streams.scala.TopologyTest > shouldBuildIdenticalTopologyInJavaNScalaProperties PASSED
org.apache.kafka.streams.scala.TopologyTest > shouldBuildIdenticalTopologyInJavaNScalaTransform STARTED
org.apache.kafka.streams.scala.TopologyTest > shouldBuildIdenticalTopologyInJavaNScalaTransform PASSED
> Task :connect:runtime:test
org.apache.kafka.connect.integration.ConnectorCientPolicyIntegrationTest > testCreateWithNotAllowedOverridesForPrincipalPolicy STARTED
org.apache.kafka.connect.integration.ConnectorCientPolicyIntegrationTest > testCreateWithNotAllowedOverridesForPrincipalPolicy PASSED
org.apache.kafka.connect.integration.ConnectorCientPolicyIntegrationTest > testCreateWithAllowedOverridesForAllPolicy STARTED
org.apache.kafka.connect.integration.ConnectorCientPolicyIntegrationTest > testCreateWithAllowedOverridesForAllPolicy PASSED
org.apache.kafka.connect.integration.ConnectorCientPolicyIntegrationTest > testCreateWithAllowedOverridesForPrincipalPolicy STARTED
org.apache.kafka.connect.integration.ConnectorCientPolicyIntegrationTest > testCreateWithAllowedOverridesForPrincipalPolicy PASSED
org.apache.kafka.connect.integration.ConnectorCientPolicyIntegrationTest > testCreateWithOverridesForNonePolicy STARTED
org.apache.kafka.connect.integration.ConnectorCientPolicyIntegrationTest > testCreateWithOverridesForNonePolicy PASSED
org.apache.kafka.connect.integration.RestExtensionIntegrationTest > testImmediateRequestForListOfConnectors STARTED
org.apache.kafka.connect.integration.RestExtensionIntegrationTest > testImmediateRequestForListOfConnectors PASSED
org.apache.kafka.connect.integration.RebalanceSourceConnectorsIntegrationTest > testStartTwoConnectors STARTED
org.apache.kafka.connect.integration.RebalanceSourceConnectorsIntegrationTest > testStartTwoConnectors PASSED
org.apache.kafka.connect.integration.RebalanceSourceConnectorsIntegrationTest > testDeleteConnector STARTED
org.apache.kafka.connect.integration.RebalanceSourceConnectorsIntegrationTest > testDeleteConnector PASSED
org.apache.kafka.connect.integration.RebalanceSourceConnectorsIntegrationTest > testAddingWorker STARTED
org.apache.kafka.connect.integration.RebalanceSourceConnectorsIntegrationTest > testAddingWorker PASSED
org.apache.kafka.connect.integration.RebalanceSourceConnectorsIntegrationTest > testRemovingWorker STARTED
org.apache.kafka.connect.integration.RebalanceSourceConnectorsIntegrationTest > testRemovingWorker PASSED
org.apache.kafka.connect.integration.RebalanceSourceConnectorsIntegrationTest > testReconfigConnector STARTED
org.apache.kafka.connect.integration.RebalanceSourceConnectorsIntegrationTest > testReconfigConnector PASSED
org.apache.kafka.connect.integration.ExampleConnectIntegrationTest > testSourceConnector STARTED
org.apache.kafka.connect.integration.ExampleConnectIntegrationTest > testSourceConnector PASSED
org.apache.kafka.connect.integration.ExampleConnectIntegrationTest > testSinkConnector STARTED
org.apache.kafka.connect.integration.ExampleConnectIntegrationTest > testSinkConnector SKIPPED
> Task :connect:runtime:test FAILED
FAILURE: Build failed with an exception.
* What went wrong:
Execution failed for task ':connect:runtime:test'.
> Process 'Gradle Test Executor 22' finished with non-zero exit value 1
This problem might be caused by incorrect test process configuration.
Please refer to the test execution section in the User Manual at https://docs.gradle.org/5.4.1/userguide/java_testing.html#sec:test_execution
* Try:
Run with --stacktrace option to get the stack trace. Run with --info or --debug option to get more log output. Run with --scan to get full insights.
* Get more help at https://help.gradle.org
Deprecated Gradle features were used in this build, making it incompatible with Gradle 6.0.
Use '--warning-mode all' to show the individual deprecation warnings.
See https://docs.gradle.org/5.4.1/userguide/command_line_interface.html#sec:command_line_warnings
BUILD FAILED in 2h 47m 37s
178 actionable tasks: 152 executed, 26 up-to-date
Build step 'Execute shell' marked build as failure
Recording test results
ERROR: No tool found matching GRADLE_4_10_2_HOME
Setting GRADLE_4_10_3_HOME=/home/jenkins/tools/gradle/4.10.3
ERROR: No tool found matching GRADLE_4_10_2_HOME
Setting GRADLE_4_10_3_HOME=/home/jenkins/tools/gradle/4.10.3