You are viewing a plain text version of this content. The canonical link for it is here.
Posted to dev@creadur.apache.org by Apache Jenkins Server <je...@builds.apache.org> on 2017/10/09 23:01:56 UTC

Build failed in Jenkins: Creadur-Rat-ParentPom #188

See <https://builds.apache.org/job/Creadur-Rat-ParentPom/188/display/redirect>

------------------------------------------
[...truncated 117.13 KB...]
AU        apache-rat-plugin/src/test/resources/unit/it3/src.apt
A         apache-rat-plugin/src/test/java
A         apache-rat-plugin/src/test/java/org
A         apache-rat-plugin/src/test/java/org/apache
A         apache-rat-plugin/src/test/java/org/apache/rat
A         apache-rat-plugin/src/test/java/org/apache/rat/mp
AU        apache-rat-plugin/src/test/java/org/apache/rat/mp/RatCheckMojoTest.java
A         apache-rat-plugin/src/test/java/org/apache/rat/mp/RatTestHelpers.java
A         apache-rat-plugin/src/test/java/org/apache/rat/mp/util
A         apache-rat-plugin/src/test/java/org/apache/rat/mp/util/ExclusionHelperTest.java
A         apache-rat-plugin/src/test/java/org/apache/rat/mp/util/ScmIgnoreParserTest.java
A         apache-rat-plugin/src/main
A         apache-rat-plugin/src/main/filtered-resources
A         apache-rat-plugin/src/main/filtered-resources/org
A         apache-rat-plugin/src/main/filtered-resources/org/apache
A         apache-rat-plugin/src/main/filtered-resources/org/apache/rat
A         apache-rat-plugin/src/main/filtered-resources/org/apache/rat/mp
AU        apache-rat-plugin/src/main/filtered-resources/org/apache/rat/mp/rat-report.properties
A         apache-rat-plugin/src/main/resources
A         apache-rat-plugin/src/main/resources/org
A         apache-rat-plugin/src/main/resources/org/apache
A         apache-rat-plugin/src/main/resources/org/apache/rat
A         apache-rat-plugin/src/main/resources/org/apache/rat/mp
AU        apache-rat-plugin/src/main/resources/org/apache/rat/mp/package.html
A         apache-rat-plugin/src/main/java
A         apache-rat-plugin/src/main/java/org
A         apache-rat-plugin/src/main/java/org/apache
A         apache-rat-plugin/src/main/java/org/apache/rat
A         apache-rat-plugin/src/main/java/org/apache/rat/mp
AU        apache-rat-plugin/src/main/java/org/apache/rat/mp/FilesReportable.java
AU        apache-rat-plugin/src/main/java/org/apache/rat/mp/RatCheckException.java
AU        apache-rat-plugin/src/main/java/org/apache/rat/mp/LicenseFamilySpecification.java
AU        apache-rat-plugin/src/main/java/org/apache/rat/mp/RatReportMojo.java
AU        apache-rat-plugin/src/main/java/org/apache/rat/mp/RatCheckMojo.java
AU        apache-rat-plugin/src/main/java/org/apache/rat/mp/HeaderMatcherSpecification.java
A         apache-rat-plugin/src/main/java/org/apache/rat/mp/util
A         apache-rat-plugin/src/main/java/org/apache/rat/mp/util/ScmIgnoreParser.java
A         apache-rat-plugin/src/main/java/org/apache/rat/mp/util/ConfigurationHelper.java
A         apache-rat-plugin/src/main/java/org/apache/rat/mp/util/ExclusionHelper.java
AU        apache-rat-plugin/src/main/java/org/apache/rat/mp/AbstractRatMojo.java
A         apache-rat-plugin/src/site
AU        apache-rat-plugin/src/site/site.xml
A         apache-rat-plugin/src/site/apt
AU        apache-rat-plugin/src/site/apt/usage.apt.vm
AU        apache-rat-plugin/src/site/apt/index.apt
A         apache-rat-plugin/src/site/apt/examples
AU        apache-rat-plugin/src/site/apt/examples/site.apt.vm
AU        apache-rat-plugin/src/site/apt/examples/verify.apt.vm
AU        apache-rat-plugin/src/site/apt/examples/custom-license.apt.vm
AU        apache-rat-plugin/src/site/apt/examples/basic.apt.vm
A         apache-rat-plugin/src/site/resources
A         apache-rat-plugin/src/site/resources/css
AU        apache-rat-plugin/src/site/resources/css/site.css
A         apache-rat-plugin/src/site/fml
AU        apache-rat-plugin/src/site/fml/faq.fml
A         apache-rat-plugin/src/changes
AU        apache-rat-plugin/src/changes/changes.xml
A         apache-rat-plugin/src/it
A         apache-rat-plugin/src/it/it4_RAT-168
A         apache-rat-plugin/src/it/it4_RAT-168/pom.xml
A         apache-rat-plugin/src/it/it4_RAT-168/invoker.properties
A         apache-rat-plugin/src/it/it4_RAT-168/verify.groovy
A         apache-rat-plugin/src/it/it5_RAT-179
A         apache-rat-plugin/src/it/it1
AU        apache-rat-plugin/src/it/it1/invoker.properties
A         apache-rat-plugin/src/it/it1/verify.groovy
AU        apache-rat-plugin/src/it/it1/pom.ERROR: Failed to check out http://svn.apache.org/repos/asf/creadur/rat/trunk
org.tmatesoft.svn.core.SVNException: svn: E200030: FULL
	at org.tmatesoft.svn.core.internal.wc.SVNErrorManager.error(SVNErrorManager.java:70)
	at org.tmatesoft.svn.core.internal.wc.SVNErrorManager.error(SVNErrorManager.java:57)
	at org.tmatesoft.svn.core.internal.io.dav.http.HTTPConnection.request(HTTPConnection.java:798)
	at org.tmatesoft.svn.core.internal.io.dav.http.HTTPConnection.request(HTTPConnection.java:391)
	at org.tmatesoft.svn.core.internal.io.dav.http.HTTPConnection.request(HTTPConnection.java:379)
	at org.tmatesoft.svn.core.internal.io.dav.DAVConnection.performHttpRequest(DAVConnection.java:862)
	at org.tmatesoft.svn.core.internal.io.dav.DAVConnection.doReport(DAVConnection.java:359)
	at org.tmatesoft.svn.core.internal.io.dav.DAVRepository.runReport(DAVRepository.java:1341)
	at org.tmatesoft.svn.core.internal.io.dav.DAVRepository.update(DAVRepository.java:868)
	at org.tmatesoft.svn.core.internal.wc2.ng.SvnNgAbstractUpdate.updateInternal(SvnNgAbstractUpdate.java:247)
	at org.tmatesoft.svn.core.internal.wc2.ng.SvnNgAbstractUpdate.update(SvnNgAbstractUpdate.java:111)
	at org.tmatesoft.svn.core.internal.wc2.ng.SvnNgAbstractUpdate.checkout(SvnNgAbstractUpdate.java:861)
	at org.tmatesoft.svn.core.internal.wc2.ng.SvnNgCheckout.run(SvnNgCheckout.java:26)
	at org.tmatesoft.svn.core.internal.wc2.ng.SvnNgCheckout.run(SvnNgCheckout.java:11)
	at org.tmatesoft.svn.core.internal.wc2.ng.SvnNgOperationRunner.run(SvnNgOperationRunner.java:20)
	at org.tmatesoft.svn.core.internal.wc2.SvnOperationRunner.run(SvnOperationRunner.java:21)
	at org.tmatesoft.svn.core.wc2.SvnOperationFactory.run(SvnOperationFactory.java:1235)
	at org.tmatesoft.svn.core.wc2.SvnOperation.run(SvnOperation.java:294)
	at hudson.scm.subversion.CheckoutUpdater$1.perform(CheckoutUpdater.java:119)
	at hudson.scm.subversion.WorkspaceUpdater$UpdateTask.delegateTo(WorkspaceUpdater.java:162)
	at hudson.scm.SubversionSCM$CheckOutTask.perform(SubversionSCM.java:1001)
	at hudson.scm.SubversionSCM$CheckOutTask.invoke(SubversionSCM.java:977)
	at hudson.scm.SubversionSCM$CheckOutTask.invoke(SubversionSCM.java:953)
	at hudson.FilePath$FileCallableWrapper.call(FilePath.java:2750)
	at hudson.remoting.UserRequest.perform(UserRequest.java:181)
	at hudson.remoting.UserRequest.perform(UserRequest.java:52)
	at hudson.remoting.Request$2.run(Request.java:336)
	at hudson.remoting.InterceptingExecutorService$1.call(InterceptingExecutorService.java:68)
	at java.util.concurrent.FutureTask.run(FutureTask.java:266)
	at java.util.concurrent.ThreadPoolExecutor.runWorker(ThreadPoolExecutor.java:1142)
	at java.util.concurrent.ThreadPoolExecutor$Worker.run(ThreadPoolExecutor.java:617)
	at java.lang.Thread.run(Thread.java:745)
Caused by: org.tmatesoft.sqljet.core.SqlJetException: FULL: error code is FULL
	at org.tmatesoft.sqljet.core.internal.pager.SqlJetPager.openJournal(SqlJetPager.java:3051)
	at org.tmatesoft.sqljet.core.internal.pager.SqlJetPager.begin(SqlJetPager.java:2782)
	at org.tmatesoft.sqljet.core.internal.btree.SqlJetBtree.beginTrans(SqlJetBtree.java:931)
	at org.tmatesoft.sqljet.core.table.engine.SqlJetEngine.doBeginTransaction(SqlJetEngine.java:561)
	at org.tmatesoft.sqljet.core.table.engine.SqlJetEngine.access$100(SqlJetEngine.java:55)
	at org.tmatesoft.sqljet.core.table.engine.SqlJetEngine$12.runSynchronized(SqlJetEngine.java:535)
	at org.tmatesoft.sqljet.core.table.engine.SqlJetEngine.runSynchronized(SqlJetEngine.java:217)
	at org.tmatesoft.sqljet.core.table.engine.SqlJetEngine.runEngineTransaction(SqlJetEngine.java:529)
	at org.tmatesoft.sqljet.core.table.SqlJetDb.runTransaction(SqlJetDb.java:238)
	at org.tmatesoft.sqljet.core.table.SqlJetDb.runWriteTransaction(SqlJetDb.java:211)
	at org.tmatesoft.svn.core.internal.wc17.db.statement.SVNWCDbCreateSchema.exec(SVNWCDbCreateSchema.java:225)
	at org.tmatesoft.svn.core.internal.db.SVNSqlJetStatement.done(SVNSqlJetStatement.java:420)
	at org.tmatesoft.svn.core.internal.wc17.db.SVNWCDb$BumpRevisionPostUpdate.bumpMovedAway(SVNWCDb.java:5421)
	at org.tmatesoft.svn.core.internal.wc17.db.SVNWCDb$BumpRevisionPostUpdate.transaction(SVNWCDb.java:5414)
	at org.tmatesoft.svn.core.internal.db.SVNSqlJetDb.runTransaction(SVNSqlJetDb.java:258)
	at org.tmatesoft.svn.core.internal.db.SVNSqlJetDb.runTransaction(SVNSqlJetDb.java:252)
	at org.tmatesoft.svn.core.internal.wc17.db.SVNWCDb.opBumpRevisionPostUpdate(SVNWCDb.java:5366)
	at org.tmatesoft.svn.core.internal.wc17.SVNUpdateEditor17.closeEdit(SVNUpdateEditor17.java:1728)
	at org.tmatesoft.svn.core.internal.wc.SVNCancellableEditor.closeEdit(SVNCancellableEditor.java:148)
	at org.tmatesoft.svn.core.internal.io.dav.handlers.DAVEditorHandler.endElement(DAVEditorHandler.java:492)
	at org.tmatesoft.svn.core.internal.io.dav.handlers.BasicDAVHandler.endElement(BasicDAVHandler.java:103)
	at com.sun.org.apache.xerces.internal.parsers.AbstractSAXParser.endElement(AbstractSAXParser.java:609)
	at com.sun.org.apache.xerces.internal.impl.XMLDocumentFragmentScannerImpl.scanEndElement(XMLDocumentFragmentScannerImpl.java:1782)
	at com.sun.org.apache.xerces.internal.impl.XMLDocumentFragmentScannerImpl$FragmentContentDriver.next(XMLDocumentFragmentScannerImpl.java:2967)
	at com.sun.org.apache.xerces.internal.impl.XMLDocumentScannerImpl.next(XMLDocumentScannerImpl.java:602)
	at com.sun.org.apache.xerces.internal.impl.XMLNSDocumentScannerImpl.next(XMLNSDocumentScannerImpl.java:112)
	at com.sun.org.apache.xerces.internal.impl.XMLDocumentFragmentScannerImpl.scanDocument(XMLDocumentFragmentScannerImpl.java:505)
	at com.sun.org.apache.xerces.internal.parsers.XML11Configuration.parse(XML11Configuration.java:841)
	at com.sun.org.apache.xerces.internal.parsers.XML11Configuration.parse(XML11Configuration.java:770)
	at com.sun.org.apache.xerces.internal.parsers.XMLParser.parse(XMLParser.java:141)
	at com.sun.org.apache.xerces.internal.parsers.AbstractSAXParser.parse(AbstractSAXParser.java:1213)
	at com.sun.org.apache.xerces.internal.jaxp.SAXParserImpl$JAXPSAXParser.parse(SAXParserImpl.java:643)
	at org.tmatesoft.svn.core.internal.io.dav.http.HTTPConnection.readData(HTTPConnection.java:937)
	at org.tmatesoft.svn.core.internal.io.dav.http.HTTPConnection.readData(HTTPConnection.java:902)
	at org.tmatesoft.svn.core.internal.io.dav.http.HTTPRequest.dispatch(HTTPRequest.java:220)
	at org.tmatesoft.svn.core.internal.io.dav.http.HTTPConnection.request(HTTPConnection.java:490)
	... 29 more
xml
AU        apache-rat-plugin/src/it/it1/src.apt
AU        apache-rat-plugin/src/it/settings.xml
AU        apache-rat-plugin/pom.xml
AU        LICENSE
AU        RELEASE-NOTES.txt
 U        .
org.tmatesoft.sqljet.core.SqlJetException: FULL: error code is FULL
	at org.tmatesoft.sqljet.core.internal.pager.SqlJetPager.openJournal(SqlJetPager.java:3051)
	at org.tmatesoft.sqljet.core.internal.pager.SqlJetPager.begin(SqlJetPager.java:2782)
	at org.tmatesoft.sqljet.core.internal.btree.SqlJetBtree.beginTrans(SqlJetBtree.java:931)
	at org.tmatesoft.sqljet.core.table.engine.SqlJetEngine.doBeginTransaction(SqlJetEngine.java:561)
	at org.tmatesoft.sqljet.core.table.engine.SqlJetEngine.access$100(SqlJetEngine.java:55)
	at org.tmatesoft.sqljet.core.table.engine.SqlJetEngine$12.runSynchronized(SqlJetEngine.java:535)
	at org.tmatesoft.sqljet.core.table.engine.SqlJetEngine.runSynchronized(SqlJetEngine.java:217)
	at org.tmatesoft.sqljet.core.table.engine.SqlJetEngine.runEngineTransaction(SqlJetEngine.java:529)
	at org.tmatesoft.sqljet.core.table.SqlJetDb.runTransaction(SqlJetDb.java:238)
	at org.tmatesoft.sqljet.core.table.SqlJetDb.runWriteTransaction(SqlJetDb.java:211)
	at org.tmatesoft.svn.core.internal.wc17.db.statement.SVNWCDbCreateSchema.exec(SVNWCDbCreateSchema.java:225)
	at org.tmatesoft.svn.core.internal.db.SVNSqlJetStatement.done(SVNSqlJetStatement.java:420)
	at org.tmatesoft.svn.core.internal.wc17.db.SVNWCDb$BumpRevisionPostUpdate.bumpMovedAway(SVNWCDb.java:5421)
	at org.tmatesoft.svn.core.internal.wc17.db.SVNWCDb$BumpRevisionPostUpdate.transaction(SVNWCDb.java:5414)
	at org.tmatesoft.svn.core.internal.db.SVNSqlJetDb.runTransaction(SVNSqlJetDb.java:258)
	at org.tmatesoft.svn.core.internal.db.SVNSqlJetDb.runTransaction(SVNSqlJetDb.java:252)
	at org.tmatesoft.svn.core.internal.wc17.db.SVNWCDb.opBumpRevisionPostUpdate(SVNWCDb.java:5366)
	at org.tmatesoft.svn.core.internal.wc17.SVNUpdateEditor17.closeEdit(SVNUpdateEditor17.java:1728)
	at org.tmatesoft.svn.core.internal.wc.SVNCancellableEditor.closeEdit(SVNCancellableEditor.java:148)
	at org.tmatesoft.svn.core.internal.io.dav.handlers.DAVEditorHandler.endElement(DAVEditorHandler.java:492)
	at org.tmatesoft.svn.core.internal.io.dav.handlers.BasicDAVHandler.endElement(BasicDAVHandler.java:103)
	at com.sun.org.apache.xerces.internal.parsers.AbstractSAXParser.endElement(AbstractSAXParser.java:609)
	at com.sun.org.apache.xerces.internal.impl.XMLDocumentFragmentScannerImpl.scanEndElement(XMLDocumentFragmentScannerImpl.java:1782)
	at com.sun.org.apache.xerces.internal.impl.XMLDocumentFragmentScannerImpl$FragmentContentDriver.next(XMLDocumentFragmentScannerImpl.java:2967)
	at com.sun.org.apache.xerces.internal.impl.XMLDocumentScannerImpl.next(XMLDocumentScannerImpl.java:602)
	at com.sun.org.apache.xerces.internal.impl.XMLNSDocumentScannerImpl.next(XMLNSDocumentScannerImpl.java:112)
	at com.sun.org.apache.xerces.internal.impl.XMLDocumentFragmentScannerImpl.scanDocument(XMLDocumentFragmentScannerImpl.java:505)
	at com.sun.org.apache.xerces.internal.parsers.XML11Configuration.parse(XML11Configuration.java:841)
	at com.sun.org.apache.xerces.internal.parsers.XML11Configuration.parse(XML11Configuration.java:770)
	at com.sun.org.apache.xerces.internal.parsers.XMLParser.parse(XMLParser.java:141)
	at com.sun.org.apache.xerces.internal.parsers.AbstractSAXParser.parse(AbstractSAXParser.java:1213)
	at com.sun.org.apache.xerces.internal.jaxp.SAXParserImpl$JAXPSAXParser.parse(SAXParserImpl.java:643)
	at org.tmatesoft.svn.core.internal.io.dav.http.HTTPConnection.readData(HTTPConnection.java:937)
	at org.tmatesoft.svn.core.internal.io.dav.http.HTTPConnection.readData(HTTPConnection.java:902)
	at org.tmatesoft.svn.core.internal.io.dav.http.HTTPRequest.dispatch(HTTPRequest.java:220)
	at org.tmatesoft.svn.core.internal.io.dav.http.HTTPConnection.request(HTTPConnection.java:490)
Caused: org.tmatesoft.svn.core.SVNException: svn: E200030: FULL
	at org.tmatesoft.svn.core.internal.wc.SVNErrorManager.error(SVNErrorManager.java:70)
	at org.tmatesoft.svn.core.internal.wc.SVNErrorManager.error(SVNErrorManager.java:57)
	at org.tmatesoft.svn.core.internal.io.dav.http.HTTPConnection.request(HTTPConnection.java:798)
	at org.tmatesoft.svn.core.internal.io.dav.http.HTTPConnection.request(HTTPConnection.java:391)
	at org.tmatesoft.svn.core.internal.io.dav.http.HTTPConnection.request(HTTPConnection.java:379)
	at org.tmatesoft.svn.core.internal.io.dav.DAVConnection.performHttpRequest(DAVConnection.java:862)
	at org.tmatesoft.svn.core.internal.io.dav.DAVConnection.doReport(DAVConnection.java:359)
	at org.tmatesoft.svn.core.internal.io.dav.DAVRepository.runReport(DAVRepository.java:1341)
	at org.tmatesoft.svn.core.internal.io.dav.DAVRepository.update(DAVRepository.java:868)
	at org.tmatesoft.svn.core.internal.wc2.ng.SvnNgAbstractUpdate.updateInternal(SvnNgAbstractUpdate.java:247)
	at org.tmatesoft.svn.core.internal.wc2.ng.SvnNgAbstractUpdate.update(SvnNgAbstractUpdate.java:111)
	at org.tmatesoft.svn.core.internal.wc2.ng.SvnNgAbstractUpdate.checkout(SvnNgAbstractUpdate.java:861)
	at org.tmatesoft.svn.core.internal.wc2.ng.SvnNgCheckout.run(SvnNgCheckout.java:26)
	at org.tmatesoft.svn.core.internal.wc2.ng.SvnNgCheckout.run(SvnNgCheckout.java:11)
	at org.tmatesoft.svn.core.internal.wc2.ng.SvnNgOperationRunner.run(SvnNgOperationRunner.java:20)
	at org.tmatesoft.svn.core.internal.wc2.SvnOperationRunner.run(SvnOperationRunner.java:21)
	at org.tmatesoft.svn.core.wc2.SvnOperationFactory.run(SvnOperationFactory.java:1235)
	at org.tmatesoft.svn.core.wc2.SvnOperation.run(SvnOperation.java:294)
	at hudson.scm.subversion.CheckoutUpdater$1.perform(CheckoutUpdater.java:119)
	at hudson.scm.subversion.WorkspaceUpdater$UpdateTask.delegateTo(WorkspaceUpdater.java:162)
	at hudson.scm.SubversionSCM$CheckOutTask.perform(SubversionSCM.java:1001)
	at hudson.scm.SubversionSCM$CheckOutTask.invoke(SubversionSCM.java:977)
	at hudson.scm.SubversionSCM$CheckOutTask.invoke(SubversionSCM.java:953)
	at hudson.FilePath$FileCallableWrapper.call(FilePath.java:2750)
	at hudson.remoting.UserRequest.perform(UserRequest.java:181)
	at hudson.remoting.UserRequest.perform(UserRequest.java:52)
	at hudson.remoting.Request$2.run(Request.java:336)
	at hudson.remoting.InterceptingExecutorService$1.call(InterceptingExecutorService.java:68)
	at java.util.concurrent.FutureTask.run(FutureTask.java:266)
	at java.util.concurrent.ThreadPoolExecutor.runWorker(ThreadPoolExecutor.java:1142)
	at java.util.concurrent.ThreadPoolExecutor$Worker.run(ThreadPoolExecutor.java:617)
	at java.lang.Thread.run(Thread.java:745)
Caused: java.io.IOException: Failed to check out http://svn.apache.org/repos/asf/creadur/rat/trunk
	at hudson.scm.subversion.CheckoutUpdater$1.perform(CheckoutUpdater.java:130)
	at hudson.scm.subversion.WorkspaceUpdater$UpdateTask.delegateTo(WorkspaceUpdater.java:162)
	at hudson.scm.SubversionSCM$CheckOutTask.perform(SubversionSCM.java:1001)
	at hudson.scm.SubversionSCM$CheckOutTask.invoke(SubversionSCM.java:977)
	at hudson.scm.SubversionSCM$CheckOutTask.invoke(SubversionSCM.java:953)
	at hudson.FilePath$FileCallableWrapper.call(FilePath.java:2750)
	at hudson.remoting.UserRequest.perform(UserRequest.java:181)
	at hudson.remoting.UserRequest.perform(UserRequest.java:52)
	at hudson.remoting.Request$2.run(Request.java:336)
	at hudson.remoting.InterceptingExecutorService$1.call(InterceptingExecutorService.java:68)
	at java.util.concurrent.FutureTask.run(FutureTask.java:266)
	at java.util.concurrent.ThreadPoolExecutor.runWorker(ThreadPoolExecutor.java:1142)
	at java.util.concurrent.ThreadPoolExecutor$Worker.run(ThreadPoolExecutor.java:617)
	at java.lang.Thread.run(Thread.java:745)
	at ......remote call to qnode3(Native Method)
	at hudson.remoting.Channel.attachCallSiteStackTrace(Channel.java:1554)
	at hudson.remoting.UserResponse.retrieve(UserRequest.java:281)
	at hudson.remoting.Channel.call(Channel.java:839)
	at hudson.FilePath.act(FilePath.java:987)
Caused: java.io.IOException: remote file operation failed: <https://builds.apache.org/job/Creadur-Rat-ParentPom/ws/> at hudson.remoting.Channel@2801ec2:qnode3
	at hudson.FilePath.act(FilePath.java:994)
	at hudson.FilePath.act(FilePath.java:976)
	at hudson.scm.SubversionSCM.checkout(SubversionSCM.java:902)
	at hudson.scm.SubversionSCM.checkout(SubversionSCM.java:838)
	at hudson.scm.SCM.checkout(SCM.java:495)
	at hudson.model.AbstractProject.checkout(AbstractProject.java:1212)
	at hudson.model.AbstractBuild$AbstractBuildExecution.defaultCheckout(AbstractBuild.java:566)
	at jenkins.scm.SCMCheckoutStrategy.checkout(SCMCheckoutStrategy.java:86)
	at hudson.model.AbstractBuild$AbstractBuildExecution.run(AbstractBuild.java:491)
	at hudson.model.Run.execute(Run.java:1737)
	at hudson.maven.MavenModuleSetBuild.run(MavenModuleSetBuild.java:543)
	at hudson.model.ResourceController.execute(ResourceController.java:97)
	at hudson.model.Executor.run(Executor.java:419)

Jenkins build is back to normal : Creadur-Rat-ParentPom #189

Posted by Apache Jenkins Server <je...@builds.apache.org>.
See <https://builds.apache.org/job/Creadur-Rat-ParentPom/189/display/redirect>