You are viewing a plain text version of this content. The canonical link for it is here.
Posted to dev@geronimo.apache.org by Sundaranathan Sivashanmuganthan <Si...@Sun.COM> on 2004/01/12 11:36:26 UTC

Re: Building issue with bare 'maven'

Hi Jacek,

          I tried building by giving the command "maven build" the same 
error occurs. Once again the error is given below -

groovy:compile:
    [groovyc] Compiling 1 source file to 
D:\Sundar\temp\incubator-geronimo\modules\explorer\target\classes

BUILD FAILED
File...... file:/D:/Sundar/temp/incubator-geronimo/
Element... maven:reactor
Line...... 134
Column.... 27
Unable to obtain goal [default] -- 
file:/D:/Sundar/temp/incubator-geronimo/modules/explorer/:26:97: 
<groovyc> java.lang.ExceptionInInitializerError
Total time: 2 minutes 30 seconds
Finished at: Mon Jan 12 16:03:35 GMT+05:30 2004

thanks,
-Sundar.



Jacek Laskowski wrote:

> Sundaranathan Sivashanmuganthan wrote:
>
>> Hi All,
>>
>>       When i try to build geronimo by giving the command "maven" i am 
>> getting the error given below. Can anyone help me out in rectifying 
>> this error.
>
>
> Hi,
>
> I haven't seen the error before, so I can't tell you what caused it. 
> Despite this, the command I prefer when building Geronimo is: 'maven 
> rebuild'. As I guess you've never built Geronimo before, you will have 
> to use 'maven build' first.
>
> Give it a try and tell us if it has worked for you. Perhaps, there's 
> an issue with bare 'maven'.
>
> Geronimo has just been built by myself with 'maven rebuild' so I can 
> assure you that the command works properly (contrary to what others say).
>
> /geronimo
> > maven rebuild
> ...
> BUILD SUCCESSFUL
> Total time: 16 minutes 15 seconds
> Finished at: Mon Jan 12 11:23:41 CET 2004
>
>> thanks,
>> -Sundar.
>
>
> Jacek
>


Re: Building issue with bare 'maven'

Posted by Sundaranathan Sivashanmuganthan <Si...@Sun.COM>.
thanks ... i will try with the combinations and let you know ...

-Sundar.

Jacek Laskowski wrote:

> Sundaranathan Sivashanmuganthan wrote:
>
>>                JDK Version - java version "1.5.0-beta"
>
>
> Here is the possible cause of your problems. Try out JDK 1.4.2_02. 
> Noone reported 1.5.0-beta as a working configuration - 
> http://wiki.apache.org/geronimo/KnownWorkingConfigurations.
>
>> -Sundar.
>
>
> Jacek
>


Re: Building issue with bare 'maven'

Posted by Jacek Laskowski <ja...@hp.com>.
Sundaranathan Sivashanmuganthan wrote:

>                JDK Version - java version "1.5.0-beta"

Here is the possible cause of your problems. Try out JDK 1.4.2_02. Noone 
reported 1.5.0-beta as a working configuration - 
http://wiki.apache.org/geronimo/KnownWorkingConfigurations.

> -Sundar.

Jacek


Re: Building issue with bare 'maven'

Posted by Sundaranathan Sivashanmuganthan <Si...@Sun.COM>.
Hi Jacek,

          Here are the details you asked for

                OS Version - Windows 2000 Pro
                JDK Version - java version "1.5.0-beta"
                Maven Version - Maven 1.0-rc1

       I will try my best to solve this problem.

thanks,
-Sundar.

Jacek Laskowski wrote:

> Sundaranathan Sivashanmuganthan wrote:
>
>> Hi Jacek,
>>
>>          I tried building by giving the command "maven build" the 
>> same error occurs. Once again the error is given below -
>>
>> groovy:compile:
>>    [groovyc] Compiling 1 source file to 
>> D:\Sundar\temp\incubator-geronimo\modules\explorer\target\classes
>>
>> BUILD FAILED
>> File...... file:/D:/Sundar/temp/incubator-geronimo/
>> Element... maven:reactor
>> Line...... 134
>> Column.... 27
>> Unable to obtain goal [default] -- 
>> file:/D:/Sundar/temp/incubator-geronimo/modules/explorer/:26:97: 
>> <groovyc> java.lang.ExceptionInInitializerError
>> Total time: 2 minutes 30 seconds
>> Finished at: Mon Jan 12 16:03:35 GMT+05:30 2004
>
>
> Hi,
>
> I don't know what might go wrong. What's interesting is 'Unable to 
> obtain goal [default]'. Would you provide versions of JDK, OS, maven 
> as well as the whole output of 'maven build' attached.
>
> I hope you'll get it resolved very quickly and send us what caused it.
>
>> thanks,
>> -Sundar.
>
>
> Jacek
>


Re: Building issue with bare 'maven'

Posted by Jacek Laskowski <ja...@hp.com>.
Sundaranathan Sivashanmuganthan wrote:

> Hi Jacek,
> 
>          I tried building by giving the command "maven build" the same 
> error occurs. Once again the error is given below -
> 
> groovy:compile:
>    [groovyc] Compiling 1 source file to 
> D:\Sundar\temp\incubator-geronimo\modules\explorer\target\classes
> 
> BUILD FAILED
> File...... file:/D:/Sundar/temp/incubator-geronimo/
> Element... maven:reactor
> Line...... 134
> Column.... 27
> Unable to obtain goal [default] -- 
> file:/D:/Sundar/temp/incubator-geronimo/modules/explorer/:26:97: 
> <groovyc> java.lang.ExceptionInInitializerError
> Total time: 2 minutes 30 seconds
> Finished at: Mon Jan 12 16:03:35 GMT+05:30 2004

Hi,

I don't know what might go wrong. What's interesting is 'Unable to 
obtain goal [default]'. Would you provide versions of JDK, OS, maven as 
well as the whole output of 'maven build' attached.

I hope you'll get it resolved very quickly and send us what caused it.

> thanks,
> -Sundar.

Jacek