You are viewing a plain text version of this content. The canonical link for it is here.
Posted to yarn-dev@hadoop.apache.org by Apache Jenkins Server <je...@builds.apache.org> on 2014/06/27 11:13:31 UTC
Failed: YARN-570 PreCommit Build #4115
Jira: https://issues.apache.org/jira/browse/YARN-570
Build: https://builds.apache.org/job/PreCommit-YARN-Build/4115/
###################################################################################
########################## LAST 60 LINES OF THE CONSOLE ###########################
[...truncated 2963 lines...]
against trunk revision .
{color:green}+1 @author{color}. The patch does not contain any @author tags.
{color:red}-1 tests included{color}. The patch doesn't appear to include any new or modified tests.
Please justify why no new tests are needed for this patch.
Also please list what manual steps were performed to verify this patch.
{color:green}+1 javac{color}. The applied patch does not increase the total number of javac compiler warnings.
{color:green}+1 javadoc{color}. There were no new javadoc warning messages.
{color:green}+1 eclipse:eclipse{color}. The patch built with eclipse:eclipse.
{color:green}+1 findbugs{color}. The patch does not introduce any new Findbugs (version 1.3.9) warnings.
{color:green}+1 release audit{color}. The applied patch does not increase the total number of release audit warnings.
{color:green}+1 core tests{color}. The patch passed unit tests in hadoop-yarn-project/hadoop-yarn/hadoop-yarn-common.
{color:green}+1 contrib tests{color}. The patch passed contrib unit tests.
Test results: https://builds.apache.org/job/PreCommit-YARN-Build/4115//testReport/
Console output: https://builds.apache.org/job/PreCommit-YARN-Build/4115//console
This message is automatically generated.
======================================================================
======================================================================
Adding comment to Jira.
======================================================================
======================================================================
Comment added.
5a4eecea314b9149fa20a4cc9431608c7c54bfcd logged out
======================================================================
======================================================================
Finished build.
======================================================================
======================================================================
Build step 'Execute shell' marked build as failure
Archiving artifacts
Sending artifact delta relative to PreCommit-YARN-Build #4109
Archived 17 artifacts
Archive block size is 32768
Received 37 blocks and 6926899 bytes
Compression is 14.9%
Took 1.9 sec
[description-setter] Could not determine description.
Recording test results
Publish JUnit test result report is waiting for a checkpoint on PreCommit-YARN-Build #4113
Email was triggered for: Failure
Sending email for trigger: Failure
###################################################################################
############################## FAILED TESTS (if any) ##############################
All tests passed
Failed: YARN-2034 PreCommit Build #4118
Posted by Apache Jenkins Server <je...@builds.apache.org>.
Jira: https://issues.apache.org/jira/browse/YARN-2034
Build: https://builds.apache.org/job/PreCommit-YARN-Build/4118/
###################################################################################
########################## LAST 60 LINES OF THE CONSOLE ###########################
[...truncated 3060 lines...]
http://issues.apache.org/jira/secure/attachment/12644210/YARN-2034.patch
against trunk revision .
{color:green}+1 @author{color}. The patch does not contain any @author tags.
{color:red}-1 tests included{color}. The patch doesn't appear to include any new or modified tests.
Please justify why no new tests are needed for this patch.
Also please list what manual steps were performed to verify this patch.
{color:green}+1 javac{color}. The applied patch does not increase the total number of javac compiler warnings.
{color:green}+1 javadoc{color}. There were no new javadoc warning messages.
{color:green}+1 eclipse:eclipse{color}. The patch built with eclipse:eclipse.
{color:green}+1 findbugs{color}. The patch does not introduce any new Findbugs (version 1.3.9) warnings.
{color:green}+1 release audit{color}. The applied patch does not increase the total number of release audit warnings.
{color:green}+1 core tests{color}. The patch passed unit tests in hadoop-yarn-project/hadoop-yarn/hadoop-yarn-api hadoop-yarn-project/hadoop-yarn/hadoop-yarn-common.
{color:green}+1 contrib tests{color}. The patch passed contrib unit tests.
Test results: https://builds.apache.org/job/PreCommit-YARN-Build/4118//testReport/
Console output: https://builds.apache.org/job/PreCommit-YARN-Build/4118//console
This message is automatically generated.
======================================================================
======================================================================
Adding comment to Jira.
======================================================================
======================================================================
Comment added.
b27e55b761ede6ffc43a21be8f078a79c69249f4 logged out
======================================================================
======================================================================
Finished build.
======================================================================
======================================================================
Build step 'Execute shell' marked build as failure
Archiving artifacts
Sending artifact delta relative to PreCommit-YARN-Build #4109
Archived 22 artifacts
Archive block size is 32768
Received 39 blocks and 7129602 bytes
Compression is 15.2%
Took 2.5 sec
[description-setter] Could not determine description.
Recording test results
Email was triggered for: Failure
Sending email for trigger: Failure
###################################################################################
############################## FAILED TESTS (if any) ##############################
All tests passed
Failed: YARN-2130 PreCommit Build #4117
Posted by Apache Jenkins Server <je...@builds.apache.org>.
Jira: https://issues.apache.org/jira/browse/YARN-2130
Build: https://builds.apache.org/job/PreCommit-YARN-Build/4117/
###################################################################################
########################## LAST 60 LINES OF THE CONSOLE ###########################
[...truncated 3178 lines...]
{color:green}+1 contrib tests{color}. The patch passed contrib unit tests.
Test results: https://builds.apache.org/job/PreCommit-YARN-Build/4117//testReport/
Console output: https://builds.apache.org/job/PreCommit-YARN-Build/4117//console
This message is automatically generated.
======================================================================
======================================================================
Adding comment to Jira.
======================================================================
======================================================================
Comment added.
ac48c1fe9aeedd12c1c54b6bb883eb000ca4d9cd logged out
======================================================================
======================================================================
Finished build.
======================================================================
======================================================================
Build step 'Execute shell' marked build as failure
Archiving artifacts
Sending artifact delta relative to PreCommit-YARN-Build #4109
Archived 22 artifacts
Archive block size is 32768
Received 216 blocks and 1219917 bytes
Compression is 85.3%
Took 0.61 sec
[description-setter] Could not determine description.
Recording test results
ERROR: Failed to archive test reports
java.io.IOException: remote file operation failed: /home/jenkins/jenkins-slave/workspace/PreCommit-YARN-Build at hudson.remoting.Channel@17c77c3d:hadoop4
at hudson.FilePath.act(FilePath.java:910)
at hudson.FilePath.act(FilePath.java:887)
at hudson.tasks.junit.JUnitParser.parse(JUnitParser.java:87)
at hudson.tasks.junit.JUnitResultArchiver.parse(JUnitResultArchiver.java:121)
at hudson.tasks.junit.JUnitResultArchiver.perform(JUnitResultArchiver.java:133)
at hudson.tasks.BuildStepMonitor$1.perform(BuildStepMonitor.java:20)
at hudson.model.AbstractBuild$AbstractBuildExecution.perform(AbstractBuild.java:804)
at hudson.model.AbstractBuild$AbstractBuildExecution.performAllBuildSteps(AbstractBuild.java:776)
at hudson.model.Build$BuildExecution.post2(Build.java:183)
at hudson.model.AbstractBuild$AbstractBuildExecution.post(AbstractBuild.java:725)
at hudson.model.Run.execute(Run.java:1701)
at hudson.model.FreeStyleBuild.run(FreeStyleBuild.java:43)
at hudson.model.ResourceController.execute(ResourceController.java:88)
at hudson.model.Executor.run(Executor.java:231)
Caused by: java.io.IOException: Remote call on hadoop4 failed
at hudson.remoting.Channel.call(Channel.java:731)
at hudson.FilePath.act(FilePath.java:903)
... 13 more
Caused by: java.lang.OutOfMemoryError: Java heap space
Email was triggered for: Failure
Sending email for trigger: Failure
###################################################################################
############################## FAILED TESTS (if any) ##############################
No tests ran.
Failed: YARN-2142 PreCommit Build #4116
Posted by Apache Jenkins Server <je...@builds.apache.org>.
Jira: https://issues.apache.org/jira/browse/YARN-2142
Build: https://builds.apache.org/job/PreCommit-YARN-Build/4116/
###################################################################################
########################## LAST 60 LINES OF THE CONSOLE ###########################
[...truncated 2911 lines...]
against trunk revision .
{color:green}+1 @author{color}. The patch does not contain any @author tags.
{color:red}-1 tests included{color}. The patch doesn't appear to include any new or modified tests.
Please justify why no new tests are needed for this patch.
Also please list what manual steps were performed to verify this patch.
{color:red}-1 javac{color}. The applied patch generated 1266 javac compiler warnings (more than the trunk's current 1258 warnings).
{color:green}+1 javadoc{color}. There were no new javadoc warning messages.
{color:green}+1 eclipse:eclipse{color}. The patch built with eclipse:eclipse.
{color:green}+1 findbugs{color}. The patch does not introduce any new Findbugs (version 1.3.9) warnings.
{color:green}+1 release audit{color}. The applied patch does not increase the total number of release audit warnings.
{color:green}+1 core tests{color}. The patch passed unit tests in hadoop-common-project/hadoop-auth.
{color:green}+1 contrib tests{color}. The patch passed contrib unit tests.
Test results: https://builds.apache.org/job/PreCommit-YARN-Build/4116//testReport/
Javac warnings: https://builds.apache.org/job/PreCommit-YARN-Build/4116//artifact/trunk/patchprocess/diffJavacWarnings.txt
Console output: https://builds.apache.org/job/PreCommit-YARN-Build/4116//console
This message is automatically generated.
======================================================================
======================================================================
Adding comment to Jira.
======================================================================
======================================================================
Comment added.
4c3f30dea4ada6024917c65909baa5b12bd37a7a logged out
======================================================================
======================================================================
Finished build.
======================================================================
======================================================================
Build step 'Execute shell' marked build as failure
Archiving artifacts
Sending artifact delta relative to PreCommit-YARN-Build #4109
Archived 18 artifacts
Archive block size is 32768
Received 46 blocks and 6462266 bytes
Compression is 18.9%
Took 2.1 sec
[description-setter] Could not determine description.
Recording test results
Email was triggered for: Failure
Sending email for trigger: Failure
###################################################################################
############################## FAILED TESTS (if any) ##############################
All tests passed