You are viewing a plain text version of this content. The canonical link for it is here.
Posted to builds@beam.apache.org by Apache Jenkins Server <je...@builds.apache.org> on 2021/11/20 16:00:26 UTC
beam_PostCommit_Java_Nexmark_Dataflow_V2_Java11 - Build # 720 - Aborted!
beam_PostCommit_Java_Nexmark_Dataflow_V2_Java11 - Build # 720 - Aborted:
Check console output at https://ci-beam.apache.org/job/beam_PostCommit_Java_Nexmark_Dataflow_V2_Java11/720/ to view the results.
Jenkins build is back to normal : beam_PostCommit_Java_Nexmark_Dataflow_V2_Java11 #723
Posted by Apache Jenkins Server <je...@builds.apache.org>.
See <https://ci-beam.apache.org/job/beam_PostCommit_Java_Nexmark_Dataflow_V2_Java11/723/display/redirect>
---------------------------------------------------------------------
To unsubscribe, e-mail: builds-unsubscribe@beam.apache.org
For additional commands, e-mail: builds-help@beam.apache.org
Build failed in Jenkins: beam_PostCommit_Java_Nexmark_Dataflow_V2_Java11 #722
Posted by Apache Jenkins Server <je...@builds.apache.org>.
See <https://ci-beam.apache.org/job/beam_PostCommit_Java_Nexmark_Dataflow_V2_Java11/722/display/redirect>
Changes:
------------------------------------------
[...truncated 278.25 KB...]
> Task :sdks:java:extensions:google-cloud-platform-core:processResources NO-SOURCE
> Task :runners:core-construction-java:processResources NO-SOURCE
> Task :sdks:java:container:downloadCloudProfilerAgent UP-TO-DATE
> Task :model:job-management:extractProto UP-TO-DATE
> Task :sdks:java:expansion-service:createCheckerFrameworkManifest UP-TO-DATE
> Task :sdks:java:core:generateAvroJava NO-SOURCE
> Task :release:go-licenses:java:createLicenses UP-TO-DATE
> Task :sdks:java:harness:processResources NO-SOURCE
> Task :runners:google-cloud-dataflow-java:createCheckerFrameworkManifest UP-TO-DATE
> Task :model:fn-execution:processResources UP-TO-DATE
> Task :sdks:java:io:kafka:createCheckerFrameworkManifest UP-TO-DATE
> Task :sdks:java:extensions:arrow:createCheckerFrameworkManifest UP-TO-DATE
> Task :sdks:java:expansion-service:processResources NO-SOURCE
> Task :sdks:java:extensions:protobuf:createCheckerFrameworkManifest UP-TO-DATE
> Task :sdks:java:extensions:arrow:processResources NO-SOURCE
> Task :model:job-management:processResources UP-TO-DATE
> Task :sdks:java:io:google-cloud-platform:createCheckerFrameworkManifest UP-TO-DATE
> Task :sdks:java:extensions:protobuf:extractProto UP-TO-DATE
> Task :sdks:java:io:kafka:processResources NO-SOURCE
> Task :sdks:java:extensions:join-library:createCheckerFrameworkManifest UP-TO-DATE
> Task :sdks:java:io:google-cloud-platform:processResources NO-SOURCE
> Task :sdks:java:extensions:join-library:processResources NO-SOURCE
> Task :sdks:java:io:hadoop-common:createCheckerFrameworkManifest UP-TO-DATE
> Task :sdks:java:io:hadoop-common:processResources NO-SOURCE
> Task :sdks:java:io:mongodb:createCheckerFrameworkManifest UP-TO-DATE
> Task :sdks:java:io:parquet:createCheckerFrameworkManifest UP-TO-DATE
> Task :runners:google-cloud-dataflow-java:processResources UP-TO-DATE
> Task :sdks:java:io:parquet:processResources NO-SOURCE
> Task :sdks:java:extensions:sql:udf:createCheckerFrameworkManifest UP-TO-DATE
> Task :sdks:java:testing:nexmark:createCheckerFrameworkManifest UP-TO-DATE
> Task :sdks:java:testing:test-utils:createCheckerFrameworkManifest UP-TO-DATE
> Task :sdks:java:extensions:sql:zetasql:createCheckerFrameworkManifest UP-TO-DATE
> Task :sdks:java:extensions:protobuf:processResources NO-SOURCE
> Task :sdks:java:container:generateLicenseReport UP-TO-DATE
> Task :sdks:java:testing:test-utils:processResources NO-SOURCE
> Task :sdks:java:core:generateGrammarSource UP-TO-DATE
> Task :sdks:java:io:mongodb:processResources NO-SOURCE
> Task :sdks:java:testing:nexmark:processResources UP-TO-DATE
> Task :sdks:java:core:processResources UP-TO-DATE
> Task :sdks:java:extensions:sql:zetasql:processResources NO-SOURCE
> Task :sdks:java:container:java11:copyLicenses UP-TO-DATE
> Task :sdks:java:container:java11:copyGolangLicenses UP-TO-DATE
> Task :model:pipeline:extractIncludeProto UP-TO-DATE
> Task :model:pipeline:extractProto UP-TO-DATE
> Task :sdks:java:container:pullLicenses UP-TO-DATE
> Task :sdks:java:container:goPrepare
Use project GOPATH: <https://ci-beam.apache.org/job/beam_PostCommit_Java_Nexmark_Dataflow_V2_Java11/ws/src/sdks/java/container/.gogradle/project_gopath>
> Task :sdks:java:container:resolveBuildDependencies SKIPPED
> Task :sdks:java:container:installDependencies SKIPPED
> Task :sdks:java:extensions:sql:udf:compileJava UP-TO-DATE
> Task :sdks:java:extensions:sql:udf:processResources NO-SOURCE
> Task :model:pipeline:generateProto UP-TO-DATE
> Task :sdks:java:extensions:sql:udf:classes UP-TO-DATE
> Task :sdks:java:extensions:sql:udf:jar UP-TO-DATE
> Task :sdks:java:container:java11:dockerClean
> Task :sdks:java:container:java11:copyJavaThirdPartyLicenses UP-TO-DATE
> Task :sdks:java:container:buildLinuxAmd64 UP-TO-DATE
> Task :sdks:java:container:goBuild
> Task :model:pipeline:compileJava UP-TO-DATE
> Task :model:pipeline:processResources UP-TO-DATE
> Task :model:pipeline:classes UP-TO-DATE
> Task :model:pipeline:jar UP-TO-DATE
> Task :model:pipeline:shadowJar UP-TO-DATE
> Task :model:fn-execution:extractIncludeProto UP-TO-DATE
> Task :model:job-management:extractIncludeProto UP-TO-DATE
> Task :model:job-management:generateProto UP-TO-DATE
> Task :model:fn-execution:generateProto UP-TO-DATE
> Task :sdks:java:extensions:sql:copyFmppTemplatesFromCalciteCore UP-TO-DATE
> Task :sdks:java:extensions:sql:copyFmppTemplatesFromSrc UP-TO-DATE
> Task :model:job-management:compileJava UP-TO-DATE
> Task :model:job-management:classes UP-TO-DATE
> Task :model:job-management:shadowJar UP-TO-DATE
> Task :model:fn-execution:compileJava UP-TO-DATE
> Task :model:fn-execution:classes UP-TO-DATE
> Task :model:fn-execution:shadowJar UP-TO-DATE
> Task :sdks:java:extensions:sql:generateFmppSources
> Task :sdks:java:extensions:sql:compileJavacc UP-TO-DATE
> Task :sdks:java:extensions:sql:createCheckerFrameworkManifest UP-TO-DATE
> Task :sdks:java:extensions:sql:processResources UP-TO-DATE
> Task :sdks:java:container:java11:copySdkHarnessLauncher
> Task :sdks:java:core:compileJava UP-TO-DATE
> Task :sdks:java:core:classes UP-TO-DATE
> Task :sdks:java:core:shadowJar UP-TO-DATE
> Task :sdks:java:extensions:protobuf:extractIncludeProto UP-TO-DATE
> Task :sdks:java:extensions:protobuf:generateProto NO-SOURCE
> Task :runners:local-java:compileJava UP-TO-DATE
> Task :runners:local-java:classes UP-TO-DATE
> Task :sdks:java:extensions:join-library:compileJava UP-TO-DATE
> Task :sdks:java:extensions:join-library:classes UP-TO-DATE
> Task :sdks:java:extensions:join-library:jar UP-TO-DATE
> Task :sdks:java:extensions:arrow:compileJava UP-TO-DATE
> Task :sdks:java:extensions:arrow:classes UP-TO-DATE
> Task :sdks:java:extensions:arrow:jar UP-TO-DATE
> Task :runners:local-java:jar UP-TO-DATE
> Task :sdks:java:io:mongodb:compileJava UP-TO-DATE
> Task :sdks:java:io:mongodb:classes UP-TO-DATE
> Task :sdks:java:io:mongodb:jar UP-TO-DATE
> Task :sdks:java:extensions:protobuf:compileJava UP-TO-DATE
> Task :sdks:java:extensions:protobuf:classes UP-TO-DATE
> Task :sdks:java:extensions:protobuf:jar UP-TO-DATE
> Task :sdks:java:testing:test-utils:compileJava UP-TO-DATE
> Task :sdks:java:testing:test-utils:classes UP-TO-DATE
> Task :sdks:java:testing:test-utils:jar UP-TO-DATE
> Task :sdks:java:fn-execution:compileJava UP-TO-DATE
> Task :sdks:java:fn-execution:classes UP-TO-DATE
> Task :sdks:java:fn-execution:jar UP-TO-DATE
> Task :sdks:java:io:hadoop-common:compileJava UP-TO-DATE
> Task :sdks:java:io:hadoop-common:classes UP-TO-DATE
> Task :sdks:java:io:hadoop-common:jar UP-TO-DATE
> Task :sdks:java:io:parquet:compileJava UP-TO-DATE
> Task :sdks:java:io:parquet:classes UP-TO-DATE
> Task :sdks:java:io:parquet:jar UP-TO-DATE
> Task :runners:core-construction-java:compileJava UP-TO-DATE
> Task :runners:core-construction-java:classes UP-TO-DATE
> Task :runners:core-construction-java:jar UP-TO-DATE
> Task :runners:core-java:compileJava UP-TO-DATE
> Task :runners:core-java:classes UP-TO-DATE
> Task :runners:core-java:jar UP-TO-DATE
> Task :sdks:java:extensions:google-cloud-platform-core:compileJava UP-TO-DATE
> Task :sdks:java:extensions:google-cloud-platform-core:classes UP-TO-DATE
> Task :sdks:java:extensions:google-cloud-platform-core:jar UP-TO-DATE
> Task :sdks:java:harness:compileJava UP-TO-DATE
> Task :sdks:java:harness:classes UP-TO-DATE
> Task :sdks:java:harness:jar UP-TO-DATE
> Task :sdks:java:harness:shadowJar UP-TO-DATE
> Task :runners:java-fn-execution:compileJava UP-TO-DATE
> Task :runners:java-fn-execution:classes UP-TO-DATE
> Task :runners:java-fn-execution:jar UP-TO-DATE
> Task :sdks:java:expansion-service:compileJava UP-TO-DATE
> Task :sdks:java:expansion-service:classes UP-TO-DATE
> Task :sdks:java:expansion-service:jar UP-TO-DATE
> Task :runners:direct-java:compileJava UP-TO-DATE
> Task :runners:direct-java:classes UP-TO-DATE
> Task :sdks:java:io:kafka:compileJava UP-TO-DATE
> Task :sdks:java:io:kafka:classes UP-TO-DATE
> Task :sdks:java:io:kafka:jar UP-TO-DATE
> Task :runners:direct-java:shadowJar UP-TO-DATE
> Task :sdks:java:container:java11:copyDockerfileDependencies UP-TO-DATE
> Task :sdks:java:io:google-cloud-platform:compileJava UP-TO-DATE
> Task :sdks:java:io:google-cloud-platform:classes UP-TO-DATE
> Task :sdks:java:io:google-cloud-platform:jar UP-TO-DATE
> Task :runners:google-cloud-dataflow-java:compileJava UP-TO-DATE
> Task :runners:google-cloud-dataflow-java:classes UP-TO-DATE
> Task :runners:google-cloud-dataflow-java:jar UP-TO-DATE
> Task :sdks:java:extensions:sql:compileJava UP-TO-DATE
> Task :sdks:java:extensions:sql:classes UP-TO-DATE
> Task :sdks:java:extensions:sql:jar UP-TO-DATE
> Task :sdks:java:extensions:sql:zetasql:compileJava UP-TO-DATE
> Task :sdks:java:extensions:sql:zetasql:classes UP-TO-DATE
> Task :sdks:java:extensions:sql:zetasql:jar UP-TO-DATE
> Task :sdks:java:testing:nexmark:compileJava UP-TO-DATE
> Task :sdks:java:testing:nexmark:classes UP-TO-DATE
> Task :sdks:java:testing:nexmark:jar UP-TO-DATE
> Task :sdks:java:container:java11:dockerPrepare
> Task :sdks:java:container:java11:docker
> Task :runners:google-cloud-dataflow-java:buildAndPushDockerContainer
WARNING: `gcloud docker` will not be supported for Docker client versions above 18.03.
As an alternative, use `gcloud auth configure-docker` to configure `docker` to
use `gcloud` as a credential helper, then use `docker` as you would for non-GCR
registries, e.g. `docker pull gcr.io/project-id/my-image`. Add
`--verbosity=error` to silence this warning: `gcloud docker
--verbosity=error -- pull gcr.io/project-id/my-image`.
See: https://cloud.google.com/container-registry/docs/support/deprecation-notices#gcloud-docker
The push refers to repository [us.gcr.io/apache-beam-testing/java-postcommit-it/java]
ff66dc772041: Preparing
d6f67f40b45a: Preparing
94c36746a7f8: Preparing
0c19761275b4: Preparing
2867cacb1f8e: Preparing
7764137a2b18: Preparing
3f5726bb60a0: Preparing
45ad1d55ac17: Preparing
8edb37e4ca86: Preparing
4f5b41f7f878: Preparing
95be6ebc7125: Preparing
b728b1feac16: Preparing
a9e4c9343539: Preparing
47ee2d19f81a: Preparing
ab9d251e27cb: Preparing
8a5844586fdb: Preparing
a4aba4e59b40: Preparing
5499f2905579: Preparing
a36ba9e322f7: Preparing
45ad1d55ac17: Waiting
8edb37e4ca86: Waiting
95be6ebc7125: Waiting
4f5b41f7f878: Waiting
b728b1feac16: Waiting
a9e4c9343539: Waiting
7764137a2b18: Waiting
a4aba4e59b40: Waiting
47ee2d19f81a: Waiting
8a5844586fdb: Waiting
5499f2905579: Waiting
3f5726bb60a0: Waiting
2867cacb1f8e: Pushed
94c36746a7f8: Pushed
d6f67f40b45a: Pushed
0c19761275b4: Pushed
7764137a2b18: Pushed
45ad1d55ac17: Pushed
8edb37e4ca86: Pushed
3f5726bb60a0: Pushed
a9e4c9343539: Layer already exists
47ee2d19f81a: Layer already exists
ab9d251e27cb: Layer already exists
95be6ebc7125: Pushed
8a5844586fdb: Layer already exists
a4aba4e59b40: Layer already exists
5499f2905579: Layer already exists
a36ba9e322f7: Layer already exists
b728b1feac16: Pushed
4f5b41f7f878: Pushed
unknown blob
> Task :runners:google-cloud-dataflow-java:buildAndPushDockerContainer FAILED
FAILURE: Build failed with an exception.
* Where:
Build file '<https://ci-beam.apache.org/job/beam_PostCommit_Java_Nexmark_Dataflow_V2_Java11/ws/src/runners/google-cloud-dataflow-java/build.gradle'> line: 267
* What went wrong:
Execution failed for task ':runners:google-cloud-dataflow-java:buildAndPushDockerContainer'.
> Process 'command 'gcloud'' finished with non-zero exit value 1
* Try:
Run with --stacktrace option to get the stack trace. Run with --info or --debug option to get more log output. Run with --scan to get full insights.
* Get more help at https://help.gradle.org
Deprecated Gradle features were used in this build, making it incompatible with Gradle 7.0.
Use '--warning-mode all' to show the individual deprecation warnings.
See https://docs.gradle.org/6.9.1/userguide/command_line_interface.html#sec:command_line_warnings
BUILD FAILED in 29s
121 actionable tasks: 8 executed, 113 up-to-date
Publishing build scan...
https://gradle.com/s/kybir2r422mcg
Build step 'Invoke Gradle script' changed build result to FAILURE
Build step 'Invoke Gradle script' marked build as failure
---------------------------------------------------------------------
To unsubscribe, e-mail: builds-unsubscribe@beam.apache.org
For additional commands, e-mail: builds-help@beam.apache.org
beam_PostCommit_Java_Nexmark_Dataflow_V2_Java11 - Build # 721 - Aborted!
Posted by Apache Jenkins Server <je...@builds.apache.org>.
beam_PostCommit_Java_Nexmark_Dataflow_V2_Java11 - Build # 721 - Aborted:
Check console output at https://ci-beam.apache.org/job/beam_PostCommit_Java_Nexmark_Dataflow_V2_Java11/721/ to view the results.