You are viewing a plain text version of this content. The canonical link for it is here.
Posted to jetspeed-user@portals.apache.org by Bob Fleischman <bo...@mindspring.com> on 2004/06/15 04:54:03 UTC
Maven Error Details
I'm sure the move to Maven is a good thing. It is just taking a bit of time
to get familiar with it.
When I run 'maven war' I am getting the follow (excerpted) output:
[junit] Running org.apache.jetspeed.services.security.TestRoleManagement
[junit] INFO - loading component: name=torque
class=org.apache.torque.Torque config=webapp\WEB-INF\conf\Torque.properties
[junit] INFO - loading component: name=fulcrum
class=org.apache.fulcrum.Fulcrum
config=webapp\WEB-INF\conf\Fulcrum.properties
[junit] INFO - Finished initializing all services!
[junit] Tests run: 9, Failures: 2, Errors: 0, Time elapsed: 3.885 sec
[junit] [ERROR] TEST
org.apache.jetspeed.services.security.TestRoleManagement FAILED
[junit] Running
org.apache.jetspeed.services.security.TestGroupManagement
[junit] INFO - loading component: name=torque
class=org.apache.torque.Torque
config=webapp\WEB-INF\conf\Torque.properties
[junit] INFO - loading component: name=fulcrum
class=org.apache.fulcrum.Fulcrum
config=webapp\WEB-INF\conf\Fulcrum.properties
[junit] INFO - Finished initializing all services!
[junit] Tests run: 9, Failures: 2, Errors: 0, Time elapsed: 5.628 sec
[junit] [ERROR] TEST
org.apache.jetspeed.services.security.TestGroupManagement FAILED
Is there a log that give me more detail so I can determine exactly which
test in the suite failed?
Thanks
Bob
---------------------------------------------------------------------
To unsubscribe, e-mail: jetspeed-user-unsubscribe@jakarta.apache.org
For additional commands, e-mail: jetspeed-user-help@jakarta.apache.org
RE: Maven Error Details
Posted by Bob Fleischman <bo...@mindspring.com>.
Great. This will be a big help. Thanks
-----Original Message-----
From: David Sean Taylor [mailto:david@bluesunrise.com]
Sent: Tuesday, June 15, 2004 3:52 AM
To: Jetspeed Users List
Subject: Re: Maven Error Details
On Jun 14, 2004, at 8:08 PM, Bob Fleischman wrote:
> Also, can I run and debug one suite of tests?
maven
-Dtest.case=org.apache.jetspeed.services.security.TestRoleManagement
test:single
or you can define the test case as a property then run
maven test:single
>
> -----Original Message-----
> From: Bob Fleischman [mailto:bob.fleischman@mindspring.com]
> Sent: Monday, June 14, 2004 10:54 PM
> To: Jetspeed Users List (E-mail)
> Subject: Maven Error Details
>
>
> I'm sure the move to Maven is a good thing. It is just taking a bit of
> time
> to get familiar with it.
>
i agree, maybe Maven 2 will make our lives easier
> [junit] INFO - Finished initializing all services!
> [junit] Tests run: 9, Failures: 2, Errors: 0, Time elapsed: 5.628
> sec
> [junit] [ERROR] TEST
> org.apache.jetspeed.services.security.TestGroupManagement FAILED
>
> Is there a log that give me more detail so I can determine exactly
> which
> test in the suite failed?
>
Check under the target/test-reports directory
---------------------------------------------------------------------
To unsubscribe, e-mail: jetspeed-user-unsubscribe@jakarta.apache.org
For additional commands, e-mail: jetspeed-user-help@jakarta.apache.org
---------------------------------------------------------------------
To unsubscribe, e-mail: jetspeed-user-unsubscribe@jakarta.apache.org
For additional commands, e-mail: jetspeed-user-help@jakarta.apache.org
Re: Maven Error Details
Posted by David Sean Taylor <da...@bluesunrise.com>.
On Jun 14, 2004, at 8:08 PM, Bob Fleischman wrote:
> Also, can I run and debug one suite of tests?
maven
-Dtest.case=org.apache.jetspeed.services.security.TestRoleManagement
test:single
or you can define the test case as a property then run
maven test:single
>
> -----Original Message-----
> From: Bob Fleischman [mailto:bob.fleischman@mindspring.com]
> Sent: Monday, June 14, 2004 10:54 PM
> To: Jetspeed Users List (E-mail)
> Subject: Maven Error Details
>
>
> I'm sure the move to Maven is a good thing. It is just taking a bit of
> time
> to get familiar with it.
>
i agree, maybe Maven 2 will make our lives easier
> [junit] INFO - Finished initializing all services!
> [junit] Tests run: 9, Failures: 2, Errors: 0, Time elapsed: 5.628
> sec
> [junit] [ERROR] TEST
> org.apache.jetspeed.services.security.TestGroupManagement FAILED
>
> Is there a log that give me more detail so I can determine exactly
> which
> test in the suite failed?
>
Check under the target/test-reports directory
---------------------------------------------------------------------
To unsubscribe, e-mail: jetspeed-user-unsubscribe@jakarta.apache.org
For additional commands, e-mail: jetspeed-user-help@jakarta.apache.org
RE: Maven Error Details
Posted by Bob Fleischman <bo...@mindspring.com>.
Also, can I run and debug one suite of tests?
-----Original Message-----
From: Bob Fleischman [mailto:bob.fleischman@mindspring.com]
Sent: Monday, June 14, 2004 10:54 PM
To: Jetspeed Users List (E-mail)
Subject: Maven Error Details
I'm sure the move to Maven is a good thing. It is just taking a bit of time
to get familiar with it.
When I run 'maven war' I am getting the follow (excerpted) output:
[junit] Running org.apache.jetspeed.services.security.TestRoleManagement
[junit] INFO - loading component: name=torque
class=org.apache.torque.Torque config=webapp\WEB-INF\conf\Torque.properties
[junit] INFO - loading component: name=fulcrum
class=org.apache.fulcrum.Fulcrum
config=webapp\WEB-INF\conf\Fulcrum.properties
[junit] INFO - Finished initializing all services!
[junit] Tests run: 9, Failures: 2, Errors: 0, Time elapsed: 3.885 sec
[junit] [ERROR] TEST
org.apache.jetspeed.services.security.TestRoleManagement FAILED
[junit] Running
org.apache.jetspeed.services.security.TestGroupManagement
[junit] INFO - loading component: name=torque
class=org.apache.torque.Torque
config=webapp\WEB-INF\conf\Torque.properties
[junit] INFO - loading component: name=fulcrum
class=org.apache.fulcrum.Fulcrum
config=webapp\WEB-INF\conf\Fulcrum.properties
[junit] INFO - Finished initializing all services!
[junit] Tests run: 9, Failures: 2, Errors: 0, Time elapsed: 5.628 sec
[junit] [ERROR] TEST
org.apache.jetspeed.services.security.TestGroupManagement FAILED
Is there a log that give me more detail so I can determine exactly which
test in the suite failed?
Thanks
Bob
---------------------------------------------------------------------
To unsubscribe, e-mail: jetspeed-user-unsubscribe@jakarta.apache.org
For additional commands, e-mail: jetspeed-user-help@jakarta.apache.org
---------------------------------------------------------------------
To unsubscribe, e-mail: jetspeed-user-unsubscribe@jakarta.apache.org
For additional commands, e-mail: jetspeed-user-help@jakarta.apache.org