You are viewing a plain text version of this content. The canonical link for it is here.
Posted to builds@beam.apache.org by Apache Jenkins Server <je...@builds.apache.org> on 2023/05/08 17:06:40 UTC

Build failed in Jenkins: beam_PostCommit_Java_VR_Dataflow_V2 #3693

See <https://ci-beam.apache.org/job/beam_PostCommit_Java_VR_Dataflow_V2/3693/display/redirect>

Changes:


------------------------------------------
[...truncated 60.56 KB...]
    Uninstalling setuptools-44.0.0:
      Successfully uninstalled setuptools-44.0.0
Successfully installed pip-23.1.2 setuptools-67.7.2 wheel-0.40.0
Collecting beautifulsoup4<5.0,>=4.9.0 (from -r <https://ci-beam.apache.org/job/beam_PostCommit_Java_VR_Dataflow_V2/ws/src/sdks/java/container/license_scripts/requirement.txt> (line 19))
  Using cached beautifulsoup4-4.12.2-py3-none-any.whl (142 kB)
Collecting pyyaml<6.0.0,>=3.12 (from -r <https://ci-beam.apache.org/job/beam_PostCommit_Java_VR_Dataflow_V2/ws/src/sdks/java/container/license_scripts/requirement.txt> (line 20))
  Using cached PyYAML-5.4.1-cp38-cp38-manylinux1_x86_64.whl (662 kB)
Collecting tenacity<9.0,>=6.1.0 (from -r <https://ci-beam.apache.org/job/beam_PostCommit_Java_VR_Dataflow_V2/ws/src/sdks/java/container/license_scripts/requirement.txt> (line 21))
  Using cached tenacity-8.2.2-py3-none-any.whl (24 kB)
Collecting soupsieve>1.2 (from beautifulsoup4<5.0,>=4.9.0->-r <https://ci-beam.apache.org/job/beam_PostCommit_Java_VR_Dataflow_V2/ws/src/sdks/java/container/license_scripts/requirement.txt> (line 19))
  Using cached soupsieve-2.4.1-py3-none-any.whl (36 kB)
Installing collected packages: tenacity, soupsieve, pyyaml, beautifulsoup4
Successfully installed beautifulsoup4-4.12.2 pyyaml-5.4.1 soupsieve-2.4.1 tenacity-8.2.2
Executing python <https://ci-beam.apache.org/job/beam_PostCommit_Java_VR_Dataflow_V2/ws/src/sdks/java/container/license_scripts/pull_licenses_java.py> --license_index=<https://ci-beam.apache.org/job/beam_PostCommit_Java_VR_Dataflow_V2/ws/src/sdks/java/container/build/reports/dependency-license/index.json>        --output_dir=<https://ci-beam.apache.org/job/beam_PostCommit_Java_VR_Dataflow_V2/ws/src/sdks/java/container/build/target/java_third_party_licenses>        --dep_url_yaml=<https://ci-beam.apache.org/job/beam_PostCommit_Java_VR_Dataflow_V2/ws/src/sdks/java/container/license_scripts/dep_urls_java.yaml>        --manual_license_path=<https://ci-beam.apache.org/job/beam_PostCommit_Java_VR_Dataflow_V2/ws/src/sdks/java/container/license_scripts/manual_licenses>
INFO:root:Pulling license for 124 dependencies using 16 threads.
INFO:root:Replaced local file URL with file://<https://ci-beam.apache.org/job/beam_PostCommit_Java_VR_Dataflow_V2/ws/src/sdks/java/container/license_scripts/manual_licenses/xz/COPYING> for xz-1.5
INFO:root:pull_licenses_java.py succeed. It took 1.369572 seconds with 16 threads.
Copying licenses from <https://ci-beam.apache.org/job/beam_PostCommit_Java_VR_Dataflow_V2/ws/src/sdks/java/container/build/target/java_third_party_licenses> to <https://ci-beam.apache.org/job/beam_PostCommit_Java_VR_Dataflow_V2/ws/src/sdks/java/container/build/target/third_party_licenses.>
Finished license_scripts.sh

> Task :sdks:java:container:goPrepare UP-TO-DATE

> Task :release:go-licenses:java:dockerRun
W0508 12:50:57.603499      37 library.go:101] "golang.org/x/sys/unix" contains non-Go code that can't be inspected for further dependencies:
/go/pkg/mod/golang.org/x/sys@v0.5.0/unix/asm_linux_amd64.s
+ go-licenses csv github.com/apache/beam/sdks/v2/java/container
+ tee /output/licenses/list.csv

> Task :sdks:java:container:java8:copyJavaThirdPartyLicenses

> Task :sdks:java:container:goBuild
/home/jenkins/go/bin/go1.20.2 build -o ./build/target/linux_amd64/boot boot.go boot_test.go pathingjar.go pathingjar_test.go

> Task :sdks:java:container:java8:copySdkHarnessLauncher
Execution optimizations have been disabled for task ':sdks:java:container:java8:copySdkHarnessLauncher' to ensure correctness due to the following reasons:
  - Gradle detected a problem with the following location: '<https://ci-beam.apache.org/job/beam_PostCommit_Java_VR_Dataflow_V2/ws/src/sdks/java/container/build/target'.> Reason: Task ':sdks:java:container:java8:copySdkHarnessLauncher' uses this output of task ':sdks:java:container:downloadCloudProfilerAgent' without declaring an explicit or implicit dependency. This can lead to incorrect results being produced, depending on what order the tasks are executed. Please refer to https://docs.gradle.org/7.5.1/userguide/validation_problems.html#implicit_dependency for more details about this problem.
  - Gradle detected a problem with the following location: '<https://ci-beam.apache.org/job/beam_PostCommit_Java_VR_Dataflow_V2/ws/src/sdks/java/container/build/target'.> Reason: Task ':sdks:java:container:java8:copySdkHarnessLauncher' uses this output of task ':sdks:java:container:pullLicenses' without declaring an explicit or implicit dependency. This can lead to incorrect results being produced, depending on what order the tasks are executed. Please refer to https://docs.gradle.org/7.5.1/userguide/validation_problems.html#implicit_dependency for more details about this problem.

> Task :release:go-licenses:java:dockerRun
W0508 12:51:01.833019      81 library.go:101] "golang.org/x/sys/unix" contains non-Go code that can't be inspected for further dependencies:
/go/pkg/mod/golang.org/x/sys@v0.5.0/unix/asm_linux_amd64.s
github.com/apache/beam/sdks/v2/go/pkg/beam,https://github.com/apache/beam/blob/sdks/v2.46.0/sdks/go/README.md,Apache-2.0
github.com/apache/beam/sdks/v2/java/container,https://github.com/apache/beam/blob/sdks/v2.46.0/sdks/LICENSE,Apache-2.0
github.com/golang/protobuf,https://github.com/golang/protobuf/blob/v1.5.2/LICENSE,BSD-3-Clause
golang.org/x/net,https://cs.opensource.google/go/x/net/+/v0.5.0:LICENSE,BSD-3-Clause
golang.org/x/sys/unix,https://cs.opensource.google/go/x/sys/+/v0.5.0:LICENSE,BSD-3-Clause
golang.org/x/text,https://cs.opensource.google/go/x/text/+/v0.7.0:LICENSE,BSD-3-Clause
google.golang.org/genproto/googleapis/rpc/status,https://github.com/googleapis/go-genproto/blob/76db0878b65f/LICENSE,Apache-2.0
google.golang.org/grpc,https://github.com/grpc/grpc-go/blob/v1.52.3/LICENSE,Apache-2.0
google.golang.org/protobuf,https://github.com/protocolbuffers/protobuf-go/blob/v1.28.1/LICENSE,BSD-3-Clause
+ chmod -R a+w /output/licenses

> Task :release:go-licenses:java:createLicenses
> Task :sdks:java:container:java8:copyGolangLicenses
> Task :sdks:java:container:java8:dockerPrepare

> Task :sdks:java:container:java8:docker
#1 [internal] load build definition from Dockerfile
#1 transferring dockerfile: 2.58kB done
#1 DONE 0.0s

#2 [internal] load .dockerignore
#2 transferring context: 2B done
#2 DONE 0.0s

#3 [internal] load metadata for docker.io/library/eclipse-temurin:8
#3 DONE 0.4s

#4 [ 1/16] FROM docker.io/library/eclipse-temurin:8@sha256:a473a9395cb524db4e40f110da1b96f2b357937e9a8ffb56920f97b85de80967
#4 resolve docker.io/library/eclipse-temurin:8@sha256:a473a9395cb524db4e40f110da1b96f2b357937e9a8ffb56920f97b85de80967 0.0s done
#4 CACHED

#5 [internal] load build context
#5 transferring context: 46.97MB 0.4s done
#5 DONE 0.4s

#6 [ 2/16] ADD target/slf4j-api.jar /opt/apache/beam/jars/
#6 DONE 1.2s

#7 [ 3/16] ADD target/slf4j-jdk14.jar /opt/apache/beam/jars/
#7 DONE 0.1s

#8 [ 4/16] ADD target/jcl-over-slf4j.jar /opt/apache/beam/jars/
#8 DONE 0.0s

#9 [ 5/16] ADD target/log4j-over-slf4j.jar /opt/apache/beam/jars/
#9 DONE 0.1s

#10 [ 6/16] ADD target/log4j-to-slf4j.jar /opt/apache/beam/jars/
#10 DONE 0.1s

#11 [ 7/16] ADD target/beam-sdks-java-harness.jar /opt/apache/beam/jars/
#11 DONE 0.1s

#12 [ 8/16] COPY target/jamm.jar target/open-module-agent*.jar /opt/apache/beam/jars/
#12 DONE 0.1s

#13 [ 9/16] COPY target/linux_amd64/boot /opt/apache/beam/
#13 DONE 0.2s

#14 [10/16] COPY target/LICENSE /opt/apache/beam/
#14 DONE 0.0s

#15 [11/16] COPY target/NOTICE /opt/apache/beam/
#15 DONE 0.1s

#16 [12/16] ADD target/third_party_licenses /opt/apache/beam/third_party_licenses/
#16 DONE 0.2s

#17 [13/16] COPY target/LICENSE target/options/* /opt/apache/beam/options/
#17 DONE 0.1s

#18 [14/16] COPY target/go-licenses/* /opt/apache/beam/third_party_licenses/golang/
#18 DONE 0.1s

#19 [15/16] RUN if [ "true" = "false" ] ; then     rm -rf /opt/apache/beam/third_party_licenses ;    fi
#19 DONE 0.3s

#20 [16/16] COPY target/profiler/* /opt/google_cloud_profiler/
#20 DONE 0.1s

#21 exporting to image
#21 exporting layers
#21 exporting layers 0.3s done
#21 writing image sha256:7b70ad993da78f889aff7fe4310ad645ff538f5ac0688c5bc8719c843b74df86 done
#21 naming to docker.io/apache/beam_java8_sdk:2.48.0.dev done
#21 DONE 0.3s

> Task :runners:google-cloud-dataflow-java:buildAndPushDockerJavaContainer
WARNING: `gcloud docker` will not be supported for Docker client versions above 18.03.

As an alternative, use `gcloud auth configure-docker` to configure `docker` to
use `gcloud` as a credential helper, then use `docker` as you would for non-GCR
registries, e.g. `docker pull gcr.io/project-id/my-image`. Add
`--verbosity=error` to silence this warning: `gcloud docker
--verbosity=error -- pull gcr.io/project-id/my-image`.

See: https://cloud.google.com/container-registry/docs/support/deprecation-notices#gcloud-docker

The push refers to repository [us.gcr.io/apache-beam-testing/java-postcommit-it/java]
1d57f7892dd2: Preparing
5f70bf18a086: Preparing
8abb9c0c1c40: Preparing
262b7d4baa76: Preparing
cc86e23143d2: Preparing
736422be2f16: Preparing
116df20fa553: Preparing
085f9da6c455: Preparing
b307965d6462: Preparing
57e26e01c952: Preparing
5e879b763c29: Preparing
bd482a1929bd: Preparing
113ef5baeec4: Preparing
519074b41fb8: Preparing
64b8a278801f: Preparing
3eb3677be944: Preparing
9091f97c3a30: Preparing
c45c46033aa8: Preparing
b8a36d10656a: Preparing
5e879b763c29: Waiting
085f9da6c455: Waiting
113ef5baeec4: Waiting
bd482a1929bd: Waiting
b307965d6462: Waiting
519074b41fb8: Waiting
116df20fa553: Waiting
736422be2f16: Waiting
57e26e01c952: Waiting
9091f97c3a30: Waiting
b8a36d10656a: Waiting
64b8a278801f: Waiting
5f70bf18a086: Layer already exists
8abb9c0c1c40: Pushed
262b7d4baa76: Pushed
736422be2f16: Pushed
cc86e23143d2: Pushed
1d57f7892dd2: Pushed
116df20fa553: Pushed
b307965d6462: Pushed
5e879b763c29: Pushed
57e26e01c952: Pushed
085f9da6c455: Pushed
3eb3677be944: Layer already exists
9091f97c3a30: Layer already exists
bd482a1929bd: Pushed
c45c46033aa8: Layer already exists
b8a36d10656a: Layer already exists
113ef5baeec4: Pushed
519074b41fb8: Pushed
64b8a278801f: Pushed
20230508125040: digest: sha256:bc01ed3205c177e1dc36fa5e397ab1e300ddeda4ce5b917c56c70c078bff6761 size: 4296

> Task :runners:google-cloud-dataflow-java:validatesRunnerV2Test

org.apache.beam.sdk.testing.PAssertTest > testContainsInAnyOrderFalse FAILED
    java.lang.AssertionError at PAssertTest.java:495

org.apache.beam.sdk.transforms.windowing.WindowTest > testMergingCustomWindowsWithoutCustomWindowTypes FAILED
    java.lang.RuntimeException at WindowTest.java:696

220 tests completed, 2 failed, 1 skipped

> Task :runners:google-cloud-dataflow-java:validatesRunnerV2Test FAILED

FAILURE: Build failed with an exception.

* What went wrong:
Execution failed for task ':runners:google-cloud-dataflow-java:validatesRunnerV2Test'.
> There were failing tests. See the report at: file://<https://ci-beam.apache.org/job/beam_PostCommit_Java_VR_Dataflow_V2/ws/src/runners/google-cloud-dataflow-java/build/reports/tests/validatesRunnerV2Test/index.html>

* Try:
> Run with --stacktrace option to get the stack trace.
> Run with --info or --debug option to get more log output.

* Get more help at https://help.gradle.org

Deprecated Gradle features were used in this build, making it incompatible with Gradle 8.0.

You can use '--warning-mode all' to show the individual deprecation warnings and determine if they come from your own scripts or plugins.

See https://docs.gradle.org/7.5.1/userguide/command_line_interface.html#sec:command_line_warnings

Execution optimizations have been disabled for 1 invalid unit(s) of work during this build to ensure correctness.
Please consult deprecation warnings for more details.

BUILD FAILED in 4h 16m 11s
148 actionable tasks: 94 executed, 50 from cache, 4 up-to-date
Build scan background action failed.
java.lang.IllegalArgumentException: com.gradle.enterprise.gradleplugin.internal.extension.a is not an interface
	at java.lang.reflect.Proxy$ProxyClassFactory.apply(Proxy.java:590)
	at java.lang.reflect.Proxy$ProxyClassFactory.apply(Proxy.java:557)
	at java.lang.reflect.WeakCache$Factory.get(WeakCache.java:230)
	at java.lang.reflect.WeakCache.get(WeakCache.java:127)
	at java.lang.reflect.Proxy.getProxyClass0(Proxy.java:419)
	at java.lang.reflect.Proxy.newProxyInstance(Proxy.java:719)
	at com.gradle.ProxyFactory$ProxyingInvocationHandler.createLocalProxy(ProxyFactory.java:66)
	at com.gradle.ProxyFactory$ProxyingInvocationHandler.lambda$adaptActionArg$1(ProxyFactory.java:61)
	at com.gradle.enterprise.gradleplugin.internal.extension.b$3.run(SourceFile:100)
	at java.util.concurrent.Executors$RunnableAdapter.call(Executors.java:511)
	at java.util.concurrent.FutureTask.run(FutureTask.java:266)
	at java.util.concurrent.ThreadPoolExecutor.runWorker(ThreadPoolExecutor.java:1149)
	at java.util.concurrent.ThreadPoolExecutor$Worker.run(ThreadPoolExecutor.java:624)
	at java.lang.Thread.run(Thread.java:750)

Publishing build scan...
https://ge.apache.org/s/dbkaqlokvq65e

Build step 'Invoke Gradle script' changed build result to FAILURE
Build step 'Invoke Gradle script' marked build as failure

---------------------------------------------------------------------
To unsubscribe, e-mail: builds-unsubscribe@beam.apache.org
For additional commands, e-mail: builds-help@beam.apache.org


Jenkins build is back to normal : beam_PostCommit_Java_VR_Dataflow_V2 #3698

Posted by Apache Jenkins Server <je...@builds.apache.org>.
See <https://ci-beam.apache.org/job/beam_PostCommit_Java_VR_Dataflow_V2/3698/display/redirect?page=changes>


---------------------------------------------------------------------
To unsubscribe, e-mail: builds-unsubscribe@beam.apache.org
For additional commands, e-mail: builds-help@beam.apache.org


Build failed in Jenkins: beam_PostCommit_Java_VR_Dataflow_V2 #3697

Posted by Apache Jenkins Server <je...@builds.apache.org>.
See <https://ci-beam.apache.org/job/beam_PostCommit_Java_VR_Dataflow_V2/3697/display/redirect>

Changes:


------------------------------------------
[...truncated 64.48 KB...]

> Task :sdks:java:container:java8:copySdkHarnessLauncher
Execution optimizations have been disabled for task ':sdks:java:container:java8:copySdkHarnessLauncher' to ensure correctness due to the following reasons:
  - Gradle detected a problem with the following location: '<https://ci-beam.apache.org/job/beam_PostCommit_Java_VR_Dataflow_V2/ws/src/sdks/java/container/build/target'.> Reason: Task ':sdks:java:container:java8:copySdkHarnessLauncher' uses this output of task ':sdks:java:container:downloadCloudProfilerAgent' without declaring an explicit or implicit dependency. This can lead to incorrect results being produced, depending on what order the tasks are executed. Please refer to https://docs.gradle.org/7.5.1/userguide/validation_problems.html#implicit_dependency for more details about this problem.
  - Gradle detected a problem with the following location: '<https://ci-beam.apache.org/job/beam_PostCommit_Java_VR_Dataflow_V2/ws/src/sdks/java/container/build/target'.> Reason: Task ':sdks:java:container:java8:copySdkHarnessLauncher' uses this output of task ':sdks:java:container:pullLicenses' without declaring an explicit or implicit dependency. This can lead to incorrect results being produced, depending on what order the tasks are executed. Please refer to https://docs.gradle.org/7.5.1/userguide/validation_problems.html#implicit_dependency for more details about this problem.

> Task :release:go-licenses:java:dockerRun
W0509 12:51:35.839164      83 library.go:101] "golang.org/x/sys/unix" contains non-Go code that can't be inspected for further dependencies:
/go/pkg/mod/golang.org/x/sys@v0.5.0/unix/asm_linux_amd64.s
github.com/apache/beam/sdks/v2/go/pkg/beam,https://github.com/apache/beam/blob/sdks/v2.46.0/sdks/go/README.md,Apache-2.0
github.com/apache/beam/sdks/v2/java/container,https://github.com/apache/beam/blob/sdks/v2.46.0/sdks/LICENSE,Apache-2.0
github.com/golang/protobuf,https://github.com/golang/protobuf/blob/v1.5.2/LICENSE,BSD-3-Clause
golang.org/x/net,https://cs.opensource.google/go/x/net/+/v0.5.0:LICENSE,BSD-3-Clause
golang.org/x/sys/unix,https://cs.opensource.google/go/x/sys/+/v0.5.0:LICENSE,BSD-3-Clause
golang.org/x/text,https://cs.opensource.google/go/x/text/+/v0.7.0:LICENSE,BSD-3-Clause
google.golang.org/genproto/googleapis/rpc/status,https://github.com/googleapis/go-genproto/blob/76db0878b65f/LICENSE,Apache-2.0
google.golang.org/grpc,https://github.com/grpc/grpc-go/blob/v1.52.3/LICENSE,Apache-2.0
google.golang.org/protobuf,https://github.com/protocolbuffers/protobuf-go/blob/v1.28.1/LICENSE,BSD-3-Clause
+ chmod -R a+w /output/licenses

> Task :release:go-licenses:java:createLicenses
> Task :sdks:java:container:java8:copyGolangLicenses
> Task :sdks:java:container:java8:dockerPrepare

> Task :sdks:java:container:java8:docker
#1 [internal] load build definition from Dockerfile
#1 transferring dockerfile: 2.58kB done
#1 DONE 0.0s

#2 [internal] load .dockerignore
#2 transferring context: 2B done
#2 DONE 0.0s

#3 [internal] load metadata for docker.io/library/eclipse-temurin:8
#3 DONE 0.3s

#4 [ 1/16] FROM docker.io/library/eclipse-temurin:8@sha256:a473a9395cb524db4e40f110da1b96f2b357937e9a8ffb56920f97b85de80967
#4 resolve docker.io/library/eclipse-temurin:8@sha256:a473a9395cb524db4e40f110da1b96f2b357937e9a8ffb56920f97b85de80967 0.0s done
#4 CACHED

#5 [internal] load build context
#5 transferring context: 46.97MB 0.3s done
#5 DONE 0.4s

#6 [ 2/16] ADD target/slf4j-api.jar /opt/apache/beam/jars/
#6 DONE 1.1s

#7 [ 3/16] ADD target/slf4j-jdk14.jar /opt/apache/beam/jars/
#7 DONE 0.1s

#8 [ 4/16] ADD target/jcl-over-slf4j.jar /opt/apache/beam/jars/
#8 DONE 0.0s

#9 [ 5/16] ADD target/log4j-over-slf4j.jar /opt/apache/beam/jars/
#9 DONE 0.0s

#10 [ 6/16] ADD target/log4j-to-slf4j.jar /opt/apache/beam/jars/
#10 DONE 0.0s

#11 [ 7/16] ADD target/beam-sdks-java-harness.jar /opt/apache/beam/jars/
#11 DONE 0.1s

#12 [ 8/16] COPY target/jamm.jar target/open-module-agent*.jar /opt/apache/beam/jars/
#12 DONE 0.1s

#13 [ 9/16] COPY target/linux_amd64/boot /opt/apache/beam/
#13 DONE 0.2s

#14 [10/16] COPY target/LICENSE /opt/apache/beam/
#14 DONE 0.0s

#15 [11/16] COPY target/NOTICE /opt/apache/beam/
#15 DONE 0.0s

#16 [12/16] ADD target/third_party_licenses /opt/apache/beam/third_party_licenses/
#16 DONE 0.2s

#17 [13/16] COPY target/LICENSE target/options/* /opt/apache/beam/options/
#17 DONE 0.1s

#18 [14/16] COPY target/go-licenses/* /opt/apache/beam/third_party_licenses/golang/
#18 DONE 0.1s

#19 [15/16] RUN if [ "true" = "false" ] ; then     rm -rf /opt/apache/beam/third_party_licenses ;    fi
#19 DONE 0.3s

#20 [16/16] COPY target/profiler/* /opt/google_cloud_profiler/
#20 DONE 0.1s

#21 exporting to image
#21 exporting layers
#21 exporting layers 0.3s done
#21 writing image sha256:3e584c8265f8f7647132c0c27380ff2249365a4416c23210bfdd71e1ef694265 done
#21 naming to docker.io/apache/beam_java8_sdk:2.48.0.dev done
#21 DONE 0.3s

> Task :runners:google-cloud-dataflow-java:buildAndPushDockerJavaContainer
WARNING: `gcloud docker` will not be supported for Docker client versions above 18.03.

As an alternative, use `gcloud auth configure-docker` to configure `docker` to
use `gcloud` as a credential helper, then use `docker` as you would for non-GCR
registries, e.g. `docker pull gcr.io/project-id/my-image`. Add
`--verbosity=error` to silence this warning: `gcloud docker
--verbosity=error -- pull gcr.io/project-id/my-image`.

See: https://cloud.google.com/container-registry/docs/support/deprecation-notices#gcloud-docker

The push refers to repository [us.gcr.io/apache-beam-testing/java-postcommit-it/java]
9d54235ef03f: Preparing
5f70bf18a086: Preparing
073addd127df: Preparing
512553728bae: Preparing
d9c42c25beb3: Preparing
a6166b98d247: Preparing
54c854a05dec: Preparing
64a6f836c185: Preparing
f22d0deb5891: Preparing
3bf6ce7e0d7b: Preparing
28d443d0ffb4: Preparing
5ba82858ecae: Preparing
d03e7a8fae08: Preparing
3a3018a2a2d5: Preparing
ae305bcb2079: Preparing
3eb3677be944: Preparing
9091f97c3a30: Preparing
c45c46033aa8: Preparing
b8a36d10656a: Preparing
f22d0deb5891: Waiting
54c854a05dec: Waiting
a6166b98d247: Waiting
3bf6ce7e0d7b: Waiting
28d443d0ffb4: Waiting
5ba82858ecae: Waiting
3eb3677be944: Waiting
d03e7a8fae08: Waiting
3a3018a2a2d5: Waiting
ae305bcb2079: Waiting
c45c46033aa8: Waiting
5f70bf18a086: Layer already exists
512553728bae: Pushed
073addd127df: Pushed
a6166b98d247: Pushed
9d54235ef03f: Pushed
d9c42c25beb3: Pushed
54c854a05dec: Pushed
f22d0deb5891: Pushed
64a6f836c185: Pushed
28d443d0ffb4: Pushed
5ba82858ecae: Pushed
3eb3677be944: Layer already exists
3bf6ce7e0d7b: Pushed
9091f97c3a30: Layer already exists
c45c46033aa8: Layer already exists
b8a36d10656a: Layer already exists
d03e7a8fae08: Pushed
3a3018a2a2d5: Pushed
ae305bcb2079: Pushed
20230509125113: digest: sha256:cbfb0de983a9f79bf9deb9682ee02c146bef3c5e373b07ce98c4a25b115dc95d size: 4296

> Task :runners:google-cloud-dataflow-java:validatesRunnerV2Test

org.apache.beam.sdk.testing.PAssertTest > testAssertionSiteIsCapturedWithMessage FAILED
    java.lang.AssertionError at PAssertTest.java:554

org.apache.beam.sdk.testing.PAssertTest > testEmptyFalse FAILED
    java.lang.AssertionError at PAssertTest.java:514

org.apache.beam.sdk.testing.PAssertTest > testPAssertThatListSatisfiesOneMatcherFalse FAILED
    java.lang.AssertionError at PAssertTest.java:700

org.apache.beam.sdk.testing.PAssertTest > testPAssertEqualsSingletonFalse FAILED
    java.lang.AssertionError at PAssertTest.java:384

org.apache.beam.sdk.testing.PAssertTest > testPAssertEqualsSingletonFalseDefaultReasonString FAILED
    java.lang.AssertionError at PAssertTest.java:400

org.apache.beam.sdk.testing.PAssertTest > testPAssertThatFlattenedFalse FAILED
    java.lang.AssertionError at PAssertTest.java:652

org.apache.beam.sdk.testing.PAssertTest > testEmptyFalseDefaultReasonString FAILED
    java.lang.AssertionError at PAssertTest.java:528

org.apache.beam.sdk.testing.PAssertTest > testPAssertThatListSatisfiesMultipleMatchersFalse FAILED
    java.lang.AssertionError at PAssertTest.java:762

org.apache.beam.sdk.transforms.ParDoTest$LifecycleTests > testParDoWithErrorInStartBatch FAILED
    java.lang.AssertionError at MatcherAssert.java:18

org.apache.beam.sdk.transforms.ParDoTest$LifecycleTests > testParDoWithErrorInProcessElement FAILED
    java.lang.AssertionError at MatcherAssert.java:18

org.apache.beam.sdk.testing.PAssertTest > testAssertionSiteIsCapturedWithoutMessage FAILED
    java.lang.AssertionError at PAssertTest.java:570

org.apache.beam.sdk.transforms.ParDoTest$LifecycleTests > testParDoWithErrorInFinishBatch FAILED
    java.lang.AssertionError at MatcherAssert.java:18

org.apache.beam.sdk.testing.PAssertTest > testContainsInAnyOrderFalse FAILED
    java.lang.AssertionError at PAssertTest.java:495

220 tests completed, 13 failed, 1 skipped

> Task :runners:google-cloud-dataflow-java:validatesRunnerV2Test FAILED

FAILURE: Build failed with an exception.

* What went wrong:
Execution failed for task ':runners:google-cloud-dataflow-java:validatesRunnerV2Test'.
> There were failing tests. See the report at: file://<https://ci-beam.apache.org/job/beam_PostCommit_Java_VR_Dataflow_V2/ws/src/runners/google-cloud-dataflow-java/build/reports/tests/validatesRunnerV2Test/index.html>

* Try:
> Run with --stacktrace option to get the stack trace.
> Run with --info or --debug option to get more log output.

* Get more help at https://help.gradle.org

Deprecated Gradle features were used in this build, making it incompatible with Gradle 8.0.

You can use '--warning-mode all' to show the individual deprecation warnings and determine if they come from your own scripts or plugins.

See https://docs.gradle.org/7.5.1/userguide/command_line_interface.html#sec:command_line_warnings

Execution optimizations have been disabled for 1 invalid unit(s) of work during this build to ensure correctness.
Please consult deprecation warnings for more details.

BUILD FAILED in 4h 18m 2s
148 actionable tasks: 94 executed, 50 from cache, 4 up-to-date
Build scan background action failed.
java.lang.IllegalArgumentException: com.gradle.enterprise.gradleplugin.internal.extension.a is not an interface
	at java.lang.reflect.Proxy$ProxyClassFactory.apply(Proxy.java:590)
	at java.lang.reflect.Proxy$ProxyClassFactory.apply(Proxy.java:557)
	at java.lang.reflect.WeakCache$Factory.get(WeakCache.java:230)
	at java.lang.reflect.WeakCache.get(WeakCache.java:127)
	at java.lang.reflect.Proxy.getProxyClass0(Proxy.java:419)
	at java.lang.reflect.Proxy.newProxyInstance(Proxy.java:719)
	at com.gradle.ProxyFactory$ProxyingInvocationHandler.createLocalProxy(ProxyFactory.java:66)
	at com.gradle.ProxyFactory$ProxyingInvocationHandler.lambda$adaptActionArg$1(ProxyFactory.java:61)
	at com.gradle.enterprise.gradleplugin.internal.extension.b$3.run(SourceFile:100)
	at java.util.concurrent.Executors$RunnableAdapter.call(Executors.java:511)
	at java.util.concurrent.FutureTask.run(FutureTask.java:266)
	at java.util.concurrent.ThreadPoolExecutor.runWorker(ThreadPoolExecutor.java:1149)
	at java.util.concurrent.ThreadPoolExecutor$Worker.run(ThreadPoolExecutor.java:624)
	at java.lang.Thread.run(Thread.java:750)

Publishing build scan...
https://ge.apache.org/s/3lhxtyhwr5tk2

Build step 'Invoke Gradle script' changed build result to FAILURE
Build step 'Invoke Gradle script' marked build as failure

---------------------------------------------------------------------
To unsubscribe, e-mail: builds-unsubscribe@beam.apache.org
For additional commands, e-mail: builds-help@beam.apache.org


Build failed in Jenkins: beam_PostCommit_Java_VR_Dataflow_V2 #3696

Posted by Apache Jenkins Server <je...@builds.apache.org>.
See <https://ci-beam.apache.org/job/beam_PostCommit_Java_VR_Dataflow_V2/3696/display/redirect>

Changes:


------------------------------------------
[...truncated 153.60 KB...]
org.gradle.cache.LockTimeoutException: Timeout waiting to lock daemon addresses registry. It is currently in use by another Gradle instance.
Owner PID: 2817376
Our PID: 2898139
Owner Operation: 
Our operation: 
Lock file: /home/jenkins/.gradle/daemon/7.5.1/registry.bin.lock
	at org.gradle.cache.internal.DefaultFileLockManager$DefaultFileLock.timeoutException(DefaultFileLockManager.java:344)
	at org.gradle.cache.internal.DefaultFileLockManager$DefaultFileLock.lock(DefaultFileLockManager.java:305)
	at org.gradle.cache.internal.DefaultFileLockManager$DefaultFileLock.<init>(DefaultFileLockManager.java:164)
	at org.gradle.cache.internal.DefaultFileLockManager.lock(DefaultFileLockManager.java:110)
	at org.gradle.cache.internal.DefaultFileLockManager.lock(DefaultFileLockManager.java:96)
	at org.gradle.cache.internal.DefaultFileLockManager.lock(DefaultFileLockManager.java:91)
	at org.gradle.cache.internal.OnDemandFileAccess.readFile(OnDemandFileAccess.java:41)
	at org.gradle.cache.internal.SimpleStateCache.get(SimpleStateCache.java:49)
	at org.gradle.cache.internal.FileIntegrityViolationSuppressingPersistentStateCacheDecorator.get(FileIntegrityViolationSuppressingPersistentStateCacheDecorator.java:34)
	at org.gradle.launcher.daemon.registry.PersistentDaemonRegistry.getAll(PersistentDaemonRegistry.java:71)
	at org.gradle.launcher.daemon.registry.PersistentDaemonRegistry.getDaemonsMatching(PersistentDaemonRegistry.java:116)
	at org.gradle.launcher.daemon.registry.PersistentDaemonRegistry.getIdle(PersistentDaemonRegistry.java:84)
	at org.gradle.launcher.daemon.server.CompatibleDaemonExpirationStrategy.checkExpiration(CompatibleDaemonExpirationStrategy.java:54)
	at org.gradle.launcher.daemon.server.expiry.AllDaemonExpirationStrategy.checkExpiration(AllDaemonExpirationStrategy.java:46)
	at org.gradle.launcher.daemon.server.expiry.AnyDaemonExpirationStrategy.checkExpiration(AnyDaemonExpirationStrategy.java:43)
	at org.gradle.launcher.daemon.server.MasterExpirationStrategy.checkExpiration(MasterExpirationStrategy.java:73)
	at org.gradle.launcher.daemon.server.Daemon$DaemonExpirationPeriodicCheck.run(Daemon.java:268)
	at org.gradle.internal.concurrent.ExecutorPolicy$CatchAndRecordFailures.onExecute(ExecutorPolicy.java:64)
	at org.gradle.internal.concurrent.ManagedExecutorImpl$1.run(ManagedExecutorImpl.java:48)
	at java.util.concurrent.Executors$RunnableAdapter.call(Executors.java:511)
	at java.util.concurrent.FutureTask.runAndReset(FutureTask.java:308)
	at java.util.concurrent.ScheduledThreadPoolExecutor$ScheduledFutureTask.access$301(ScheduledThreadPoolExecutor.java:180)
	at java.util.concurrent.ScheduledThreadPoolExecutor$ScheduledFutureTask.run(ScheduledThreadPoolExecutor.java:294)
	at java.util.concurrent.ThreadPoolExecutor.runWorker(ThreadPoolExecutor.java:1149)
	at java.util.concurrent.ThreadPoolExecutor$Worker.run(ThreadPoolExecutor.java:624)
	at java.lang.Thread.run(Thread.java:750)
Problem in daemon expiration check
org.gradle.cache.LockTimeoutException: Timeout waiting to lock daemon addresses registry. It is currently in use by another Gradle instance.
Owner PID: 2817376
Our PID: 2898139
Owner Operation: 
Our operation: 
Lock file: /home/jenkins/.gradle/daemon/7.5.1/registry.bin.lock
	at org.gradle.cache.internal.DefaultFileLockManager$DefaultFileLock.timeoutException(DefaultFileLockManager.java:344)
	at org.gradle.cache.internal.DefaultFileLockManager$DefaultFileLock.lock(DefaultFileLockManager.java:305)
	at org.gradle.cache.internal.DefaultFileLockManager$DefaultFileLock.<init>(DefaultFileLockManager.java:164)
	at org.gradle.cache.internal.DefaultFileLockManager.lock(DefaultFileLockManager.java:110)
	at org.gradle.cache.internal.DefaultFileLockManager.lock(DefaultFileLockManager.java:96)
	at org.gradle.cache.internal.DefaultFileLockManager.lock(DefaultFileLockManager.java:91)
	at org.gradle.cache.internal.OnDemandFileAccess.readFile(OnDemandFileAccess.java:41)
	at org.gradle.cache.internal.SimpleStateCache.get(SimpleStateCache.java:49)
	at org.gradle.cache.internal.FileIntegrityViolationSuppressingPersistentStateCacheDecorator.get(FileIntegrityViolationSuppressingPersistentStateCacheDecorator.java:34)
	at org.gradle.launcher.daemon.registry.PersistentDaemonRegistry.getAll(PersistentDaemonRegistry.java:71)
	at org.gradle.launcher.daemon.registry.PersistentDaemonRegistry.getDaemonsMatching(PersistentDaemonRegistry.java:116)
	at org.gradle.launcher.daemon.registry.PersistentDaemonRegistry.getIdle(PersistentDaemonRegistry.java:84)
	at org.gradle.launcher.daemon.server.CompatibleDaemonExpirationStrategy.checkExpiration(CompatibleDaemonExpirationStrategy.java:54)
	at org.gradle.launcher.daemon.server.expiry.AllDaemonExpirationStrategy.checkExpiration(AllDaemonExpirationStrategy.java:46)
	at org.gradle.launcher.daemon.server.expiry.AnyDaemonExpirationStrategy.checkExpiration(AnyDaemonExpirationStrategy.java:43)
	at org.gradle.launcher.daemon.server.MasterExpirationStrategy.checkExpiration(MasterExpirationStrategy.java:73)
	at org.gradle.launcher.daemon.server.Daemon$DaemonExpirationPeriodicCheck.run(Daemon.java:268)
	at org.gradle.internal.concurrent.ExecutorPolicy$CatchAndRecordFailures.onExecute(ExecutorPolicy.java:64)
	at org.gradle.internal.concurrent.ManagedExecutorImpl$1.run(ManagedExecutorImpl.java:48)
	at java.util.concurrent.Executors$RunnableAdapter.call(Executors.java:511)
	at java.util.concurrent.FutureTask.runAndReset(FutureTask.java:308)
	at java.util.concurrent.ScheduledThreadPoolExecutor$ScheduledFutureTask.access$301(ScheduledThreadPoolExecutor.java:180)
	at java.util.concurrent.ScheduledThreadPoolExecutor$ScheduledFutureTask.run(ScheduledThreadPoolExecutor.java:294)
	at java.util.concurrent.ThreadPoolExecutor.runWorker(ThreadPoolExecutor.java:1149)
	at java.util.concurrent.ThreadPoolExecutor$Worker.run(ThreadPoolExecutor.java:624)
	at java.lang.Thread.run(Thread.java:750)
Problem in daemon expiration check
org.gradle.cache.LockTimeoutException: Timeout waiting to lock daemon addresses registry. It is currently in use by another Gradle instance.
Owner PID: 2817376
Our PID: 2898139
Owner Operation: 
Our operation: 
Lock file: /home/jenkins/.gradle/daemon/7.5.1/registry.bin.lock
	at org.gradle.cache.internal.DefaultFileLockManager$DefaultFileLock.timeoutException(DefaultFileLockManager.java:344)
	at org.gradle.cache.internal.DefaultFileLockManager$DefaultFileLock.lock(DefaultFileLockManager.java:305)
	at org.gradle.cache.internal.DefaultFileLockManager$DefaultFileLock.<init>(DefaultFileLockManager.java:164)
	at org.gradle.cache.internal.DefaultFileLockManager.lock(DefaultFileLockManager.java:110)
	at org.gradle.cache.internal.DefaultFileLockManager.lock(DefaultFileLockManager.java:96)
	at org.gradle.cache.internal.DefaultFileLockManager.lock(DefaultFileLockManager.java:91)
	at org.gradle.cache.internal.OnDemandFileAccess.readFile(OnDemandFileAccess.java:41)
	at org.gradle.cache.internal.SimpleStateCache.get(SimpleStateCache.java:49)
	at org.gradle.cache.internal.FileIntegrityViolationSuppressingPersistentStateCacheDecorator.get(FileIntegrityViolationSuppressingPersistentStateCacheDecorator.java:34)
	at org.gradle.launcher.daemon.registry.PersistentDaemonRegistry.getAll(PersistentDaemonRegistry.java:71)
	at org.gradle.launcher.daemon.registry.PersistentDaemonRegistry.getDaemonsMatching(PersistentDaemonRegistry.java:116)
	at org.gradle.launcher.daemon.registry.PersistentDaemonRegistry.getIdle(PersistentDaemonRegistry.java:84)
	at org.gradle.launcher.daemon.server.CompatibleDaemonExpirationStrategy.checkExpiration(CompatibleDaemonExpirationStrategy.java:54)
	at org.gradle.launcher.daemon.server.expiry.AllDaemonExpirationStrategy.checkExpiration(AllDaemonExpirationStrategy.java:46)
	at org.gradle.launcher.daemon.server.expiry.AnyDaemonExpirationStrategy.checkExpiration(AnyDaemonExpirationStrategy.java:43)
	at org.gradle.launcher.daemon.server.MasterExpirationStrategy.checkExpiration(MasterExpirationStrategy.java:73)
	at org.gradle.launcher.daemon.server.Daemon$DaemonExpirationPeriodicCheck.run(Daemon.java:268)
	at org.gradle.internal.concurrent.ExecutorPolicy$CatchAndRecordFailures.onExecute(ExecutorPolicy.java:64)
	at org.gradle.internal.concurrent.ManagedExecutorImpl$1.run(ManagedExecutorImpl.java:48)
	at java.util.concurrent.Executors$RunnableAdapter.call(Executors.java:511)
	at java.util.concurrent.FutureTask.runAndReset(FutureTask.java:308)
	at java.util.concurrent.ScheduledThreadPoolExecutor$ScheduledFutureTask.access$301(ScheduledThreadPoolExecutor.java:180)
	at java.util.concurrent.ScheduledThreadPoolExecutor$ScheduledFutureTask.run(ScheduledThreadPoolExecutor.java:294)
	at java.util.concurrent.ThreadPoolExecutor.runWorker(ThreadPoolExecutor.java:1149)
	at java.util.concurrent.ThreadPoolExecutor$Worker.run(ThreadPoolExecutor.java:624)
	at java.lang.Thread.run(Thread.java:750)
Problem in daemon expiration check
org.gradle.cache.LockTimeoutException: Timeout waiting to lock daemon addresses registry. It is currently in use by another Gradle instance.
Owner PID: 2817376
Our PID: 2898139
Owner Operation: 
Our operation: 
Lock file: /home/jenkins/.gradle/daemon/7.5.1/registry.bin.lock
	at org.gradle.cache.internal.DefaultFileLockManager$DefaultFileLock.timeoutException(DefaultFileLockManager.java:344)
	at org.gradle.cache.internal.DefaultFileLockManager$DefaultFileLock.lock(DefaultFileLockManager.java:305)
	at org.gradle.cache.internal.DefaultFileLockManager$DefaultFileLock.<init>(DefaultFileLockManager.java:164)
	at org.gradle.cache.internal.DefaultFileLockManager.lock(DefaultFileLockManager.java:110)
	at org.gradle.cache.internal.DefaultFileLockManager.lock(DefaultFileLockManager.java:96)
	at org.gradle.cache.internal.DefaultFileLockManager.lock(DefaultFileLockManager.java:91)
	at org.gradle.cache.internal.OnDemandFileAccess.readFile(OnDemandFileAccess.java:41)
	at org.gradle.cache.internal.SimpleStateCache.get(SimpleStateCache.java:49)
	at org.gradle.cache.internal.FileIntegrityViolationSuppressingPersistentStateCacheDecorator.get(FileIntegrityViolationSuppressingPersistentStateCacheDecorator.java:34)
	at org.gradle.launcher.daemon.registry.PersistentDaemonRegistry.getAll(PersistentDaemonRegistry.java:71)
	at org.gradle.launcher.daemon.registry.PersistentDaemonRegistry.getDaemonsMatching(PersistentDaemonRegistry.java:116)
	at org.gradle.launcher.daemon.registry.PersistentDaemonRegistry.getIdle(PersistentDaemonRegistry.java:84)
	at org.gradle.launcher.daemon.server.CompatibleDaemonExpirationStrategy.checkExpiration(CompatibleDaemonExpirationStrategy.java:54)
	at org.gradle.launcher.daemon.server.expiry.AllDaemonExpirationStrategy.checkExpiration(AllDaemonExpirationStrategy.java:46)
	at org.gradle.launcher.daemon.server.expiry.AnyDaemonExpirationStrategy.checkExpiration(AnyDaemonExpirationStrategy.java:43)
	at org.gradle.launcher.daemon.server.MasterExpirationStrategy.checkExpiration(MasterExpirationStrategy.java:73)
	at org.gradle.launcher.daemon.server.Daemon$DaemonExpirationPeriodicCheck.run(Daemon.java:268)
	at org.gradle.internal.concurrent.ExecutorPolicy$CatchAndRecordFailures.onExecute(ExecutorPolicy.java:64)
	at org.gradle.internal.concurrent.ManagedExecutorImpl$1.run(ManagedExecutorImpl.java:48)
	at java.util.concurrent.Executors$RunnableAdapter.call(Executors.java:511)
	at java.util.concurrent.FutureTask.runAndReset(FutureTask.java:308)
	at java.util.concurrent.ScheduledThreadPoolExecutor$ScheduledFutureTask.access$301(ScheduledThreadPoolExecutor.java:180)
	at java.util.concurrent.ScheduledThreadPoolExecutor$ScheduledFutureTask.run(ScheduledThreadPoolExecutor.java:294)
	at java.util.concurrent.ThreadPoolExecutor.runWorker(ThreadPoolExecutor.java:1149)
	at java.util.concurrent.ThreadPoolExecutor$Worker.run(ThreadPoolExecutor.java:624)
	at java.lang.Thread.run(Thread.java:750)
Problem in daemon expiration check
org.gradle.cache.LockTimeoutException: Timeout waiting to lock daemon addresses registry. It is currently in use by another Gradle instance.
Owner PID: 2817376
Our PID: 2898139
Owner Operation: 
Our operation: 
Lock file: /home/jenkins/.gradle/daemon/7.5.1/registry.bin.lock
	at org.gradle.cache.internal.DefaultFileLockManager$DefaultFileLock.timeoutException(DefaultFileLockManager.java:344)
	at org.gradle.cache.internal.DefaultFileLockManager$DefaultFileLock.lock(DefaultFileLockManager.java:305)
	at org.gradle.cache.internal.DefaultFileLockManager$DefaultFileLock.<init>(DefaultFileLockManager.java:164)
	at org.gradle.cache.internal.DefaultFileLockManager.lock(DefaultFileLockManager.java:110)
	at org.gradle.cache.internal.DefaultFileLockManager.lock(DefaultFileLockManager.java:96)
	at org.gradle.cache.internal.DefaultFileLockManager.lock(DefaultFileLockManager.java:91)
	at org.gradle.cache.internal.OnDemandFileAccess.readFile(OnDemandFileAccess.java:41)
	at org.gradle.cache.internal.SimpleStateCache.get(SimpleStateCache.java:49)
	at org.gradle.cache.internal.FileIntegrityViolationSuppressingPersistentStateCacheDecorator.get(FileIntegrityViolationSuppressingPersistentStateCacheDecorator.java:34)
	at org.gradle.launcher.daemon.registry.PersistentDaemonRegistry.getAll(PersistentDaemonRegistry.java:71)
	at org.gradle.launcher.daemon.registry.PersistentDaemonRegistry.getDaemonsMatching(PersistentDaemonRegistry.java:116)
	at org.gradle.launcher.daemon.registry.PersistentDaemonRegistry.getIdle(PersistentDaemonRegistry.java:84)
	at org.gradle.launcher.daemon.server.CompatibleDaemonExpirationStrategy.checkExpiration(CompatibleDaemonExpirationStrategy.java:54)
	at org.gradle.launcher.daemon.server.expiry.AllDaemonExpirationStrategy.checkExpiration(AllDaemonExpirationStrategy.java:46)
	at org.gradle.launcher.daemon.server.expiry.AnyDaemonExpirationStrategy.checkExpiration(AnyDaemonExpirationStrategy.java:43)
	at org.gradle.launcher.daemon.server.MasterExpirationStrategy.checkExpiration(MasterExpirationStrategy.java:73)
	at org.gradle.launcher.daemon.server.Daemon$DaemonExpirationPeriodicCheck.run(Daemon.java:268)
	at org.gradle.internal.concurrent.ExecutorPolicy$CatchAndRecordFailures.onExecute(ExecutorPolicy.java:64)
	at org.gradle.internal.concurrent.ManagedExecutorImpl$1.run(ManagedExecutorImpl.java:48)
	at java.util.concurrent.Executors$RunnableAdapter.call(Executors.java:511)
	at java.util.concurrent.FutureTask.runAndReset(FutureTask.java:308)
	at java.util.concurrent.ScheduledThreadPoolExecutor$ScheduledFutureTask.access$301(ScheduledThreadPoolExecutor.java:180)
	at java.util.concurrent.ScheduledThreadPoolExecutor$ScheduledFutureTask.run(ScheduledThreadPoolExecutor.java:294)
	at java.util.concurrent.ThreadPoolExecutor.runWorker(ThreadPoolExecutor.java:1149)
	at java.util.concurrent.ThreadPoolExecutor$Worker.run(ThreadPoolExecutor.java:624)
	at java.lang.Thread.run(Thread.java:750)
Problem in daemon expiration check
org.gradle.cache.LockTimeoutException: Timeout waiting to lock daemon addresses registry. It is currently in use by another Gradle instance.
Owner PID: 2817376
Our PID: 2898139
Owner Operation: 
Our operation: 
Lock file: /home/jenkins/.gradle/daemon/7.5.1/registry.bin.lock
	at org.gradle.cache.internal.DefaultFileLockManager$DefaultFileLock.timeoutException(DefaultFileLockManager.java:344)
	at org.gradle.cache.internal.DefaultFileLockManager$DefaultFileLock.lock(DefaultFileLockManager.java:305)
	at org.gradle.cache.internal.DefaultFileLockManager$DefaultFileLock.<init>(DefaultFileLockManager.java:164)
	at org.gradle.cache.internal.DefaultFileLockManager.lock(DefaultFileLockManager.java:110)
	at org.gradle.cache.internal.DefaultFileLockManager.lock(DefaultFileLockManager.java:96)
	at org.gradle.cache.internal.DefaultFileLockManager.lock(DefaultFileLockManager.java:91)
	at org.gradle.cache.internal.OnDemandFileAccess.readFile(OnDemandFileAccess.java:41)
	at org.gradle.cache.internal.SimpleStateCache.get(SimpleStateCache.java:49)
	at org.gradle.cache.internal.FileIntegrityViolationSuppressingPersistentStateCacheDecorator.get(FileIntegrityViolationSuppressingPersistentStateCacheDecorator.java:34)
	at org.gradle.launcher.daemon.registry.PersistentDaemonRegistry.getAll(PersistentDaemonRegistry.java:71)
	at org.gradle.launcher.daemon.registry.PersistentDaemonRegistry.getDaemonsMatching(PersistentDaemonRegistry.java:116)
	at org.gradle.launcher.daemon.registry.PersistentDaemonRegistry.getIdle(PersistentDaemonRegistry.java:84)
	at org.gradle.launcher.daemon.server.CompatibleDaemonExpirationStrategy.checkExpiration(CompatibleDaemonExpirationStrategy.java:54)
	at org.gradle.launcher.daemon.server.expiry.AllDaemonExpirationStrategy.checkExpiration(AllDaemonExpirationStrategy.java:46)
	at org.gradle.launcher.daemon.server.expiry.AnyDaemonExpirationStrategy.checkExpiration(AnyDaemonExpirationStrategy.java:43)
	at org.gradle.launcher.daemon.server.MasterExpirationStrategy.checkExpiration(MasterExpirationStrategy.java:73)
	at org.gradle.launcher.daemon.server.Daemon$DaemonExpirationPeriodicCheck.run(Daemon.java:268)
	at org.gradle.internal.concurrent.ExecutorPolicy$CatchAndRecordFailures.onExecute(ExecutorPolicy.java:64)
	at org.gradle.internal.concurrent.ManagedExecutorImpl$1.run(ManagedExecutorImpl.java:48)
	at java.util.concurrent.Executors$RunnableAdapter.call(Executors.java:511)
	at java.util.concurrent.FutureTask.runAndReset(FutureTask.java:308)
	at java.util.concurrent.ScheduledThreadPoolExecutor$ScheduledFutureTask.access$301(ScheduledThreadPoolExecutor.java:180)
	at java.util.concurrent.ScheduledThreadPoolExecutor$ScheduledFutureTask.run(ScheduledThreadPoolExecutor.java:294)
	at java.util.concurrent.ThreadPoolExecutor.runWorker(ThreadPoolExecutor.java:1149)
	at java.util.concurrent.ThreadPoolExecutor$Worker.run(ThreadPoolExecutor.java:624)
	at java.lang.Thread.run(Thread.java:750)

> Task :runners:google-cloud-dataflow-java:validatesRunnerV2Test

220 tests completed, 13 failed, 1 skipped

> Task :runners:google-cloud-dataflow-java:validatesRunnerV2Test FAILED

FAILURE: Build failed with an exception.

* What went wrong:
Execution failed for task ':runners:google-cloud-dataflow-java:validatesRunnerV2Test'.
> There were failing tests. See the report at: file://<https://ci-beam.apache.org/job/beam_PostCommit_Java_VR_Dataflow_V2/ws/src/runners/google-cloud-dataflow-java/build/reports/tests/validatesRunnerV2Test/index.html>

* Try:
> Run with --stacktrace option to get the stack trace.
> Run with --info or --debug option to get more log output.

* Get more help at https://help.gradle.org

Deprecated Gradle features were used in this build, making it incompatible with Gradle 8.0.

You can use '--warning-mode all' to show the individual deprecation warnings and determine if they come from your own scripts or plugins.

See https://docs.gradle.org/7.5.1/userguide/command_line_interface.html#sec:command_line_warnings

Execution optimizations have been disabled for 1 invalid unit(s) of work during this build to ensure correctness.
Please consult deprecation warnings for more details.

BUILD FAILED in 4h 11m 3s
148 actionable tasks: 94 executed, 50 from cache, 4 up-to-date
Build scan background action failed.
java.lang.IllegalArgumentException: com.gradle.enterprise.gradleplugin.internal.extension.a is not an interface
	at java.lang.reflect.Proxy$ProxyClassFactory.apply(Proxy.java:590)
	at java.lang.reflect.Proxy$ProxyClassFactory.apply(Proxy.java:557)
	at java.lang.reflect.WeakCache$Factory.get(WeakCache.java:230)
	at java.lang.reflect.WeakCache.get(WeakCache.java:127)
	at java.lang.reflect.Proxy.getProxyClass0(Proxy.java:419)
	at java.lang.reflect.Proxy.newProxyInstance(Proxy.java:719)
	at com.gradle.ProxyFactory$ProxyingInvocationHandler.createLocalProxy(ProxyFactory.java:66)
	at com.gradle.ProxyFactory$ProxyingInvocationHandler.lambda$adaptActionArg$1(ProxyFactory.java:61)
	at com.gradle.enterprise.gradleplugin.internal.extension.b$3.run(SourceFile:100)
	at java.util.concurrent.Executors$RunnableAdapter.call(Executors.java:511)
	at java.util.concurrent.FutureTask.run(FutureTask.java:266)
	at java.util.concurrent.ThreadPoolExecutor.runWorker(ThreadPoolExecutor.java:1149)
	at java.util.concurrent.ThreadPoolExecutor$Worker.run(ThreadPoolExecutor.java:624)
	at java.lang.Thread.run(Thread.java:750)

Publishing build scan...
https://ge.apache.org/s/nggoa22lk6fta

Build step 'Invoke Gradle script' changed build result to FAILURE
Build step 'Invoke Gradle script' marked build as failure

---------------------------------------------------------------------
To unsubscribe, e-mail: builds-unsubscribe@beam.apache.org
For additional commands, e-mail: builds-help@beam.apache.org


Build failed in Jenkins: beam_PostCommit_Java_VR_Dataflow_V2 #3695

Posted by Apache Jenkins Server <je...@builds.apache.org>.
See <https://ci-beam.apache.org/job/beam_PostCommit_Java_VR_Dataflow_V2/3695/display/redirect>

Changes:


------------------------------------------
[...truncated 64.05 KB...]
> Task :sdks:java:container:goBuild
/home/jenkins/go/bin/go1.20.2 build -o ./build/target/linux_amd64/boot boot.go boot_test.go pathingjar.go pathingjar_test.go

> Task :sdks:java:container:java8:copySdkHarnessLauncher
Execution optimizations have been disabled for task ':sdks:java:container:java8:copySdkHarnessLauncher' to ensure correctness due to the following reasons:
  - Gradle detected a problem with the following location: '<https://ci-beam.apache.org/job/beam_PostCommit_Java_VR_Dataflow_V2/ws/src/sdks/java/container/build/target'.> Reason: Task ':sdks:java:container:java8:copySdkHarnessLauncher' uses this output of task ':sdks:java:container:downloadCloudProfilerAgent' without declaring an explicit or implicit dependency. This can lead to incorrect results being produced, depending on what order the tasks are executed. Please refer to https://docs.gradle.org/7.5.1/userguide/validation_problems.html#implicit_dependency for more details about this problem.
  - Gradle detected a problem with the following location: '<https://ci-beam.apache.org/job/beam_PostCommit_Java_VR_Dataflow_V2/ws/src/sdks/java/container/build/target'.> Reason: Task ':sdks:java:container:java8:copySdkHarnessLauncher' uses this output of task ':sdks:java:container:pullLicenses' without declaring an explicit or implicit dependency. This can lead to incorrect results being produced, depending on what order the tasks are executed. Please refer to https://docs.gradle.org/7.5.1/userguide/validation_problems.html#implicit_dependency for more details about this problem.

> Task :release:go-licenses:java:dockerRun
github.com/apache/beam/sdks/v2/go/pkg/beam,https://github.com/apache/beam/blob/sdks/v2.46.0/sdks/go/README.md,Apache-2.0
github.com/apache/beam/sdks/v2/java/container,https://github.com/apache/beam/blob/sdks/v2.46.0/sdks/LICENSE,Apache-2.0
github.com/golang/protobuf,https://github.com/golang/protobuf/blob/v1.5.2/LICENSE,BSD-3-Clause
golang.org/x/net,https://cs.opensource.google/go/x/net/+/v0.5.0:LICENSE,BSD-3-Clause
golang.org/x/sys/unix,https://cs.opensource.google/go/x/sys/+/v0.5.0:LICENSE,BSD-3-Clause
golang.org/x/text,https://cs.opensource.google/go/x/text/+/v0.7.0:LICENSE,BSD-3-Clause
google.golang.org/genproto/googleapis/rpc/status,https://github.com/googleapis/go-genproto/blob/76db0878b65f/LICENSE,Apache-2.0
google.golang.org/grpc,https://github.com/grpc/grpc-go/blob/v1.52.3/LICENSE,Apache-2.0
google.golang.org/protobuf,https://github.com/protocolbuffers/protobuf-go/blob/v1.28.1/LICENSE,BSD-3-Clause
+ chmod -R a+w /output/licenses

> Task :release:go-licenses:java:createLicenses
> Task :sdks:java:container:java8:copyGolangLicenses
> Task :sdks:java:container:java8:dockerPrepare

> Task :sdks:java:container:java8:docker
#1 [internal] load build definition from Dockerfile
#1 transferring dockerfile: 2.58kB done
#1 DONE 0.0s

#2 [internal] load .dockerignore
#2 transferring context: 2B done
#2 DONE 0.0s

#3 [internal] load metadata for docker.io/library/eclipse-temurin:8
#3 DONE 0.3s

#4 [ 1/16] FROM docker.io/library/eclipse-temurin:8@sha256:a473a9395cb524db4e40f110da1b96f2b357937e9a8ffb56920f97b85de80967
#4 resolve docker.io/library/eclipse-temurin:8@sha256:a473a9395cb524db4e40f110da1b96f2b357937e9a8ffb56920f97b85de80967 0.0s done
#4 CACHED

#5 [internal] load build context
#5 transferring context: 46.97MB 0.4s done
#5 DONE 0.4s

#6 [ 2/16] ADD target/slf4j-api.jar /opt/apache/beam/jars/
#6 DONE 1.0s

#7 [ 3/16] ADD target/slf4j-jdk14.jar /opt/apache/beam/jars/
#7 DONE 0.1s

#8 [ 4/16] ADD target/jcl-over-slf4j.jar /opt/apache/beam/jars/
#8 DONE 0.1s

#9 [ 5/16] ADD target/log4j-over-slf4j.jar /opt/apache/beam/jars/
#9 DONE 0.1s

#10 [ 6/16] ADD target/log4j-to-slf4j.jar /opt/apache/beam/jars/
#10 DONE 0.1s

#11 [ 7/16] ADD target/beam-sdks-java-harness.jar /opt/apache/beam/jars/
#11 DONE 0.1s

#12 [ 8/16] COPY target/jamm.jar target/open-module-agent*.jar /opt/apache/beam/jars/
#12 DONE 0.1s

#13 [ 9/16] COPY target/linux_amd64/boot /opt/apache/beam/
#13 DONE 0.2s

#14 [10/16] COPY target/LICENSE /opt/apache/beam/
#14 DONE 0.1s

#15 [11/16] COPY target/NOTICE /opt/apache/beam/
#15 DONE 0.1s

#16 [12/16] ADD target/third_party_licenses /opt/apache/beam/third_party_licenses/
#16 DONE 0.2s

#17 [13/16] COPY target/LICENSE target/options/* /opt/apache/beam/options/
#17 DONE 0.1s

#18 [14/16] COPY target/go-licenses/* /opt/apache/beam/third_party_licenses/golang/
#18 DONE 0.1s

#19 [15/16] RUN if [ "true" = "false" ] ; then     rm -rf /opt/apache/beam/third_party_licenses ;    fi
#19 DONE 0.3s

#20 [16/16] COPY target/profiler/* /opt/google_cloud_profiler/
#20 DONE 0.1s

#21 exporting to image
#21 exporting layers
#21 exporting layers 0.4s done
#21 writing image sha256:08c86ee3fd08eb21010ff7b3442a40a55d9c406b1c3b4935efb281c3a8157a73 done
#21 naming to docker.io/apache/beam_java8_sdk:2.48.0.dev done
#21 DONE 0.4s

> Task :runners:google-cloud-dataflow-java:buildAndPushDockerJavaContainer
WARNING: `gcloud docker` will not be supported for Docker client versions above 18.03.

As an alternative, use `gcloud auth configure-docker` to configure `docker` to
use `gcloud` as a credential helper, then use `docker` as you would for non-GCR
registries, e.g. `docker pull gcr.io/project-id/my-image`. Add
`--verbosity=error` to silence this warning: `gcloud docker
--verbosity=error -- pull gcr.io/project-id/my-image`.

See: https://cloud.google.com/container-registry/docs/support/deprecation-notices#gcloud-docker

The push refers to repository [us.gcr.io/apache-beam-testing/java-postcommit-it/java]
85ed7dba6c4b: Preparing
5f70bf18a086: Preparing
5898bef3b710: Preparing
86e25a4c4084: Preparing
a0df4803a104: Preparing
604266c3e5b2: Preparing
0049bb06a3f8: Preparing
2a90998ffd7f: Preparing
ccf9d17def3d: Preparing
b73e987c98e6: Preparing
5efe7e6cd5dd: Preparing
70d70f34221c: Preparing
ed11dce910ed: Preparing
fe653b2119c5: Preparing
c717499e8738: Preparing
3eb3677be944: Preparing
9091f97c3a30: Preparing
604266c3e5b2: Waiting
c45c46033aa8: Preparing
ccf9d17def3d: Waiting
0049bb06a3f8: Waiting
b8a36d10656a: Preparing
2a90998ffd7f: Waiting
c717499e8738: Waiting
5efe7e6cd5dd: Waiting
ed11dce910ed: Waiting
c45c46033aa8: Waiting
3eb3677be944: Waiting
b8a36d10656a: Waiting
fe653b2119c5: Waiting
5f70bf18a086: Layer already exists
86e25a4c4084: Pushed
5898bef3b710: Pushed
604266c3e5b2: Pushed
85ed7dba6c4b: Pushed
0049bb06a3f8: Pushed
ccf9d17def3d: Pushed
a0df4803a104: Pushed
5efe7e6cd5dd: Pushed
b73e987c98e6: Pushed
2a90998ffd7f: Pushed
70d70f34221c: Pushed
3eb3677be944: Layer already exists
9091f97c3a30: Layer already exists
ed11dce910ed: Pushed
c45c46033aa8: Layer already exists
b8a36d10656a: Layer already exists
fe653b2119c5: Pushed
c717499e8738: Pushed
20230509005039: digest: sha256:1328fd34d60c0db2f11f683579b9678764e517e709e802be2fa35a5bf81999d4 size: 4296

> Task :runners:google-cloud-dataflow-java:validatesRunnerV2Test

org.apache.beam.sdk.testing.PAssertTest > testAssertionSiteIsCapturedWithMessage FAILED
    java.lang.AssertionError at PAssertTest.java:554

org.apache.beam.sdk.testing.PAssertTest > testEmptyFalse FAILED
    java.lang.AssertionError at PAssertTest.java:514

org.apache.beam.sdk.testing.PAssertTest > testPAssertThatListSatisfiesOneMatcherFalse FAILED
    java.lang.AssertionError at PAssertTest.java:700

org.apache.beam.sdk.testing.PAssertTest > testPAssertEqualsSingletonFalse FAILED
    java.lang.AssertionError at PAssertTest.java:384

org.apache.beam.sdk.testing.PAssertTest > testPAssertEqualsSingletonFalseDefaultReasonString FAILED
    java.lang.AssertionError at PAssertTest.java:400

org.apache.beam.sdk.testing.PAssertTest > testPAssertThatFlattenedFalse FAILED
    java.lang.AssertionError at PAssertTest.java:652

org.apache.beam.sdk.testing.PAssertTest > testEmptyFalseDefaultReasonString FAILED
    java.lang.AssertionError at PAssertTest.java:528

org.apache.beam.sdk.testing.PAssertTest > testPAssertThatListSatisfiesMultipleMatchersFalse FAILED
    java.lang.AssertionError at PAssertTest.java:762

org.apache.beam.sdk.transforms.ParDoTest$LifecycleTests > testParDoWithErrorInStartBatch FAILED
    java.lang.AssertionError at MatcherAssert.java:18

org.apache.beam.sdk.testing.PAssertTest > testAssertionSiteIsCapturedWithoutMessage FAILED
    java.lang.AssertionError at PAssertTest.java:570

org.apache.beam.sdk.transforms.ParDoTest$LifecycleTests > testParDoWithErrorInProcessElement FAILED
    java.lang.AssertionError at MatcherAssert.java:18

org.apache.beam.sdk.transforms.ParDoTest$LifecycleTests > testParDoWithErrorInFinishBatch FAILED
    java.lang.AssertionError at MatcherAssert.java:18

org.apache.beam.sdk.testing.PAssertTest > testContainsInAnyOrderFalse FAILED
    java.lang.AssertionError at PAssertTest.java:495

220 tests completed, 13 failed, 1 skipped

> Task :runners:google-cloud-dataflow-java:validatesRunnerV2Test FAILED

FAILURE: Build failed with an exception.

* What went wrong:
Execution failed for task ':runners:google-cloud-dataflow-java:validatesRunnerV2Test'.
> There were failing tests. See the report at: file://<https://ci-beam.apache.org/job/beam_PostCommit_Java_VR_Dataflow_V2/ws/src/runners/google-cloud-dataflow-java/build/reports/tests/validatesRunnerV2Test/index.html>

* Try:
> Run with --stacktrace option to get the stack trace.
> Run with --info or --debug option to get more log output.

* Get more help at https://help.gradle.org

Deprecated Gradle features were used in this build, making it incompatible with Gradle 8.0.

You can use '--warning-mode all' to show the individual deprecation warnings and determine if they come from your own scripts or plugins.

See https://docs.gradle.org/7.5.1/userguide/command_line_interface.html#sec:command_line_warnings

Execution optimizations have been disabled for 1 invalid unit(s) of work during this build to ensure correctness.
Please consult deprecation warnings for more details.

BUILD FAILED in 4h 14m 36s
148 actionable tasks: 94 executed, 50 from cache, 4 up-to-date
Build scan background action failed.
java.lang.IllegalArgumentException: com.gradle.enterprise.gradleplugin.internal.extension.a is not an interface
	at java.lang.reflect.Proxy$ProxyClassFactory.apply(Proxy.java:590)
	at java.lang.reflect.Proxy$ProxyClassFactory.apply(Proxy.java:557)
	at java.lang.reflect.WeakCache$Factory.get(WeakCache.java:230)
	at java.lang.reflect.WeakCache.get(WeakCache.java:127)
	at java.lang.reflect.Proxy.getProxyClass0(Proxy.java:419)
	at java.lang.reflect.Proxy.newProxyInstance(Proxy.java:719)
	at com.gradle.ProxyFactory$ProxyingInvocationHandler.createLocalProxy(ProxyFactory.java:66)
	at com.gradle.ProxyFactory$ProxyingInvocationHandler.lambda$adaptActionArg$1(ProxyFactory.java:61)
	at com.gradle.enterprise.gradleplugin.internal.extension.b$3.run(SourceFile:100)
	at java.util.concurrent.Executors$RunnableAdapter.call(Executors.java:511)
	at java.util.concurrent.FutureTask.run(FutureTask.java:266)
	at java.util.concurrent.ThreadPoolExecutor.runWorker(ThreadPoolExecutor.java:1149)
	at java.util.concurrent.ThreadPoolExecutor$Worker.run(ThreadPoolExecutor.java:624)
	at java.lang.Thread.run(Thread.java:750)

Publishing build scan...
https://ge.apache.org/s/uhuvizonmz2j2

Build step 'Invoke Gradle script' changed build result to FAILURE
Build step 'Invoke Gradle script' marked build as failure

---------------------------------------------------------------------
To unsubscribe, e-mail: builds-unsubscribe@beam.apache.org
For additional commands, e-mail: builds-help@beam.apache.org


Build failed in Jenkins: beam_PostCommit_Java_VR_Dataflow_V2 #3694

Posted by Apache Jenkins Server <je...@builds.apache.org>.
See <https://ci-beam.apache.org/job/beam_PostCommit_Java_VR_Dataflow_V2/3694/display/redirect?page=changes>

Changes:

[noreply] [Python SDK] wait_until_finish always raises the exception for FAILED


------------------------------------------
[...truncated 65.17 KB...]
/home/jenkins/go/bin/go1.20.2 build -o ./build/target/linux_amd64/boot boot.go boot_test.go pathingjar.go pathingjar_test.go

> Task :sdks:java:container:java8:copySdkHarnessLauncher
Execution optimizations have been disabled for task ':sdks:java:container:java8:copySdkHarnessLauncher' to ensure correctness due to the following reasons:
  - Gradle detected a problem with the following location: '<https://ci-beam.apache.org/job/beam_PostCommit_Java_VR_Dataflow_V2/ws/src/sdks/java/container/build/target'.> Reason: Task ':sdks:java:container:java8:copySdkHarnessLauncher' uses this output of task ':sdks:java:container:downloadCloudProfilerAgent' without declaring an explicit or implicit dependency. This can lead to incorrect results being produced, depending on what order the tasks are executed. Please refer to https://docs.gradle.org/7.5.1/userguide/validation_problems.html#implicit_dependency for more details about this problem.
  - Gradle detected a problem with the following location: '<https://ci-beam.apache.org/job/beam_PostCommit_Java_VR_Dataflow_V2/ws/src/sdks/java/container/build/target'.> Reason: Task ':sdks:java:container:java8:copySdkHarnessLauncher' uses this output of task ':sdks:java:container:pullLicenses' without declaring an explicit or implicit dependency. This can lead to incorrect results being produced, depending on what order the tasks are executed. Please refer to https://docs.gradle.org/7.5.1/userguide/validation_problems.html#implicit_dependency for more details about this problem.

> Task :release:go-licenses:java:dockerRun
github.com/apache/beam/sdks/v2/go/pkg/beam,https://github.com/apache/beam/blob/sdks/v2.46.0/sdks/go/README.md,Apache-2.0
github.com/apache/beam/sdks/v2/java/container,https://github.com/apache/beam/blob/sdks/v2.46.0/sdks/LICENSE,Apache-2.0
github.com/golang/protobuf,https://github.com/golang/protobuf/blob/v1.5.2/LICENSE,BSD-3-Clause
golang.org/x/net,https://cs.opensource.google/go/x/net/+/v0.5.0:LICENSE,BSD-3-Clause
golang.org/x/sys/unix,https://cs.opensource.google/go/x/sys/+/v0.5.0:LICENSE,BSD-3-Clause
golang.org/x/text,https://cs.opensource.google/go/x/text/+/v0.7.0:LICENSE,BSD-3-Clause
google.golang.org/genproto/googleapis/rpc/status,https://github.com/googleapis/go-genproto/blob/76db0878b65f/LICENSE,Apache-2.0
google.golang.org/grpc,https://github.com/grpc/grpc-go/blob/v1.52.3/LICENSE,Apache-2.0
google.golang.org/protobuf,https://github.com/protocolbuffers/protobuf-go/blob/v1.28.1/LICENSE,BSD-3-Clause
+ chmod -R a+w /output/licenses

> Task :release:go-licenses:java:createLicenses
> Task :sdks:java:container:java8:copyGolangLicenses
> Task :sdks:java:container:java8:dockerPrepare

> Task :sdks:java:container:java8:docker
#1 [internal] load build definition from Dockerfile
#1 transferring dockerfile: 2.58kB done
#1 DONE 0.0s

#2 [internal] load .dockerignore
#2 transferring context: 2B done
#2 DONE 0.0s

#3 [internal] load metadata for docker.io/library/eclipse-temurin:8
#3 DONE 0.2s

#4 [ 1/16] FROM docker.io/library/eclipse-temurin:8@sha256:a473a9395cb524db4e40f110da1b96f2b357937e9a8ffb56920f97b85de80967
#4 resolve docker.io/library/eclipse-temurin:8@sha256:a473a9395cb524db4e40f110da1b96f2b357937e9a8ffb56920f97b85de80967 0.0s done
#4 CACHED

#5 [internal] load build context
#5 transferring context: 46.97MB 0.4s done
#5 DONE 0.4s

#6 [ 2/16] ADD target/slf4j-api.jar /opt/apache/beam/jars/
#6 DONE 2.3s

#7 [ 3/16] ADD target/slf4j-jdk14.jar /opt/apache/beam/jars/
#7 DONE 0.1s

#8 [ 4/16] ADD target/jcl-over-slf4j.jar /opt/apache/beam/jars/
#8 DONE 0.1s

#9 [ 5/16] ADD target/log4j-over-slf4j.jar /opt/apache/beam/jars/
#9 DONE 0.1s

#10 [ 6/16] ADD target/log4j-to-slf4j.jar /opt/apache/beam/jars/
#10 DONE 0.1s

#11 [ 7/16] ADD target/beam-sdks-java-harness.jar /opt/apache/beam/jars/
#11 DONE 0.1s

#12 [ 8/16] COPY target/jamm.jar target/open-module-agent*.jar /opt/apache/beam/jars/
#12 DONE 0.1s

#13 [ 9/16] COPY target/linux_amd64/boot /opt/apache/beam/
#13 DONE 0.2s

#14 [10/16] COPY target/LICENSE /opt/apache/beam/
#14 DONE 0.1s

#15 [11/16] COPY target/NOTICE /opt/apache/beam/
#15 DONE 0.1s

#16 [12/16] ADD target/third_party_licenses /opt/apache/beam/third_party_licenses/
#16 DONE 0.2s

#17 [13/16] COPY target/LICENSE target/options/* /opt/apache/beam/options/
#17 DONE 0.1s

#18 [14/16] COPY target/go-licenses/* /opt/apache/beam/third_party_licenses/golang/
#18 DONE 0.1s

#19 [15/16] RUN if [ "true" = "false" ] ; then     rm -rf /opt/apache/beam/third_party_licenses ;    fi
#19 DONE 0.7s

#20 [16/16] COPY target/profiler/* /opt/google_cloud_profiler/
#20 DONE 0.3s

#21 exporting to image
#21 exporting layers
#21 exporting layers 0.3s done
#21 writing image sha256:d4d265dffabb91ef62ee8f10b7dab1ea9ac6b9e2a8874e38d897b6704cfec311 done
#21 naming to docker.io/apache/beam_java8_sdk:2.48.0.dev done
#21 DONE 0.3s

> Task :runners:google-cloud-dataflow-java:buildAndPushDockerJavaContainer
WARNING: `gcloud docker` will not be supported for Docker client versions above 18.03.

As an alternative, use `gcloud auth configure-docker` to configure `docker` to
use `gcloud` as a credential helper, then use `docker` as you would for non-GCR
registries, e.g. `docker pull gcr.io/project-id/my-image`. Add
`--verbosity=error` to silence this warning: `gcloud docker
--verbosity=error -- pull gcr.io/project-id/my-image`.

See: https://cloud.google.com/container-registry/docs/support/deprecation-notices#gcloud-docker

The push refers to repository [us.gcr.io/apache-beam-testing/java-postcommit-it/java]
47cfcfad59dd: Preparing
5f70bf18a086: Preparing
ed42dc235811: Preparing
2674ddc50efa: Preparing
d86a9452c326: Preparing
869002af76d6: Preparing
4bdafd2541bd: Preparing
f204e03b9660: Preparing
9dfc5739a228: Preparing
0338f33f7e94: Preparing
5abdf976f667: Preparing
31a651a56f32: Preparing
d72dc679d2d2: Preparing
4e9a4483b5db: Preparing
772581e2296d: Preparing
3eb3677be944: Preparing
9091f97c3a30: Preparing
c45c46033aa8: Preparing
b8a36d10656a: Preparing
4bdafd2541bd: Waiting
d72dc679d2d2: Waiting
5abdf976f667: Waiting
4e9a4483b5db: Waiting
31a651a56f32: Waiting
9dfc5739a228: Waiting
772581e2296d: Waiting
0338f33f7e94: Waiting
c45c46033aa8: Waiting
3eb3677be944: Waiting
869002af76d6: Waiting
b8a36d10656a: Waiting
5f70bf18a086: Layer already exists
2674ddc50efa: Pushed
ed42dc235811: Pushed
869002af76d6: Pushed
d86a9452c326: Pushed
4bdafd2541bd: Pushed
9dfc5739a228: Pushed
47cfcfad59dd: Pushed
0338f33f7e94: Pushed
5abdf976f667: Pushed
f204e03b9660: Pushed
3eb3677be944: Layer already exists
d72dc679d2d2: Pushed
9091f97c3a30: Layer already exists
b8a36d10656a: Layer already exists
31a651a56f32: Pushed
c45c46033aa8: Layer already exists
4e9a4483b5db: Pushed
772581e2296d: Pushed
20230508185111: digest: sha256:ad6615ca3a7e8308d4342aeda8a3dcd8000026cf1e00f5a4ce1e9c6232dd4d4b size: 4296

> Task :runners:google-cloud-dataflow-java:validatesRunnerV2Test

org.apache.beam.sdk.testing.PAssertTest > testAssertionSiteIsCapturedWithMessage FAILED
    java.lang.AssertionError at PAssertTest.java:554

org.apache.beam.sdk.testing.PAssertTest > testEmptyFalse FAILED
    java.lang.AssertionError at PAssertTest.java:514

org.apache.beam.sdk.testing.PAssertTest > testPAssertThatListSatisfiesOneMatcherFalse FAILED
    java.lang.AssertionError at PAssertTest.java:700

org.apache.beam.sdk.testing.PAssertTest > testPAssertEqualsSingletonFalse FAILED
    java.lang.AssertionError at PAssertTest.java:384

org.apache.beam.sdk.testing.PAssertTest > testPAssertEqualsSingletonFalseDefaultReasonString FAILED
    java.lang.AssertionError at PAssertTest.java:400

org.apache.beam.sdk.testing.PAssertTest > testPAssertThatFlattenedFalse FAILED
    java.lang.AssertionError at PAssertTest.java:652

org.apache.beam.sdk.testing.PAssertTest > testEmptyFalseDefaultReasonString FAILED
    java.lang.AssertionError at PAssertTest.java:528

org.apache.beam.sdk.testing.PAssertTest > testPAssertThatListSatisfiesMultipleMatchersFalse FAILED
    java.lang.AssertionError at PAssertTest.java:762

org.apache.beam.sdk.transforms.ParDoTest$LifecycleTests > testParDoWithErrorInStartBatch FAILED
    java.lang.AssertionError at MatcherAssert.java:18

org.apache.beam.sdk.testing.PAssertTest > testAssertionSiteIsCapturedWithoutMessage FAILED
    java.lang.AssertionError at PAssertTest.java:570

org.apache.beam.sdk.transforms.ParDoTest$LifecycleTests > testParDoWithErrorInProcessElement FAILED
    java.lang.AssertionError at MatcherAssert.java:18

org.apache.beam.sdk.transforms.ParDoTest$LifecycleTests > testParDoWithErrorInFinishBatch FAILED
    java.lang.AssertionError at MatcherAssert.java:18

org.apache.beam.sdk.testing.PAssertTest > testContainsInAnyOrderFalse FAILED
    java.lang.AssertionError at PAssertTest.java:495

220 tests completed, 13 failed, 1 skipped

> Task :runners:google-cloud-dataflow-java:validatesRunnerV2Test FAILED

FAILURE: Build failed with an exception.

* What went wrong:
Execution failed for task ':runners:google-cloud-dataflow-java:validatesRunnerV2Test'.
> There were failing tests. See the report at: file://<https://ci-beam.apache.org/job/beam_PostCommit_Java_VR_Dataflow_V2/ws/src/runners/google-cloud-dataflow-java/build/reports/tests/validatesRunnerV2Test/index.html>

* Try:
> Run with --stacktrace option to get the stack trace.
> Run with --info or --debug option to get more log output.

* Get more help at https://help.gradle.org

Deprecated Gradle features were used in this build, making it incompatible with Gradle 8.0.

You can use '--warning-mode all' to show the individual deprecation warnings and determine if they come from your own scripts or plugins.

See https://docs.gradle.org/7.5.1/userguide/command_line_interface.html#sec:command_line_warnings

Execution optimizations have been disabled for 1 invalid unit(s) of work during this build to ensure correctness.
Please consult deprecation warnings for more details.

BUILD FAILED in 4h 12m 10s
148 actionable tasks: 94 executed, 50 from cache, 4 up-to-date
Build scan background action failed.
java.lang.IllegalArgumentException: com.gradle.enterprise.gradleplugin.internal.extension.a is not an interface
	at java.lang.reflect.Proxy$ProxyClassFactory.apply(Proxy.java:590)
	at java.lang.reflect.Proxy$ProxyClassFactory.apply(Proxy.java:557)
	at java.lang.reflect.WeakCache$Factory.get(WeakCache.java:230)
	at java.lang.reflect.WeakCache.get(WeakCache.java:127)
	at java.lang.reflect.Proxy.getProxyClass0(Proxy.java:419)
	at java.lang.reflect.Proxy.newProxyInstance(Proxy.java:719)
	at com.gradle.ProxyFactory$ProxyingInvocationHandler.createLocalProxy(ProxyFactory.java:66)
	at com.gradle.ProxyFactory$ProxyingInvocationHandler.lambda$adaptActionArg$1(ProxyFactory.java:61)
	at com.gradle.enterprise.gradleplugin.internal.extension.b$3.run(SourceFile:100)
	at java.util.concurrent.Executors$RunnableAdapter.call(Executors.java:511)
	at java.util.concurrent.FutureTask.run(FutureTask.java:266)
	at java.util.concurrent.ThreadPoolExecutor.runWorker(ThreadPoolExecutor.java:1149)
	at java.util.concurrent.ThreadPoolExecutor$Worker.run(ThreadPoolExecutor.java:624)
	at java.lang.Thread.run(Thread.java:750)

Publishing build scan...
https://ge.apache.org/s/vlj7mlyxh6tfa

Build step 'Invoke Gradle script' changed build result to FAILURE
Build step 'Invoke Gradle script' marked build as failure

---------------------------------------------------------------------
To unsubscribe, e-mail: builds-unsubscribe@beam.apache.org
For additional commands, e-mail: builds-help@beam.apache.org