You are viewing a plain text version of this content. The canonical link for it is here.
Posted to commits@phoenix.apache.org by Apache Jenkins Server <je...@builds.apache.org> on 2017/06/07 20:18:12 UTC

Build failed in Jenkins: Phoenix | 4.x-HBase-0.98 #1529

See <https://builds.apache.org/job/Phoenix-4.x-HBase-0.98/1529/display/redirect?page=changes>

Changes:

[samarth] PHOENIX-3836 Estimated row count is twice the actual row count when

------------------------------------------
[...truncated 79.73 KB...]
Tests run: 2, Failures: 0, Errors: 0, Skipped: 0, Time elapsed: 2.571 sec - in org.apache.phoenix.end2end.RegexpSubstrFunctionIT
Running org.apache.phoenix.end2end.ReverseFunctionIT
Tests run: 5, Failures: 0, Errors: 0, Skipped: 0, Time elapsed: 5.884 sec - in org.apache.phoenix.end2end.ReverseFunctionIT
Running org.apache.phoenix.end2end.ReverseScanIT
Tests run: 4, Failures: 0, Errors: 0, Skipped: 0, Time elapsed: 5.528 sec - in org.apache.phoenix.end2end.ReverseScanIT
Running org.apache.phoenix.end2end.RoundFloorCeilFuncIT
Tests run: 12, Failures: 0, Errors: 0, Skipped: 0, Time elapsed: 15.84 sec - in org.apache.phoenix.end2end.RegexpSplitFunctionIT
Running org.apache.phoenix.end2end.SerialIteratorsIT
Tests run: 1, Failures: 0, Errors: 0, Skipped: 0, Time elapsed: 0.83 sec - in org.apache.phoenix.end2end.SerialIteratorsIT
Running org.apache.phoenix.end2end.ServerExceptionIT
Tests run: 1, Failures: 0, Errors: 0, Skipped: 0, Time elapsed: 1.289 sec - in org.apache.phoenix.end2end.ServerExceptionIT
Running org.apache.phoenix.end2end.SignFunctionEnd2EndIT
Tests run: 2, Failures: 0, Errors: 0, Skipped: 0, Time elapsed: 5.282 sec - in org.apache.phoenix.end2end.SignFunctionEnd2EndIT
Running org.apache.phoenix.end2end.SkipScanAfterManualSplitIT
Tests run: 3, Failures: 0, Errors: 0, Skipped: 0, Time elapsed: 20.282 sec - in org.apache.phoenix.end2end.SkipScanAfterManualSplitIT
Running org.apache.phoenix.end2end.SkipScanQueryIT
Tests run: 33, Failures: 0, Errors: 0, Skipped: 0, Time elapsed: 40.774 sec - in org.apache.phoenix.end2end.RoundFloorCeilFuncIT
Tests run: 12, Failures: 0, Errors: 0, Skipped: 0, Time elapsed: 15.08 sec - in org.apache.phoenix.end2end.SkipScanQueryIT
Running org.apache.phoenix.end2end.SortMergeJoinIT
Tests run: 28, Failures: 0, Errors: 0, Skipped: 0, Time elapsed: 342.953 sec - in org.apache.phoenix.end2end.InListIT
Tests run: 75, Failures: 0, Errors: 0, Skipped: 0, Time elapsed: 295.075 sec - in org.apache.phoenix.end2end.OnDuplicateKeyIT
Running org.apache.phoenix.end2end.SortOrderIT
Running org.apache.phoenix.end2end.SortMergeJoinMoreIT
Tests run: 5, Failures: 0, Errors: 0, Skipped: 0, Time elapsed: 15.995 sec - in org.apache.phoenix.end2end.SortMergeJoinMoreIT
Running org.apache.phoenix.end2end.SpooledTmpFileDeleteIT
Tests run: 1, Failures: 0, Errors: 0, Skipped: 0, Time elapsed: 1.576 sec - in org.apache.phoenix.end2end.SpooledTmpFileDeleteIT
Running org.apache.phoenix.end2end.SqrtFunctionEnd2EndIT
Tests run: 2, Failures: 0, Errors: 0, Skipped: 0, Time elapsed: 4.157 sec - in org.apache.phoenix.end2end.SqrtFunctionEnd2EndIT
Running org.apache.phoenix.end2end.StatementHintsIT
Tests run: 2, Failures: 0, Errors: 0, Skipped: 0, Time elapsed: 1.318 sec - in org.apache.phoenix.end2end.StatementHintsIT
Running org.apache.phoenix.end2end.StddevIT
Tests run: 4, Failures: 0, Errors: 0, Skipped: 0, Time elapsed: 5.233 sec - in org.apache.phoenix.end2end.StddevIT
Running org.apache.phoenix.end2end.StoreNullsIT

Results :

Tests run: 1019, Failures: 0, Errors: 0, Skipped: 0

[INFO] 
[INFO] --- maven-failsafe-plugin:2.19.1:integration-test (ClientManagedTimeTests) @ phoenix-core ---

-------------------------------------------------------
 T E S T S
-------------------------------------------------------
Running org.apache.phoenix.end2end.ArrayIT
Running org.apache.phoenix.end2end.CastAndCoerceIT
Running org.apache.phoenix.end2end.ClientTimeArithmeticQueryIT
Running org.apache.phoenix.end2end.AggregateQueryIT
Running org.apache.phoenix.end2end.CaseStatementIT
Tests run: 80, Failures: 0, Errors: 0, Skipped: 0, Time elapsed: 58.186 sec - in org.apache.phoenix.end2end.ArrayIT
Running org.apache.phoenix.end2end.ColumnProjectionOptimizationIT
Tests run: 49, Failures: 0, Errors: 0, Skipped: 0, Time elapsed: 60.092 sec - in org.apache.phoenix.end2end.CastAndCoerceIT
Running org.apache.phoenix.end2end.CreateSchemaIT
Tests run: 1, Failures: 0, Errors: 0, Skipped: 0, Time elapsed: 0.283 sec - in org.apache.phoenix.end2end.CreateSchemaIT
Running org.apache.phoenix.end2end.CreateTableIT
Tests run: 56, Failures: 0, Errors: 0, Skipped: 0, Time elapsed: 61.134 sec - in org.apache.phoenix.end2end.CaseStatementIT
Running org.apache.phoenix.end2end.CustomEntityDataIT
Tests run: 3, Failures: 0, Errors: 0, Skipped: 0, Time elapsed: 3.8 sec - in org.apache.phoenix.end2end.CustomEntityDataIT
Running org.apache.phoenix.end2end.DerivedTableIT
Tests run: 3, Failures: 0, Errors: 0, Skipped: 0, Time elapsed: 14.865 sec - in org.apache.phoenix.end2end.ColumnProjectionOptimizationIT
Running org.apache.phoenix.end2end.DistinctCountIT
Tests run: 42, Failures: 0, Errors: 0, Skipped: 0, Time elapsed: 76.198 sec - in org.apache.phoenix.end2end.AggregateQueryIT
Running org.apache.phoenix.end2end.DropSchemaIT
Tests run: 18, Failures: 0, Errors: 0, Skipped: 0, Time elapsed: 13.899 sec - in org.apache.phoenix.end2end.DerivedTableIT
Running org.apache.phoenix.end2end.ExtendedQueryExecIT
Tests run: 2, Failures: 0, Errors: 0, Skipped: 0, Time elapsed: 4.648 sec - in org.apache.phoenix.end2end.DropSchemaIT
Tests run: 10, Failures: 0, Errors: 0, Skipped: 0, Time elapsed: 10.655 sec - in org.apache.phoenix.end2end.DistinctCountIT
Running org.apache.phoenix.end2end.FunkyNamesIT
Tests run: 4, Failures: 0, Errors: 0, Skipped: 0, Time elapsed: 4.082 sec - in org.apache.phoenix.end2end.ExtendedQueryExecIT
Running org.apache.phoenix.end2end.GroupByIT
Tests run: 3, Failures: 0, Errors: 0, Skipped: 0, Time elapsed: 3.694 sec - in org.apache.phoenix.end2end.FunkyNamesIT
Running org.apache.phoenix.end2end.MutableQueryIT
Running org.apache.phoenix.end2end.NativeHBaseTypesIT
Tests run: 7, Failures: 0, Errors: 0, Skipped: 0, Time elapsed: 2.704 sec - in org.apache.phoenix.end2end.NativeHBaseTypesIT
Running org.apache.phoenix.end2end.NotQueryIT
Tests run: 19, Failures: 0, Errors: 0, Skipped: 0, Time elapsed: 76.505 sec - in org.apache.phoenix.end2end.CreateTableIT
Tests run: 245, Failures: 0, Errors: 0, Skipped: 0, Time elapsed: 137.955 sec - in org.apache.phoenix.end2end.ClientTimeArithmeticQueryIT
Running org.apache.phoenix.end2end.PointInTimeQueryIT
Tests run: 77, Failures: 0, Errors: 0, Skipped: 0, Time elapsed: 42.744 sec - in org.apache.phoenix.end2end.NotQueryIT
Running org.apache.phoenix.end2end.ProductMetricsIT
Tests run: 7, Failures: 0, Errors: 0, Skipped: 0, Time elapsed: 19.012 sec - in org.apache.phoenix.end2end.PointInTimeQueryIT
Running org.apache.phoenix.end2end.QueryIT
Tests run: 91, Failures: 0, Errors: 0, Skipped: 0, Time elapsed: 73.877 sec - in org.apache.phoenix.end2end.GroupByIT
Running org.apache.phoenix.end2end.QueryDatabaseMetaDataIT
Tests run: 61, Failures: 0, Errors: 0, Skipped: 0, Time elapsed: 25.95 sec - in org.apache.phoenix.end2end.ProductMetricsIT
Running org.apache.phoenix.end2end.ReadIsolationLevelIT
Tests run: 2, Failures: 0, Errors: 0, Skipped: 0, Time elapsed: 2.88 sec - in org.apache.phoenix.end2end.ReadIsolationLevelIT
Running org.apache.phoenix.end2end.ScanQueryIT
Running org.apache.phoenix.end2end.RowValueConstructorIT
Tests run: 112, Failures: 0, Errors: 0, Skipped: 0, Time elapsed: 130.354 sec - in org.apache.phoenix.end2end.MutableQueryIT
Tests run: 112, Failures: 0, Errors: 0, Skipped: 0, Time elapsed: 61.997 sec - in org.apache.phoenix.end2end.QueryIT
Tests run: 19, Failures: 0, Errors: 0, Skipped: 0, Time elapsed: 73.644 sec - in org.apache.phoenix.end2end.QueryDatabaseMetaDataIT
Running org.apache.phoenix.end2end.SequenceIT
Running org.apache.phoenix.end2end.SequenceBulkAllocationIT
Tests run: 112, Failures: 0, Errors: 0, Skipped: 0, Time elapsed: 57.551 sec - in org.apache.phoenix.end2end.ScanQueryIT
Running org.apache.phoenix.end2end.ToNumberFunctionIT
Tests run: 46, Failures: 0, Errors: 0, Skipped: 0, Time elapsed: 59.49 sec - in org.apache.phoenix.end2end.RowValueConstructorIT
Running org.apache.phoenix.end2end.TopNIT
Tests run: 18, Failures: 0, Errors: 0, Skipped: 0, Time elapsed: 7.943 sec - in org.apache.phoenix.end2end.ToNumberFunctionIT
Running org.apache.phoenix.end2end.TruncateFunctionIT
Tests run: 1, Failures: 0, Errors: 0, Skipped: 0, Time elapsed: 2.552 sec - in org.apache.phoenix.end2end.TruncateFunctionIT
Running org.apache.phoenix.end2end.UpsertSelectIT
Tests run: 4, Failures: 0, Errors: 0, Skipped: 0, Time elapsed: 3.946 sec - in org.apache.phoenix.end2end.TopNIT
Running org.apache.phoenix.end2end.UpsertValuesIT
Tests run: 56, Failures: 0, Errors: 0, Skipped: 0, Time elapsed: 17.776 sec - in org.apache.phoenix.end2end.SequenceBulkAllocationIT
Running org.apache.phoenix.end2end.VariableLengthPKIT
Tests run: 54, Failures: 0, Errors: 0, Skipped: 0, Time elapsed: 28.225 sec - in org.apache.phoenix.end2end.SequenceIT
Running org.apache.phoenix.end2end.salted.SaltedTableIT
Tests run: 8, Failures: 0, Errors: 0, Skipped: 0, Time elapsed: 4.129 sec - in org.apache.phoenix.end2end.salted.SaltedTableIT
Running org.apache.phoenix.rpc.UpdateCacheWithScnIT
Tests run: 1, Failures: 0, Errors: 0, Skipped: 0, Time elapsed: 3.337 sec - in org.apache.phoenix.rpc.UpdateCacheWithScnIT
Tests run: 50, Failures: 0, Errors: 0, Skipped: 0, Time elapsed: 32.864 sec - in org.apache.phoenix.end2end.VariableLengthPKIT
Tests run: 25, Failures: 0, Errors: 0, Skipped: 0, Time elapsed: 55.866 sec - in org.apache.phoenix.end2end.UpsertValuesIT
Tests run: 22, Failures: 0, Errors: 0, Skipped: 0, Time elapsed: 65.157 sec - in org.apache.phoenix.end2end.UpsertSelectIT

Results :

Tests run: 1420, Failures: 0, Errors: 0, Skipped: 0

[INFO] 
[INFO] --- maven-failsafe-plugin:2.19.1:integration-test (HBaseManagedTimeTests) @ phoenix-core ---

-------------------------------------------------------
 T E S T S
-------------------------------------------------------

Results :

Tests run: 0, Failures: 0, Errors: 0, Skipped: 0

[INFO] 
[INFO] --- maven-failsafe-plugin:2.19.1:integration-test (NeedTheirOwnClusterTests) @ phoenix-core ---

-------------------------------------------------------
 T E S T S
-------------------------------------------------------
Running org.apache.hadoop.hbase.regionserver.wal.WALReplayWithIndexWritesAndCompressedWALIT
Tests run: 1, Failures: 0, Errors: 0, Skipped: 0, Time elapsed: 20.547 sec - in org.apache.hadoop.hbase.regionserver.wal.WALReplayWithIndexWritesAndCompressedWALIT
Running org.apache.phoenix.end2end.ConnectionUtilIT
Running org.apache.phoenix.end2end.CountDistinctCompressionIT
Running org.apache.phoenix.end2end.ContextClassloaderIT
Tests run: 1, Failures: 0, Errors: 0, Skipped: 0, Time elapsed: 18.249 sec - in org.apache.phoenix.end2end.ConnectionUtilIT
Tests run: 3, Failures: 0, Errors: 0, Skipped: 0, Time elapsed: 3.359 sec - in org.apache.phoenix.end2end.ContextClassloaderIT
Running org.apache.phoenix.end2end.CsvBulkLoadToolIT
Tests run: 1, Failures: 0, Errors: 0, Skipped: 0, Time elapsed: 12.814 sec - in org.apache.phoenix.end2end.CountDistinctCompressionIT
Running org.apache.phoenix.end2end.FlappingLocalIndexIT
Running org.apache.phoenix.end2end.IndexToolForPartialBuildIT
Running org.apache.phoenix.end2end.IndexExtendedIT
Running org.apache.phoenix.end2end.IndexToolForPartialBuildWithNamespaceEnabledIT
Tests run: 2, Failures: 0, Errors: 0, Skipped: 0, Time elapsed: 24.559 sec - in org.apache.phoenix.end2end.IndexToolForPartialBuildIT
Tests run: 2, Failures: 0, Errors: 0, Skipped: 0, Time elapsed: 23.86 sec - in org.apache.phoenix.end2end.IndexToolForPartialBuildWithNamespaceEnabledIT
Tests run: 11, Failures: 0, Errors: 0, Skipped: 0, Time elapsed: 61.276 sec - in org.apache.phoenix.end2end.CsvBulkLoadToolIT
Tests run: 40, Failures: 0, Errors: 0, Skipped: 16, Time elapsed: 41.99 sec - in org.apache.phoenix.end2end.IndexExtendedIT
Tests run: 8, Failures: 0, Errors: 0, Skipped: 0, Time elapsed: 63.02 sec - in org.apache.phoenix.end2end.FlappingLocalIndexIT
Running org.apache.phoenix.end2end.QueryWithLimitIT
Running org.apache.phoenix.end2end.QueryTimeoutIT
Running org.apache.phoenix.end2end.RegexBulkLoadToolIT
Running org.apache.phoenix.end2end.RenewLeaseIT
Tests run: 2, Failures: 0, Errors: 0, Skipped: 0, Time elapsed: 13.764 sec - in org.apache.phoenix.end2end.QueryWithLimitIT
Tests run: 2, Failures: 0, Errors: 0, Skipped: 0, Time elapsed: 22.134 sec - in org.apache.phoenix.end2end.QueryTimeoutIT
Running org.apache.phoenix.end2end.SpillableGroupByIT
Running org.apache.phoenix.end2end.StatsCollectorIT
Tests run: 1, Failures: 0, Errors: 0, Skipped: 0, Time elapsed: 31.675 sec - in org.apache.phoenix.end2end.RenewLeaseIT
Tests run: 2, Failures: 0, Errors: 0, Skipped: 0, Time elapsed: 13.6 sec - in org.apache.phoenix.end2end.SpillableGroupByIT
Running org.apache.phoenix.end2end.SysTableNamespaceMappedStatsCollectorIT
Tests run: 10, Failures: 0, Errors: 0, Skipped: 0, Time elapsed: 55.382 sec - in org.apache.phoenix.end2end.RegexBulkLoadToolIT
Running org.apache.phoenix.end2end.UpdateCacheAcrossDifferentClientsIT
Running org.apache.phoenix.end2end.UserDefinedFunctionsIT
Running org.apache.phoenix.end2end.index.ImmutableIndexIT
Tests run: 6, Failures: 0, Errors: 0, Skipped: 0, Time elapsed: 23.593 sec - in org.apache.phoenix.end2end.UpdateCacheAcrossDifferentClientsIT
Tests run: 14, Failures: 0, Errors: 0, Skipped: 0, Time elapsed: 29.086 sec - in org.apache.phoenix.end2end.UserDefinedFunctionsIT
Running org.apache.phoenix.end2end.index.MutableIndexFailureIT
Tests run: 1, Failures: 0, Errors: 0, Skipped: 1, Time elapsed: 0.002 sec - in org.apache.phoenix.end2end.index.MutableIndexFailureIT
Running org.apache.phoenix.end2end.index.LocalIndexIT
Running org.apache.phoenix.end2end.index.MutableIndexReplicationIT
Tests run: 1, Failures: 0, Errors: 0, Skipped: 0, Time elapsed: 16.56 sec - in org.apache.phoenix.end2end.index.MutableIndexReplicationIT
Running org.apache.phoenix.end2end.index.txn.TxWriteFailureIT
Tests run: 8, Failures: 0, Errors: 0, Skipped: 0, Time elapsed: 43.552 sec - in org.apache.phoenix.end2end.index.txn.TxWriteFailureIT
Running org.apache.phoenix.execute.PartialCommitIT
Tests run: 12, Failures: 0, Errors: 0, Skipped: 0, Time elapsed: 6.351 sec - in org.apache.phoenix.execute.PartialCommitIT
Running org.apache.phoenix.hbase.index.FailForUnsupportedHBaseVersionsIT
Tests run: 132, Failures: 0, Errors: 0, Skipped: 24, Time elapsed: 265.405 sec - in org.apache.phoenix.end2end.StatsCollectorIT
Tests run: 2, Failures: 0, Errors: 0, Skipped: 0, Time elapsed: 17.428 sec - in org.apache.phoenix.hbase.index.FailForUnsupportedHBaseVersionsIT
Running org.apache.phoenix.hbase.index.covered.EndToEndCoveredColumnsIndexBuilderIT
Tests run: 132, Failures: 0, Errors: 0, Skipped: 24, Time elapsed: 264.938 sec - in org.apache.phoenix.end2end.SysTableNamespaceMappedStatsCollectorIT
Tests run: 2, Failures: 0, Errors: 0, Skipped: 0, Time elapsed: 7.616 sec - in org.apache.phoenix.hbase.index.covered.EndToEndCoveredColumnsIndexBuilderIT
Running org.apache.phoenix.hbase.index.covered.example.FailWithoutRetriesIT
Running org.apache.phoenix.hbase.index.covered.example.EndToEndCoveredIndexingIT
Tests run: 1, Failures: 0, Errors: 0, Skipped: 0, Time elapsed: 8.152 sec - in org.apache.phoenix.hbase.index.covered.example.FailWithoutRetriesIT
Running org.apache.phoenix.hbase.index.covered.example.EndtoEndIndexingWithCompressionIT
Running org.apache.phoenix.iterate.RoundRobinResultIteratorWithStatsIT
Tests run: 24, Failures: 0, Errors: 0, Skipped: 0, Time elapsed: 286.797 sec - in org.apache.phoenix.end2end.index.ImmutableIndexIT
Tests run: 1, Failures: 0, Errors: 0, Skipped: 0, Time elapsed: 12.769 sec - in org.apache.phoenix.iterate.RoundRobinResultIteratorWithStatsIT
Tests run: 32, Failures: 0, Errors: 0, Skipped: 0, Time elapsed: 250.261 sec - in org.apache.phoenix.end2end.index.LocalIndexIT
Tests run: 11, Failures: 0, Errors: 0, Skipped: 0, Time elapsed: 53.581 sec - in org.apache.phoenix.hbase.index.covered.example.EndToEndCoveredIndexingIT
Tests run: 11, Failures: 0, Errors: 0, Skipped: 0, Time elapsed: 53.792 sec - in org.apache.phoenix.hbase.index.covered.example.EndtoEndIndexingWithCompressionIT
Running org.apache.phoenix.iterate.ScannerLeaseRenewalIT
Running org.apache.phoenix.rpc.PhoenixClientRpcIT
Running org.apache.phoenix.monitoring.PhoenixMetricsIT
Tests run: 2, Failures: 0, Errors: 0, Skipped: 0, Time elapsed: 5.177 sec - in org.apache.phoenix.rpc.PhoenixClientRpcIT
Running org.apache.phoenix.rpc.PhoenixServerRpcIT
Tests run: 2, Failures: 0, Errors: 0, Skipped: 0, Time elapsed: 15.522 sec - in org.apache.phoenix.rpc.PhoenixServerRpcIT
Tests run: 21, Failures: 0, Errors: 0, Skipped: 0, Time elapsed: 44.19 sec - in org.apache.phoenix.monitoring.PhoenixMetricsIT
Tests run: 2, Failures: 0, Errors: 0, Skipped: 0, Time elapsed: 162.466 sec - in org.apache.phoenix.iterate.ScannerLeaseRenewalIT

Results :

Tests run: 503, Failures: 0, Errors: 0, Skipped: 65

[INFO] 
[INFO] --- maven-failsafe-plugin:2.19.1:verify (ParallelStatsEnabledTest) @ phoenix-core ---
[INFO] ------------------------------------------------------------------------
[INFO] Reactor Summary:
[INFO] 
[INFO] Apache Phoenix ..................................... SUCCESS [  4.011 s]
[INFO] Phoenix Core ....................................... FAILURE [35:22 min]
[INFO] Phoenix - Flume .................................... SKIPPED
[INFO] Phoenix - Kafka .................................... SKIPPED
[INFO] Phoenix - Pig ...................................... SKIPPED
[INFO] Phoenix Query Server Client ........................ SKIPPED
[INFO] Phoenix Query Server ............................... SKIPPED
[INFO] Phoenix - Pherf .................................... SKIPPED
[INFO] Phoenix - Spark .................................... SKIPPED
[INFO] Phoenix - Hive ..................................... SKIPPED
[INFO] Phoenix Client ..................................... SKIPPED
[INFO] Phoenix Server ..................................... SKIPPED
[INFO] Phoenix Assembly ................................... SKIPPED
[INFO] Phoenix - Tracing Web Application .................. SKIPPED
[INFO] ------------------------------------------------------------------------
[INFO] BUILD FAILURE
[INFO] ------------------------------------------------------------------------
[INFO] Total time: 35:30 min
[INFO] Finished at: 2017-06-07T20:09:30Z
[INFO] Final Memory: 75M/778M
[INFO] ------------------------------------------------------------------------
[ERROR] Failed to execute goal org.apache.maven.plugins:maven-failsafe-plugin:2.19.1:verify (ParallelStatsEnabledTest) on project phoenix-core: There was a timeout or other error in the fork -> [Help 1]
[ERROR] 
[ERROR] To see the full stack trace of the errors, re-run Maven with the -e switch.
[ERROR] Re-run Maven using the -X switch to enable full debug logging.
[ERROR] 
[ERROR] For more information about the errors and possible solutions, please read the following articles:
[ERROR] [Help 1] http://cwiki.apache.org/confluence/display/MAVEN/MojoExecutionException
[ERROR] 
[ERROR] After correcting the problems, you can resume the build with the command
[ERROR]   mvn <goals> -rf :phoenix-core
Build step 'Invoke top-level Maven targets' marked build as failure
Archiving artifacts
Recording test results
Not sending mail to unregistered user ankitsinghal59@gmail.com

Build failed in Jenkins: Phoenix | 4.x-HBase-0.98 #1532

Posted by Apache Jenkins Server <je...@builds.apache.org>.
See <https://builds.apache.org/job/Phoenix-4.x-HBase-0.98/1532/display/redirect?page=changes>

Changes:

[samarth] Revert "PHOENIX-3917 RowProjector#getEstimatedRowByteSize() returns

------------------------------------------
[...truncated 91.29 KB...]
Running org.apache.phoenix.iterate.PhoenixQueryTimeoutIT
Tests run: 6, Failures: 0, Errors: 0, Skipped: 0, Time elapsed: 15.01 sec - in org.apache.phoenix.end2end.salted.SaltedTableUpsertSelectIT
Running org.apache.phoenix.iterate.RoundRobinResultIteratorIT
Tests run: 2, Failures: 0, Errors: 0, Skipped: 0, Time elapsed: 2.374 sec - in org.apache.phoenix.iterate.PhoenixQueryTimeoutIT
Running org.apache.phoenix.rpc.UpdateCacheIT
Running org.apache.phoenix.end2end.salted.SaltedTableVarLengthRowKeyIT
Tests run: 1, Failures: 0, Errors: 0, Skipped: 0, Time elapsed: 1.329 sec - in org.apache.phoenix.end2end.salted.SaltedTableVarLengthRowKeyIT
Running org.apache.phoenix.trace.PhoenixTableMetricsWriterIT
Tests run: 2, Failures: 0, Errors: 0, Skipped: 0, Time elapsed: 2.648 sec - in org.apache.phoenix.trace.PhoenixTableMetricsWriterIT
Running org.apache.phoenix.trace.PhoenixTraceReaderIT
Tests run: 7, Failures: 0, Errors: 0, Skipped: 0, Time elapsed: 19.856 sec - in org.apache.phoenix.rpc.UpdateCacheIT
Running org.apache.phoenix.trace.PhoenixTracingEndToEndIT
Tests run: 2, Failures: 0, Errors: 0, Skipped: 0, Time elapsed: 2.142 sec - in org.apache.phoenix.trace.PhoenixTraceReaderIT
Running org.apache.phoenix.tx.FlappingTransactionIT
Tests run: 4, Failures: 0, Errors: 0, Skipped: 0, Time elapsed: 6.638 sec - in org.apache.phoenix.tx.FlappingTransactionIT
Running org.apache.phoenix.tx.ParameterizedTransactionIT
Tests run: 9, Failures: 0, Errors: 0, Skipped: 0, Time elapsed: 38.55 sec - in org.apache.phoenix.iterate.RoundRobinResultIteratorIT
Running org.apache.phoenix.tx.TransactionIT
Tests run: 7, Failures: 0, Errors: 0, Skipped: 0, Time elapsed: 33.354 sec - in org.apache.phoenix.tx.TransactionIT
Running org.apache.phoenix.tx.TxCheckpointIT
Tests run: 6, Failures: 0, Errors: 0, Skipped: 0, Time elapsed: 87.304 sec - in org.apache.phoenix.trace.PhoenixTracingEndToEndIT
Tests run: 52, Failures: 0, Errors: 0, Skipped: 4, Time elapsed: 141.754 sec - in org.apache.phoenix.tx.ParameterizedTransactionIT
Tests run: 64, Failures: 0, Errors: 0, Skipped: 0, Time elapsed: 459.477 sec - in org.apache.phoenix.end2end.index.MutableIndexIT
Tests run: 40, Failures: 0, Errors: 0, Skipped: 0, Time elapsed: 208.117 sec - in org.apache.phoenix.tx.TxCheckpointIT
Tests run: 304, Failures: 0, Errors: 0, Skipped: 0, Time elapsed: 1,443.396 sec - in org.apache.phoenix.end2end.index.IndexIT

Results :

Tests in error: 
  TimezoneOffsetFunctionIT.dateParameterNull:172 » SQL ERROR 201 (22000): Illega...
  TimezoneOffsetFunctionIT.testBothParametersNull:130 » SQL ERROR 201 (22000): I...
  TimezoneOffsetFunctionIT.timezoneParameterNull:151 » SQL ERROR 201 (22000): Il...

Tests run: 2103, Failures: 0, Errors: 3, Skipped: 4

[INFO] 
[INFO] --- maven-failsafe-plugin:2.19.1:integration-test (ClientManagedTimeTests) @ phoenix-core ---

-------------------------------------------------------
 T E S T S
-------------------------------------------------------
Running org.apache.phoenix.end2end.ArrayIT
Running org.apache.phoenix.end2end.CastAndCoerceIT
Running org.apache.phoenix.end2end.ClientTimeArithmeticQueryIT
Running org.apache.phoenix.end2end.AggregateQueryIT
Running org.apache.phoenix.end2end.CaseStatementIT
Tests run: 49, Failures: 0, Errors: 0, Skipped: 0, Time elapsed: 57.432 sec - in org.apache.phoenix.end2end.CastAndCoerceIT
Running org.apache.phoenix.end2end.ColumnProjectionOptimizationIT
Tests run: 80, Failures: 0, Errors: 0, Skipped: 0, Time elapsed: 59.111 sec - in org.apache.phoenix.end2end.ArrayIT
Running org.apache.phoenix.end2end.CreateSchemaIT
Tests run: 1, Failures: 0, Errors: 0, Skipped: 0, Time elapsed: 0.258 sec - in org.apache.phoenix.end2end.CreateSchemaIT
Running org.apache.phoenix.end2end.CreateTableIT
Tests run: 56, Failures: 0, Errors: 0, Skipped: 0, Time elapsed: 58.029 sec - in org.apache.phoenix.end2end.CaseStatementIT
Running org.apache.phoenix.end2end.CustomEntityDataIT
Tests run: 3, Failures: 0, Errors: 0, Skipped: 0, Time elapsed: 3.78 sec - in org.apache.phoenix.end2end.CustomEntityDataIT
Running org.apache.phoenix.end2end.DerivedTableIT
Tests run: 3, Failures: 0, Errors: 0, Skipped: 0, Time elapsed: 17.718 sec - in org.apache.phoenix.end2end.ColumnProjectionOptimizationIT
Running org.apache.phoenix.end2end.DistinctCountIT
Tests run: 42, Failures: 0, Errors: 0, Skipped: 0, Time elapsed: 74.71 sec - in org.apache.phoenix.end2end.AggregateQueryIT
Running org.apache.phoenix.end2end.DropSchemaIT
Tests run: 18, Failures: 0, Errors: 0, Skipped: 0, Time elapsed: 12.894 sec - in org.apache.phoenix.end2end.DerivedTableIT
Running org.apache.phoenix.end2end.ExtendedQueryExecIT
Tests run: 4, Failures: 0, Errors: 0, Skipped: 0, Time elapsed: 3.516 sec - in org.apache.phoenix.end2end.ExtendedQueryExecIT
Running org.apache.phoenix.end2end.FunkyNamesIT
Tests run: 2, Failures: 0, Errors: 0, Skipped: 0, Time elapsed: 5.009 sec - in org.apache.phoenix.end2end.DropSchemaIT
Running org.apache.phoenix.end2end.GroupByIT
Tests run: 3, Failures: 0, Errors: 0, Skipped: 0, Time elapsed: 3.866 sec - in org.apache.phoenix.end2end.FunkyNamesIT
Tests run: 10, Failures: 0, Errors: 0, Skipped: 0, Time elapsed: 11.301 sec - in org.apache.phoenix.end2end.DistinctCountIT
Running org.apache.phoenix.end2end.MutableQueryIT
Running org.apache.phoenix.end2end.NativeHBaseTypesIT
Tests run: 7, Failures: 0, Errors: 0, Skipped: 0, Time elapsed: 2.6 sec - in org.apache.phoenix.end2end.NativeHBaseTypesIT
Running org.apache.phoenix.end2end.NotQueryIT
Tests run: 245, Failures: 0, Errors: 0, Skipped: 0, Time elapsed: 128.397 sec - in org.apache.phoenix.end2end.ClientTimeArithmeticQueryIT
Tests run: 91, Failures: 0, Errors: 0, Skipped: 0, Time elapsed: 50.728 sec - in org.apache.phoenix.end2end.GroupByIT
Running org.apache.phoenix.end2end.ProductMetricsIT
Tests run: 77, Failures: 0, Errors: 0, Skipped: 0, Time elapsed: 40.984 sec - in org.apache.phoenix.end2end.NotQueryIT
Running org.apache.phoenix.end2end.QueryDatabaseMetaDataIT
Tests run: 19, Failures: 0, Errors: 0, Skipped: 0, Time elapsed: 83.921 sec - in org.apache.phoenix.end2end.CreateTableIT
Running org.apache.phoenix.end2end.QueryIT
Running org.apache.phoenix.end2end.PointInTimeQueryIT
Tests run: 61, Failures: 0, Errors: 0, Skipped: 0, Time elapsed: 26.113 sec - in org.apache.phoenix.end2end.ProductMetricsIT
Tests run: 7, Failures: 0, Errors: 0, Skipped: 0, Time elapsed: 19.181 sec - in org.apache.phoenix.end2end.PointInTimeQueryIT
Running org.apache.phoenix.end2end.RowValueConstructorIT
Running org.apache.phoenix.end2end.ReadIsolationLevelIT
Tests run: 2, Failures: 0, Errors: 0, Skipped: 0, Time elapsed: 3.234 sec - in org.apache.phoenix.end2end.ReadIsolationLevelIT
Running org.apache.phoenix.end2end.ScanQueryIT
Tests run: 112, Failures: 0, Errors: 0, Skipped: 0, Time elapsed: 128.452 sec - in org.apache.phoenix.end2end.MutableQueryIT
Tests run: 19, Failures: 0, Errors: 0, Skipped: 0, Time elapsed: 84.248 sec - in org.apache.phoenix.end2end.QueryDatabaseMetaDataIT
Tests run: 112, Failures: 0, Errors: 0, Skipped: 0, Time elapsed: 79.54 sec - in org.apache.phoenix.end2end.QueryIT
Tests run: 46, Failures: 0, Errors: 0, Skipped: 0, Time elapsed: 64.064 sec - in org.apache.phoenix.end2end.RowValueConstructorIT
Running org.apache.phoenix.end2end.TopNIT
Tests run: 4, Failures: 0, Errors: 0, Skipped: 0, Time elapsed: 4.017 sec - in org.apache.phoenix.end2end.TopNIT
Running org.apache.phoenix.end2end.TruncateFunctionIT
Running org.apache.phoenix.end2end.SequenceBulkAllocationIT
Tests run: 1, Failures: 0, Errors: 0, Skipped: 0, Time elapsed: 2.492 sec - in org.apache.phoenix.end2end.TruncateFunctionIT
Running org.apache.phoenix.end2end.UpsertSelectIT
Tests run: 112, Failures: 0, Errors: 0, Skipped: 0, Time elapsed: 47.046 sec - in org.apache.phoenix.end2end.ScanQueryIT
Running org.apache.phoenix.end2end.UpsertValuesIT
Running org.apache.phoenix.end2end.SequenceIT
Running org.apache.phoenix.end2end.ToNumberFunctionIT
Tests run: 56, Failures: 0, Errors: 0, Skipped: 0, Time elapsed: 14.561 sec - in org.apache.phoenix.end2end.SequenceBulkAllocationIT
Running org.apache.phoenix.end2end.VariableLengthPKIT
Tests run: 18, Failures: 0, Errors: 0, Skipped: 0, Time elapsed: 6.714 sec - in org.apache.phoenix.end2end.ToNumberFunctionIT
Running org.apache.phoenix.end2end.salted.SaltedTableIT
Tests run: 8, Failures: 0, Errors: 0, Skipped: 0, Time elapsed: 4.365 sec - in org.apache.phoenix.end2end.salted.SaltedTableIT
Running org.apache.phoenix.rpc.UpdateCacheWithScnIT
Tests run: 1, Failures: 0, Errors: 0, Skipped: 0, Time elapsed: 3.28 sec - in org.apache.phoenix.rpc.UpdateCacheWithScnIT
Tests run: 54, Failures: 0, Errors: 0, Skipped: 0, Time elapsed: 26.938 sec - in org.apache.phoenix.end2end.SequenceIT
Tests run: 50, Failures: 0, Errors: 0, Skipped: 0, Time elapsed: 37.611 sec - in org.apache.phoenix.end2end.VariableLengthPKIT
Tests run: 25, Failures: 0, Errors: 0, Skipped: 0, Time elapsed: 63.589 sec - in org.apache.phoenix.end2end.UpsertValuesIT
Tests run: 22, Failures: 0, Errors: 0, Skipped: 0, Time elapsed: 74.11 sec - in org.apache.phoenix.end2end.UpsertSelectIT

Results :

Tests run: 1420, Failures: 0, Errors: 0, Skipped: 0

[INFO] 
[INFO] --- maven-failsafe-plugin:2.19.1:integration-test (HBaseManagedTimeTests) @ phoenix-core ---

-------------------------------------------------------
 T E S T S
-------------------------------------------------------

Results :

Tests run: 0, Failures: 0, Errors: 0, Skipped: 0

[INFO] 
[INFO] --- maven-failsafe-plugin:2.19.1:integration-test (NeedTheirOwnClusterTests) @ phoenix-core ---

-------------------------------------------------------
 T E S T S
-------------------------------------------------------
Running org.apache.hadoop.hbase.regionserver.wal.WALReplayWithIndexWritesAndCompressedWALIT
Running org.apache.phoenix.end2end.ConnectionUtilIT
Tests run: 1, Failures: 0, Errors: 0, Skipped: 0, Time elapsed: 16.736 sec - in org.apache.hadoop.hbase.regionserver.wal.WALReplayWithIndexWritesAndCompressedWALIT
Running org.apache.phoenix.end2end.CountDistinctCompressionIT
Running org.apache.phoenix.end2end.ContextClassloaderIT
Running org.apache.phoenix.end2end.CsvBulkLoadToolIT
Tests run: 1, Failures: 0, Errors: 0, Skipped: 0, Time elapsed: 27.806 sec - in org.apache.phoenix.end2end.ConnectionUtilIT
Tests run: 3, Failures: 0, Errors: 0, Skipped: 0, Time elapsed: 10.371 sec - in org.apache.phoenix.end2end.ContextClassloaderIT
Tests run: 1, Failures: 0, Errors: 0, Skipped: 0, Time elapsed: 11.499 sec - in org.apache.phoenix.end2end.CountDistinctCompressionIT
Running org.apache.phoenix.end2end.FlappingLocalIndexIT
Running org.apache.phoenix.end2end.IndexToolForPartialBuildWithNamespaceEnabledIT
Running org.apache.phoenix.end2end.IndexExtendedIT
Running org.apache.phoenix.end2end.IndexToolForPartialBuildIT
Tests run: 2, Failures: 0, Errors: 0, Skipped: 0, Time elapsed: 22.893 sec - in org.apache.phoenix.end2end.IndexToolForPartialBuildWithNamespaceEnabledIT
Tests run: 2, Failures: 0, Errors: 0, Skipped: 0, Time elapsed: 21.713 sec - in org.apache.phoenix.end2end.IndexToolForPartialBuildIT
Tests run: 11, Failures: 0, Errors: 0, Skipped: 0, Time elapsed: 71.008 sec - in org.apache.phoenix.end2end.CsvBulkLoadToolIT
Tests run: 40, Failures: 0, Errors: 0, Skipped: 16, Time elapsed: 51.84 sec - in org.apache.phoenix.end2end.IndexExtendedIT
Tests run: 8, Failures: 0, Errors: 0, Skipped: 0, Time elapsed: 66.371 sec - in org.apache.phoenix.end2end.FlappingLocalIndexIT
Running org.apache.phoenix.end2end.QueryTimeoutIT
Running org.apache.phoenix.end2end.QueryWithLimitIT
Running org.apache.phoenix.end2end.RegexBulkLoadToolIT
Tests run: 2, Failures: 0, Errors: 0, Skipped: 0, Time elapsed: 11.357 sec - in org.apache.phoenix.end2end.QueryWithLimitIT
Running org.apache.phoenix.end2end.RenewLeaseIT
Tests run: 2, Failures: 0, Errors: 0, Skipped: 0, Time elapsed: 21.959 sec - in org.apache.phoenix.end2end.QueryTimeoutIT
Running org.apache.phoenix.end2end.SpillableGroupByIT
Running org.apache.phoenix.end2end.StatsCollectorIT
Tests run: 2, Failures: 0, Errors: 0, Skipped: 0, Time elapsed: 12.197 sec - in org.apache.phoenix.end2end.SpillableGroupByIT
Tests run: 1, Failures: 0, Errors: 0, Skipped: 0, Time elapsed: 32.099 sec - in org.apache.phoenix.end2end.RenewLeaseIT
Running org.apache.phoenix.end2end.SysTableNamespaceMappedStatsCollectorIT
Tests run: 10, Failures: 0, Errors: 0, Skipped: 0, Time elapsed: 61.72 sec - in org.apache.phoenix.end2end.RegexBulkLoadToolIT
Running org.apache.phoenix.end2end.UpdateCacheAcrossDifferentClientsIT
Running org.apache.phoenix.end2end.UserDefinedFunctionsIT
Running org.apache.phoenix.end2end.index.ImmutableIndexIT
Tests run: 6, Failures: 0, Errors: 0, Skipped: 0, Time elapsed: 21.519 sec - in org.apache.phoenix.end2end.UpdateCacheAcrossDifferentClientsIT
Tests run: 14, Failures: 0, Errors: 0, Skipped: 0, Time elapsed: 32.483 sec - in org.apache.phoenix.end2end.UserDefinedFunctionsIT
Running org.apache.phoenix.end2end.index.MutableIndexFailureIT
Tests run: 1, Failures: 0, Errors: 0, Skipped: 1, Time elapsed: 0.002 sec - in org.apache.phoenix.end2end.index.MutableIndexFailureIT
Running org.apache.phoenix.end2end.index.LocalIndexIT
Running org.apache.phoenix.end2end.index.MutableIndexReplicationIT
Tests run: 1, Failures: 0, Errors: 0, Skipped: 0, Time elapsed: 17.439 sec - in org.apache.phoenix.end2end.index.MutableIndexReplicationIT
Running org.apache.phoenix.end2end.index.txn.TxWriteFailureIT
Tests run: 8, Failures: 0, Errors: 0, Skipped: 0, Time elapsed: 51.535 sec - in org.apache.phoenix.end2end.index.txn.TxWriteFailureIT
Running org.apache.phoenix.execute.PartialCommitIT
Tests run: 12, Failures: 0, Errors: 0, Skipped: 0, Time elapsed: 4.657 sec - in org.apache.phoenix.execute.PartialCommitIT
Running org.apache.phoenix.hbase.index.FailForUnsupportedHBaseVersionsIT
Tests run: 132, Failures: 0, Errors: 0, Skipped: 24, Time elapsed: 280.447 sec - in org.apache.phoenix.end2end.StatsCollectorIT
Tests run: 2, Failures: 0, Errors: 0, Skipped: 0, Time elapsed: 18.775 sec - in org.apache.phoenix.hbase.index.FailForUnsupportedHBaseVersionsIT
Running org.apache.phoenix.hbase.index.covered.EndToEndCoveredColumnsIndexBuilderIT
Tests run: 2, Failures: 0, Errors: 0, Skipped: 0, Time elapsed: 8.265 sec - in org.apache.phoenix.hbase.index.covered.EndToEndCoveredColumnsIndexBuilderIT
Tests run: 132, Failures: 0, Errors: 0, Skipped: 24, Time elapsed: 290.283 sec - in org.apache.phoenix.end2end.SysTableNamespaceMappedStatsCollectorIT
Running org.apache.phoenix.hbase.index.covered.example.FailWithoutRetriesIT
Running org.apache.phoenix.hbase.index.covered.example.EndToEndCoveredIndexingIT
Tests run: 1, Failures: 0, Errors: 0, Skipped: 0, Time elapsed: 8.355 sec - in org.apache.phoenix.hbase.index.covered.example.FailWithoutRetriesIT
Running org.apache.phoenix.hbase.index.covered.example.EndtoEndIndexingWithCompressionIT
Tests run: 24, Failures: 0, Errors: 0, Skipped: 0, Time elapsed: 283.778 sec - in org.apache.phoenix.end2end.index.ImmutableIndexIT
Tests run: 32, Failures: 0, Errors: 0, Skipped: 0, Time elapsed: 252.217 sec - in org.apache.phoenix.end2end.index.LocalIndexIT
Running org.apache.phoenix.iterate.RoundRobinResultIteratorWithStatsIT
Tests run: 1, Failures: 0, Errors: 0, Skipped: 0, Time elapsed: 11.95 sec - in org.apache.phoenix.iterate.RoundRobinResultIteratorWithStatsIT
Running org.apache.phoenix.iterate.ScannerLeaseRenewalIT
Running org.apache.phoenix.monitoring.PhoenixMetricsIT
Tests run: 11, Failures: 0, Errors: 0, Skipped: 0, Time elapsed: 62.128 sec - in org.apache.phoenix.hbase.index.covered.example.EndToEndCoveredIndexingIT
Tests run: 11, Failures: 0, Errors: 0, Skipped: 0, Time elapsed: 61.72 sec - in org.apache.phoenix.hbase.index.covered.example.EndtoEndIndexingWithCompressionIT
Running org.apache.phoenix.rpc.PhoenixClientRpcIT
Tests run: 2, Failures: 0, Errors: 0, Skipped: 0, Time elapsed: 5.551 sec - in org.apache.phoenix.rpc.PhoenixClientRpcIT
Running org.apache.phoenix.rpc.PhoenixServerRpcIT
Tests run: 2, Failures: 0, Errors: 0, Skipped: 0, Time elapsed: 15.342 sec - in org.apache.phoenix.rpc.PhoenixServerRpcIT
Tests run: 21, Failures: 0, Errors: 0, Skipped: 0, Time elapsed: 46.49 sec - in org.apache.phoenix.monitoring.PhoenixMetricsIT
Tests run: 2, Failures: 0, Errors: 0, Skipped: 0, Time elapsed: 163.615 sec - in org.apache.phoenix.iterate.ScannerLeaseRenewalIT

Results :

Tests run: 503, Failures: 0, Errors: 0, Skipped: 65

[INFO] 
[INFO] --- maven-failsafe-plugin:2.19.1:verify (ParallelStatsEnabledTest) @ phoenix-core ---
[INFO] ------------------------------------------------------------------------
[INFO] Reactor Summary:
[INFO] 
[INFO] Apache Phoenix ..................................... SUCCESS [  1.895 s]
[INFO] Phoenix Core ....................................... FAILURE [  01:06 h]
[INFO] Phoenix - Flume .................................... SKIPPED
[INFO] Phoenix - Kafka .................................... SKIPPED
[INFO] Phoenix - Pig ...................................... SKIPPED
[INFO] Phoenix Query Server Client ........................ SKIPPED
[INFO] Phoenix Query Server ............................... SKIPPED
[INFO] Phoenix - Pherf .................................... SKIPPED
[INFO] Phoenix - Spark .................................... SKIPPED
[INFO] Phoenix - Hive ..................................... SKIPPED
[INFO] Phoenix Client ..................................... SKIPPED
[INFO] Phoenix Server ..................................... SKIPPED
[INFO] Phoenix Assembly ................................... SKIPPED
[INFO] Phoenix - Tracing Web Application .................. SKIPPED
[INFO] ------------------------------------------------------------------------
[INFO] BUILD FAILURE
[INFO] ------------------------------------------------------------------------
[INFO] Total time: 01:06 h
[INFO] Finished at: 2017-06-08T20:52:36Z
[INFO] Final Memory: 60M/638M
[INFO] ------------------------------------------------------------------------
[ERROR] Failed to execute goal org.apache.maven.plugins:maven-failsafe-plugin:2.19.1:verify (ParallelStatsEnabledTest) on project phoenix-core: There are test failures.
[ERROR] 
[ERROR] Please refer to <https://builds.apache.org/job/Phoenix-4.x-HBase-0.98/ws/phoenix-core/target/failsafe-reports> for the individual test results.
[ERROR] -> [Help 1]
[ERROR] 
[ERROR] To see the full stack trace of the errors, re-run Maven with the -e switch.
[ERROR] Re-run Maven using the -X switch to enable full debug logging.
[ERROR] 
[ERROR] For more information about the errors and possible solutions, please read the following articles:
[ERROR] [Help 1] http://cwiki.apache.org/confluence/display/MAVEN/MojoFailureException
[ERROR] 
[ERROR] After correcting the problems, you can resume the build with the command
[ERROR]   mvn <goals> -rf :phoenix-core
Build step 'Invoke top-level Maven targets' marked build as failure
Archiving artifacts
Recording test results
Not sending mail to unregistered user ankitsinghal59@gmail.com

Build failed in Jenkins: Phoenix | 4.x-HBase-0.98 #1531

Posted by Apache Jenkins Server <je...@builds.apache.org>.
See <https://builds.apache.org/job/Phoenix-4.x-HBase-0.98/1531/display/redirect?page=changes>

Changes:

[samarth] PHOENIX-3917 RowProjector#getEstimatedRowByteSize() returns incorrect

[samarth] PHOENIX-3922 Update driver version to 4.11.0

------------------------------------------
[...truncated 92.87 KB...]

testCoveredColumnUpdates[MutableIndexIT_localIndex=true,transactional=true,columnEncoded=true](org.apache.phoenix.end2end.index.MutableIndexIT)  Time elapsed: 5.984 sec  <<< ERROR!
org.apache.phoenix.schema.ColumnFamilyNotFoundException: ERROR 1001 (42I01): Undefined column family. familyName=B
	at org.apache.phoenix.end2end.index.MutableIndexIT.testCoveredColumnUpdates(MutableIndexIT.java:186)

Tests run: 52, Failures: 0, Errors: 0, Skipped: 4, Time elapsed: 78.983 sec - in org.apache.phoenix.tx.ParameterizedTransactionIT
Tests run: 40, Failures: 0, Errors: 0, Skipped: 0, Time elapsed: 129.269 sec - in org.apache.phoenix.tx.TxCheckpointIT
Tests run: 304, Failures: 0, Errors: 8, Skipped: 0, Time elapsed: 1,023.291 sec <<< FAILURE! - in org.apache.phoenix.end2end.index.IndexIT
testSelectCF[IndexIT_localIndex=true,mutable=false,transactional=false,columnEncoded=false](org.apache.phoenix.end2end.index.IndexIT)  Time elapsed: 5.826 sec  <<< ERROR!
org.apache.phoenix.schema.ColumnFamilyNotFoundException: ERROR 1001 (42I01): Undefined column family. familyName=A
	at org.apache.phoenix.end2end.index.IndexIT.testSelectCF(IndexIT.java:693)

testSelectCF[IndexIT_localIndex=true,mutable=false,transactional=false,columnEncoded=true](org.apache.phoenix.end2end.index.IndexIT)  Time elapsed: 5.654 sec  <<< ERROR!
org.apache.phoenix.schema.ColumnFamilyNotFoundException: ERROR 1001 (42I01): Undefined column family. familyName=A
	at org.apache.phoenix.end2end.index.IndexIT.testSelectCF(IndexIT.java:693)

testSelectCF[IndexIT_localIndex=true,mutable=false,transactional=true,columnEncoded=false](org.apache.phoenix.end2end.index.IndexIT)  Time elapsed: 5.702 sec  <<< ERROR!
org.apache.phoenix.schema.ColumnFamilyNotFoundException: ERROR 1001 (42I01): Undefined column family. familyName=A
	at org.apache.phoenix.end2end.index.IndexIT.testSelectCF(IndexIT.java:693)

testSelectCF[IndexIT_localIndex=true,mutable=false,transactional=true,columnEncoded=true](org.apache.phoenix.end2end.index.IndexIT)  Time elapsed: 5.424 sec  <<< ERROR!
org.apache.phoenix.schema.ColumnFamilyNotFoundException: ERROR 1001 (42I01): Undefined column family. familyName=A
	at org.apache.phoenix.end2end.index.IndexIT.testSelectCF(IndexIT.java:693)

testSelectCF[IndexIT_localIndex=true,mutable=true,transactional=false,columnEncoded=false](org.apache.phoenix.end2end.index.IndexIT)  Time elapsed: 5.422 sec  <<< ERROR!
org.apache.phoenix.schema.ColumnFamilyNotFoundException: ERROR 1001 (42I01): Undefined column family. familyName=A
	at org.apache.phoenix.end2end.index.IndexIT.testSelectCF(IndexIT.java:693)

testSelectCF[IndexIT_localIndex=true,mutable=true,transactional=false,columnEncoded=true](org.apache.phoenix.end2end.index.IndexIT)  Time elapsed: 5.439 sec  <<< ERROR!
org.apache.phoenix.schema.ColumnFamilyNotFoundException: ERROR 1001 (42I01): Undefined column family. familyName=A
	at org.apache.phoenix.end2end.index.IndexIT.testSelectCF(IndexIT.java:693)

testSelectCF[IndexIT_localIndex=true,mutable=true,transactional=true,columnEncoded=false](org.apache.phoenix.end2end.index.IndexIT)  Time elapsed: 5.834 sec  <<< ERROR!
org.apache.phoenix.schema.ColumnFamilyNotFoundException: ERROR 1001 (42I01): Undefined column family. familyName=A
	at org.apache.phoenix.end2end.index.IndexIT.testSelectCF(IndexIT.java:693)

testSelectCF[IndexIT_localIndex=true,mutable=true,transactional=true,columnEncoded=true](org.apache.phoenix.end2end.index.IndexIT)  Time elapsed: 7.504 sec  <<< ERROR!
org.apache.phoenix.schema.ColumnFamilyNotFoundException: ERROR 1001 (42I01): Undefined column family. familyName=A
	at org.apache.phoenix.end2end.index.IndexIT.testSelectCF(IndexIT.java:693)


Results :

Tests in error: 
  TimezoneOffsetFunctionIT.dateParameterNull:172 » SQL ERROR 201 (22000): Illega...
  TimezoneOffsetFunctionIT.testBothParametersNull:130 » SQL ERROR 201 (22000): I...
  TimezoneOffsetFunctionIT.timezoneParameterNull:151 » SQL ERROR 201 (22000): Il...
  IndexIT.testSelectCF:693 » ColumnFamilyNotFound ERROR 1001 (42I01): Undefined ...
  IndexIT.testSelectCF:693 » ColumnFamilyNotFound ERROR 1001 (42I01): Undefined ...
  IndexIT.testSelectCF:693 » ColumnFamilyNotFound ERROR 1001 (42I01): Undefined ...
  IndexIT.testSelectCF:693 » ColumnFamilyNotFound ERROR 1001 (42I01): Undefined ...
  IndexIT.testSelectCF:693 » ColumnFamilyNotFound ERROR 1001 (42I01): Undefined ...
  IndexIT.testSelectCF:693 » ColumnFamilyNotFound ERROR 1001 (42I01): Undefined ...
  IndexIT.testSelectCF:693 » ColumnFamilyNotFound ERROR 1001 (42I01): Undefined ...
  IndexIT.testSelectCF:693 » ColumnFamilyNotFound ERROR 1001 (42I01): Undefined ...
  MutableIndexIT.testCoveredColumnUpdates:186 » ColumnFamilyNotFound ERROR 1001 ...
  MutableIndexIT.testCoveredColumnUpdates:186 » ColumnFamilyNotFound ERROR 1001 ...
  MutableIndexIT.testCoveredColumnUpdates:186 » ColumnFamilyNotFound ERROR 1001 ...
  MutableIndexIT.testCoveredColumnUpdates:186 » ColumnFamilyNotFound ERROR 1001 ...

Tests run: 2103, Failures: 0, Errors: 15, Skipped: 4

[INFO] 
[INFO] --- maven-failsafe-plugin:2.19.1:integration-test (ClientManagedTimeTests) @ phoenix-core ---

-------------------------------------------------------
 T E S T S
-------------------------------------------------------
Running org.apache.phoenix.end2end.ArrayIT
Running org.apache.phoenix.end2end.AggregateQueryIT
Running org.apache.phoenix.end2end.ClientTimeArithmeticQueryIT
Running org.apache.phoenix.end2end.CastAndCoerceIT
Running org.apache.phoenix.end2end.CaseStatementIT
Tests run: 80, Failures: 0, Errors: 0, Skipped: 0, Time elapsed: 60.915 sec - in org.apache.phoenix.end2end.ArrayIT
Running org.apache.phoenix.end2end.ColumnProjectionOptimizationIT
Tests run: 49, Failures: 0, Errors: 0, Skipped: 0, Time elapsed: 65.731 sec - in org.apache.phoenix.end2end.CastAndCoerceIT
Running org.apache.phoenix.end2end.CreateSchemaIT
Tests run: 1, Failures: 0, Errors: 0, Skipped: 0, Time elapsed: 0.187 sec - in org.apache.phoenix.end2end.CreateSchemaIT
Running org.apache.phoenix.end2end.CreateTableIT
Tests run: 56, Failures: 0, Errors: 0, Skipped: 0, Time elapsed: 68.486 sec - in org.apache.phoenix.end2end.CaseStatementIT
Running org.apache.phoenix.end2end.CustomEntityDataIT
Tests run: 3, Failures: 0, Errors: 0, Skipped: 0, Time elapsed: 12.668 sec - in org.apache.phoenix.end2end.ColumnProjectionOptimizationIT
Running org.apache.phoenix.end2end.DerivedTableIT
Tests run: 3, Failures: 0, Errors: 0, Skipped: 0, Time elapsed: 3.816 sec - in org.apache.phoenix.end2end.CustomEntityDataIT
Running org.apache.phoenix.end2end.DistinctCountIT
Tests run: 42, Failures: 0, Errors: 0, Skipped: 0, Time elapsed: 79.2 sec - in org.apache.phoenix.end2end.AggregateQueryIT
Running org.apache.phoenix.end2end.DropSchemaIT
Tests run: 2, Failures: 0, Errors: 0, Skipped: 0, Time elapsed: 4.813 sec - in org.apache.phoenix.end2end.DropSchemaIT
Running org.apache.phoenix.end2end.ExtendedQueryExecIT
Tests run: 10, Failures: 0, Errors: 0, Skipped: 0, Time elapsed: 11.541 sec - in org.apache.phoenix.end2end.DistinctCountIT
Running org.apache.phoenix.end2end.FunkyNamesIT
Tests run: 18, Failures: 0, Errors: 0, Skipped: 0, Time elapsed: 14.224 sec - in org.apache.phoenix.end2end.DerivedTableIT
Tests run: 4, Failures: 0, Errors: 0, Skipped: 0, Time elapsed: 3.893 sec - in org.apache.phoenix.end2end.ExtendedQueryExecIT
Running org.apache.phoenix.end2end.GroupByIT
Tests run: 3, Failures: 0, Errors: 0, Skipped: 0, Time elapsed: 3.972 sec - in org.apache.phoenix.end2end.FunkyNamesIT
Running org.apache.phoenix.end2end.MutableQueryIT
Running org.apache.phoenix.end2end.NativeHBaseTypesIT
Tests run: 7, Failures: 0, Errors: 0, Skipped: 0, Time elapsed: 3.133 sec - in org.apache.phoenix.end2end.NativeHBaseTypesIT
Running org.apache.phoenix.end2end.NotQueryIT
Tests run: 19, Failures: 0, Errors: 0, Skipped: 0, Time elapsed: 74.416 sec - in org.apache.phoenix.end2end.CreateTableIT
Running org.apache.phoenix.end2end.PointInTimeQueryIT
Tests run: 77, Failures: 0, Errors: 0, Skipped: 0, Time elapsed: 44.57 sec - in org.apache.phoenix.end2end.NotQueryIT
Tests run: 245, Failures: 0, Errors: 0, Skipped: 0, Time elapsed: 150.212 sec - in org.apache.phoenix.end2end.ClientTimeArithmeticQueryIT
Tests run: 7, Failures: 0, Errors: 0, Skipped: 0, Time elapsed: 17.879 sec - in org.apache.phoenix.end2end.PointInTimeQueryIT
Running org.apache.phoenix.end2end.QueryIT
Running org.apache.phoenix.end2end.QueryDatabaseMetaDataIT
Tests run: 91, Failures: 0, Errors: 0, Skipped: 0, Time elapsed: 78.498 sec - in org.apache.phoenix.end2end.GroupByIT
Running org.apache.phoenix.end2end.ProductMetricsIT
Running org.apache.phoenix.end2end.ReadIsolationLevelIT
Tests run: 61, Failures: 0, Errors: 0, Skipped: 0, Time elapsed: 21.654 sec - in org.apache.phoenix.end2end.ProductMetricsIT
Running org.apache.phoenix.end2end.RowValueConstructorIT
Tests run: 2, Failures: 0, Errors: 0, Skipped: 0, Time elapsed: 2.958 sec - in org.apache.phoenix.end2end.ReadIsolationLevelIT
Running org.apache.phoenix.end2end.ScanQueryIT
Tests run: 112, Failures: 0, Errors: 0, Skipped: 0, Time elapsed: 57.883 sec - in org.apache.phoenix.end2end.QueryIT
Tests run: 112, Failures: 0, Errors: 0, Skipped: 0, Time elapsed: 132.627 sec - in org.apache.phoenix.end2end.MutableQueryIT
Running org.apache.phoenix.end2end.SequenceBulkAllocationIT
Tests run: 19, Failures: 0, Errors: 0, Skipped: 0, Time elapsed: 69.318 sec - in org.apache.phoenix.end2end.QueryDatabaseMetaDataIT
Running org.apache.phoenix.end2end.ToNumberFunctionIT
Tests run: 112, Failures: 0, Errors: 0, Skipped: 0, Time elapsed: 48.661 sec - in org.apache.phoenix.end2end.ScanQueryIT
Running org.apache.phoenix.end2end.TopNIT
Tests run: 18, Failures: 0, Errors: 0, Skipped: 0, Time elapsed: 6.647 sec - in org.apache.phoenix.end2end.ToNumberFunctionIT
Running org.apache.phoenix.end2end.TruncateFunctionIT
Tests run: 4, Failures: 0, Errors: 0, Skipped: 0, Time elapsed: 3.598 sec - in org.apache.phoenix.end2end.TopNIT
Running org.apache.phoenix.end2end.UpsertSelectIT
Tests run: 1, Failures: 0, Errors: 0, Skipped: 0, Time elapsed: 2.515 sec - in org.apache.phoenix.end2end.TruncateFunctionIT
Running org.apache.phoenix.end2end.UpsertValuesIT
Tests run: 46, Failures: 0, Errors: 0, Skipped: 0, Time elapsed: 56.233 sec - in org.apache.phoenix.end2end.RowValueConstructorIT
Running org.apache.phoenix.end2end.VariableLengthPKIT
Running org.apache.phoenix.end2end.SequenceIT
Tests run: 56, Failures: 0, Errors: 0, Skipped: 0, Time elapsed: 17.077 sec - in org.apache.phoenix.end2end.SequenceBulkAllocationIT
Running org.apache.phoenix.end2end.salted.SaltedTableIT
Tests run: 8, Failures: 0, Errors: 0, Skipped: 0, Time elapsed: 4.764 sec - in org.apache.phoenix.end2end.salted.SaltedTableIT
Running org.apache.phoenix.rpc.UpdateCacheWithScnIT
Tests run: 1, Failures: 0, Errors: 0, Skipped: 0, Time elapsed: 2.989 sec - in org.apache.phoenix.rpc.UpdateCacheWithScnIT
Tests run: 54, Failures: 0, Errors: 0, Skipped: 0, Time elapsed: 22.152 sec - in org.apache.phoenix.end2end.SequenceIT
Tests run: 50, Failures: 0, Errors: 0, Skipped: 0, Time elapsed: 35.507 sec - in org.apache.phoenix.end2end.VariableLengthPKIT
Tests run: 25, Failures: 0, Errors: 0, Skipped: 0, Time elapsed: 46.236 sec - in org.apache.phoenix.end2end.UpsertValuesIT
Tests run: 22, Failures: 0, Errors: 0, Skipped: 0, Time elapsed: 57.281 sec - in org.apache.phoenix.end2end.UpsertSelectIT

Results :

Tests run: 1420, Failures: 0, Errors: 0, Skipped: 0

[INFO] 
[INFO] --- maven-failsafe-plugin:2.19.1:integration-test (HBaseManagedTimeTests) @ phoenix-core ---

-------------------------------------------------------
 T E S T S
-------------------------------------------------------

Results :

Tests run: 0, Failures: 0, Errors: 0, Skipped: 0

[INFO] 
[INFO] --- maven-failsafe-plugin:2.19.1:integration-test (NeedTheirOwnClusterTests) @ phoenix-core ---

-------------------------------------------------------
 T E S T S
-------------------------------------------------------
Running org.apache.hadoop.hbase.regionserver.wal.WALReplayWithIndexWritesAndCompressedWALIT
Tests run: 1, Failures: 0, Errors: 0, Skipped: 0, Time elapsed: 20.871 sec - in org.apache.hadoop.hbase.regionserver.wal.WALReplayWithIndexWritesAndCompressedWALIT
Running org.apache.phoenix.end2end.ConnectionUtilIT
Running org.apache.phoenix.end2end.CountDistinctCompressionIT
Running org.apache.phoenix.end2end.ContextClassloaderIT
Running org.apache.phoenix.end2end.CsvBulkLoadToolIT
Tests run: 3, Failures: 0, Errors: 0, Skipped: 0, Time elapsed: 3.1 sec - in org.apache.phoenix.end2end.ContextClassloaderIT
Tests run: 1, Failures: 0, Errors: 0, Skipped: 0, Time elapsed: 18.329 sec - in org.apache.phoenix.end2end.ConnectionUtilIT
Tests run: 1, Failures: 0, Errors: 0, Skipped: 0, Time elapsed: 5.246 sec - in org.apache.phoenix.end2end.CountDistinctCompressionIT
#
# A fatal error has been detected by the Java Runtime Environment:
#
#  Internal Error (sharedRuntime.cpp:814), pid=17540, tid=140280379299584
#  guarantee(cb->is_adapter_blob() || cb->is_method_handles_adapter_blob()) failed: exception happened outside interpreter, nmethods and vtable stubs (1)
#
# JRE version: Java(TM) SE Runtime Environment (7.0_80-b15) (build 1.7.0_80-b15)
# Java VM: Java HotSpot(TM) 64-Bit Server VM (24.80-b11 mixed mode linux-amd64 compressed oops)
# Failed to write core dump. Core dumps have been disabled. To enable core dumping, try "ulimit -c unlimited" before starting Java again
#
# An error report file with more information is saved as:
# <https://builds.apache.org/job/Phoenix-4.x-HBase-0.98/ws/phoenix-core/hs_err_pid17540.log>
#
# If you would like to submit a bug report, please visit:
#   http://bugreport.java.com/bugreport/crash.jsp
#
Aborted
Running org.apache.phoenix.end2end.FlappingLocalIndexIT
Running org.apache.phoenix.end2end.IndexExtendedIT
Running org.apache.phoenix.end2end.IndexToolForPartialBuildIT
Tests run: 2, Failures: 0, Errors: 0, Skipped: 0, Time elapsed: 23.567 sec - in org.apache.phoenix.end2end.IndexToolForPartialBuildIT
Tests run: 11, Failures: 0, Errors: 0, Skipped: 0, Time elapsed: 64.755 sec - in org.apache.phoenix.end2end.CsvBulkLoadToolIT
Running org.apache.phoenix.end2end.QueryTimeoutIT
Tests run: 40, Failures: 0, Errors: 0, Skipped: 16, Time elapsed: 35.547 sec - in org.apache.phoenix.end2end.IndexExtendedIT
Running org.apache.phoenix.end2end.QueryWithLimitIT
Tests run: 2, Failures: 0, Errors: 0, Skipped: 0, Time elapsed: 2.549 sec - in org.apache.phoenix.end2end.QueryWithLimitIT
Tests run: 2, Failures: 0, Errors: 0, Skipped: 0, Time elapsed: 23.129 sec - in org.apache.phoenix.end2end.QueryTimeoutIT
Tests run: 8, Failures: 0, Errors: 0, Skipped: 0, Time elapsed: 64.47 sec - in org.apache.phoenix.end2end.FlappingLocalIndexIT
Running org.apache.phoenix.end2end.RegexBulkLoadToolIT
Running org.apache.phoenix.end2end.RenewLeaseIT
Running org.apache.phoenix.end2end.index.MutableIndexFailureIT
Tests run: 1, Failures: 0, Errors: 0, Skipped: 1, Time elapsed: 0.002 sec - in org.apache.phoenix.end2end.index.MutableIndexFailureIT
Running org.apache.phoenix.hbase.index.FailForUnsupportedHBaseVersionsIT
Running org.apache.phoenix.hbase.index.covered.EndToEndCoveredColumnsIndexBuilderIT
Running org.apache.phoenix.hbase.index.covered.example.FailWithoutRetriesIT

Results :

Tests run: 72, Failures: 0, Errors: 0, Skipped: 17

[INFO] 
[INFO] --- maven-failsafe-plugin:2.19.1:verify (ParallelStatsEnabledTest) @ phoenix-core ---
[INFO] ------------------------------------------------------------------------
[INFO] Reactor Summary:
[INFO] 
[INFO] Apache Phoenix ..................................... SUCCESS [  2.410 s]
[INFO] Phoenix Core ....................................... FAILURE [46:47 min]
[INFO] Phoenix - Flume .................................... SKIPPED
[INFO] Phoenix - Kafka .................................... SKIPPED
[INFO] Phoenix - Pig ...................................... SKIPPED
[INFO] Phoenix Query Server Client ........................ SKIPPED
[INFO] Phoenix Query Server ............................... SKIPPED
[INFO] Phoenix - Pherf .................................... SKIPPED
[INFO] Phoenix - Spark .................................... SKIPPED
[INFO] Phoenix - Hive ..................................... SKIPPED
[INFO] Phoenix Client ..................................... SKIPPED
[INFO] Phoenix Server ..................................... SKIPPED
[INFO] Phoenix Assembly ................................... SKIPPED
[INFO] Phoenix - Tracing Web Application .................. SKIPPED
[INFO] ------------------------------------------------------------------------
[INFO] BUILD FAILURE
[INFO] ------------------------------------------------------------------------
[INFO] Total time: 46:51 min
[INFO] Finished at: 2017-06-08T18:58:02Z
[INFO] Final Memory: 76M/1321M
[INFO] ------------------------------------------------------------------------
[ERROR] Failed to execute goal org.apache.maven.plugins:maven-failsafe-plugin:2.19.1:verify (ParallelStatsEnabledTest) on project phoenix-core: There was a timeout or other error in the fork -> [Help 1]
[ERROR] 
[ERROR] To see the full stack trace of the errors, re-run Maven with the -e switch.
[ERROR] Re-run Maven using the -X switch to enable full debug logging.
[ERROR] 
[ERROR] For more information about the errors and possible solutions, please read the following articles:
[ERROR] [Help 1] http://cwiki.apache.org/confluence/display/MAVEN/MojoExecutionException
[ERROR] 
[ERROR] After correcting the problems, you can resume the build with the command
[ERROR]   mvn <goals> -rf :phoenix-core
Build step 'Invoke top-level Maven targets' marked build as failure
Archiving artifacts
Recording test results
Not sending mail to unregistered user ankitsinghal59@gmail.com

Build failed in Jenkins: Phoenix | 4.x-HBase-0.98 #1530

Posted by Apache Jenkins Server <je...@builds.apache.org>.
See <https://builds.apache.org/job/Phoenix-4.x-HBase-0.98/1530/display/redirect?page=changes>

Changes:

[thomas] PHOENIX-3907 Use LATEST_TIMESTAMP when UPDATE_CACHE_FREQUENCY is not

------------------------------------------
[...truncated 89.98 KB...]
Tests run: 1, Failures: 0, Errors: 0, Skipped: 0, Time elapsed: 1.338 sec - in org.apache.phoenix.end2end.salted.SaltedTableVarLengthRowKeyIT
Running org.apache.phoenix.iterate.PhoenixQueryTimeoutIT
Tests run: 2, Failures: 0, Errors: 0, Skipped: 0, Time elapsed: 3.063 sec - in org.apache.phoenix.iterate.PhoenixQueryTimeoutIT
Running org.apache.phoenix.iterate.RoundRobinResultIteratorIT
Tests run: 8, Failures: 0, Errors: 0, Skipped: 0, Time elapsed: 32.271 sec - in org.apache.phoenix.end2end.index.txn.RollbackIT
Running org.apache.phoenix.rpc.UpdateCacheIT
Tests run: 6, Failures: 0, Errors: 0, Skipped: 0, Time elapsed: 14.789 sec - in org.apache.phoenix.end2end.salted.SaltedTableUpsertSelectIT
Running org.apache.phoenix.trace.PhoenixTableMetricsWriterIT
Tests run: 2, Failures: 0, Errors: 0, Skipped: 0, Time elapsed: 1.205 sec - in org.apache.phoenix.trace.PhoenixTableMetricsWriterIT
Running org.apache.phoenix.trace.PhoenixTraceReaderIT
Tests run: 2, Failures: 0, Errors: 0, Skipped: 0, Time elapsed: 0.942 sec - in org.apache.phoenix.trace.PhoenixTraceReaderIT
Running org.apache.phoenix.trace.PhoenixTracingEndToEndIT
Tests run: 7, Failures: 0, Errors: 0, Skipped: 0, Time elapsed: 16.246 sec - in org.apache.phoenix.rpc.UpdateCacheIT
Running org.apache.phoenix.tx.FlappingTransactionIT
Tests run: 4, Failures: 0, Errors: 0, Skipped: 0, Time elapsed: 2.641 sec - in org.apache.phoenix.tx.FlappingTransactionIT
Running org.apache.phoenix.tx.ParameterizedTransactionIT
Tests run: 9, Failures: 0, Errors: 0, Skipped: 0, Time elapsed: 31.386 sec - in org.apache.phoenix.iterate.RoundRobinResultIteratorIT
Running org.apache.phoenix.tx.TransactionIT
Tests run: 7, Failures: 0, Errors: 0, Skipped: 0, Time elapsed: 23.51 sec - in org.apache.phoenix.tx.TransactionIT
Running org.apache.phoenix.tx.TxCheckpointIT
Tests run: 6, Failures: 0, Errors: 0, Skipped: 0, Time elapsed: 89.997 sec - in org.apache.phoenix.trace.PhoenixTracingEndToEndIT
Tests run: 52, Failures: 0, Errors: 0, Skipped: 4, Time elapsed: 90.432 sec - in org.apache.phoenix.tx.ParameterizedTransactionIT
Tests run: 64, Failures: 0, Errors: 0, Skipped: 0, Time elapsed: 393.1 sec - in org.apache.phoenix.end2end.index.MutableIndexIT
Tests run: 40, Failures: 0, Errors: 0, Skipped: 0, Time elapsed: 171.488 sec - in org.apache.phoenix.tx.TxCheckpointIT
Tests run: 304, Failures: 0, Errors: 0, Skipped: 0, Time elapsed: 1,177.298 sec - in org.apache.phoenix.end2end.index.IndexIT

Results :

Tests in error: 
  TimezoneOffsetFunctionIT.dateParameterNull:172 » SQL ERROR 201 (22000): Illega...
  TimezoneOffsetFunctionIT.testBothParametersNull:130 » SQL ERROR 201 (22000): I...
  TimezoneOffsetFunctionIT.timezoneParameterNull:151 » SQL ERROR 201 (22000): Il...

Tests run: 2103, Failures: 0, Errors: 3, Skipped: 4

[INFO] 
[INFO] --- maven-failsafe-plugin:2.19.1:integration-test (ClientManagedTimeTests) @ phoenix-core ---

-------------------------------------------------------
 T E S T S
-------------------------------------------------------
Running org.apache.phoenix.end2end.ArrayIT
Running org.apache.phoenix.end2end.CaseStatementIT
Running org.apache.phoenix.end2end.CastAndCoerceIT
Running org.apache.phoenix.end2end.AggregateQueryIT
Running org.apache.phoenix.end2end.ClientTimeArithmeticQueryIT
Tests run: 80, Failures: 0, Errors: 0, Skipped: 0, Time elapsed: 83.004 sec - in org.apache.phoenix.end2end.ArrayIT
Running org.apache.phoenix.end2end.ColumnProjectionOptimizationIT
Tests run: 56, Failures: 0, Errors: 0, Skipped: 0, Time elapsed: 87.204 sec - in org.apache.phoenix.end2end.CaseStatementIT
Running org.apache.phoenix.end2end.CreateSchemaIT
Tests run: 1, Failures: 0, Errors: 0, Skipped: 0, Time elapsed: 0.41 sec - in org.apache.phoenix.end2end.CreateSchemaIT
Tests run: 49, Failures: 0, Errors: 0, Skipped: 0, Time elapsed: 87.1 sec - in org.apache.phoenix.end2end.CastAndCoerceIT
Running org.apache.phoenix.end2end.CreateTableIT
Running org.apache.phoenix.end2end.CustomEntityDataIT
Tests run: 3, Failures: 0, Errors: 0, Skipped: 0, Time elapsed: 3.985 sec - in org.apache.phoenix.end2end.CustomEntityDataIT
Running org.apache.phoenix.end2end.DerivedTableIT
Tests run: 42, Failures: 0, Errors: 0, Skipped: 0, Time elapsed: 97.039 sec - in org.apache.phoenix.end2end.AggregateQueryIT
Running org.apache.phoenix.end2end.DistinctCountIT
Tests run: 3, Failures: 0, Errors: 0, Skipped: 0, Time elapsed: 16.455 sec - in org.apache.phoenix.end2end.ColumnProjectionOptimizationIT
Running org.apache.phoenix.end2end.DropSchemaIT
Tests run: 2, Failures: 0, Errors: 0, Skipped: 0, Time elapsed: 6 sec - in org.apache.phoenix.end2end.DropSchemaIT
Running org.apache.phoenix.end2end.ExtendedQueryExecIT
Tests run: 4, Failures: 0, Errors: 0, Skipped: 0, Time elapsed: 5.145 sec - in org.apache.phoenix.end2end.ExtendedQueryExecIT
Running org.apache.phoenix.end2end.FunkyNamesIT
Tests run: 10, Failures: 0, Errors: 0, Skipped: 0, Time elapsed: 16.176 sec - in org.apache.phoenix.end2end.DistinctCountIT
Tests run: 18, Failures: 0, Errors: 0, Skipped: 0, Time elapsed: 22.635 sec - in org.apache.phoenix.end2end.DerivedTableIT
Running org.apache.phoenix.end2end.GroupByIT
Tests run: 3, Failures: 0, Errors: 0, Skipped: 0, Time elapsed: 3.726 sec - in org.apache.phoenix.end2end.FunkyNamesIT
Running org.apache.phoenix.end2end.MutableQueryIT
Running org.apache.phoenix.end2end.NativeHBaseTypesIT
Tests run: 7, Failures: 0, Errors: 0, Skipped: 0, Time elapsed: 4.421 sec - in org.apache.phoenix.end2end.NativeHBaseTypesIT
Running org.apache.phoenix.end2end.NotQueryIT
Tests run: 19, Failures: 0, Errors: 0, Skipped: 0, Time elapsed: 85.174 sec - in org.apache.phoenix.end2end.CreateTableIT
Running org.apache.phoenix.end2end.PointInTimeQueryIT
Tests run: 91, Failures: 0, Errors: 0, Skipped: 0, Time elapsed: 83.915 sec - in org.apache.phoenix.end2end.GroupByIT
Running org.apache.phoenix.end2end.ProductMetricsIT
Tests run: 7, Failures: 0, Errors: 0, Skipped: 0, Time elapsed: 26.014 sec - in org.apache.phoenix.end2end.PointInTimeQueryIT
Running org.apache.phoenix.end2end.QueryDatabaseMetaDataIT
Tests run: 245, Failures: 0, Errors: 0, Skipped: 0, Time elapsed: 211.76 sec - in org.apache.phoenix.end2end.ClientTimeArithmeticQueryIT
Tests run: 77, Failures: 0, Errors: 0, Skipped: 0, Time elapsed: 90.908 sec - in org.apache.phoenix.end2end.NotQueryIT
Running org.apache.phoenix.end2end.QueryIT
Tests run: 61, Failures: 0, Errors: 0, Skipped: 0, Time elapsed: 43.594 sec - in org.apache.phoenix.end2end.ProductMetricsIT
Running org.apache.phoenix.end2end.ReadIsolationLevelIT
Tests run: 2, Failures: 0, Errors: 0, Skipped: 0, Time elapsed: 3.305 sec - in org.apache.phoenix.end2end.ReadIsolationLevelIT
Running org.apache.phoenix.end2end.RowValueConstructorIT
Running org.apache.phoenix.end2end.ScanQueryIT
Tests run: 19, Failures: 0, Errors: 0, Skipped: 0, Time elapsed: 84.545 sec - in org.apache.phoenix.end2end.QueryDatabaseMetaDataIT
Running org.apache.phoenix.end2end.SequenceBulkAllocationIT
Tests run: 112, Failures: 0, Errors: 0, Skipped: 0, Time elapsed: 185.434 sec - in org.apache.phoenix.end2end.MutableQueryIT
Tests run: 112, Failures: 0, Errors: 0, Skipped: 0, Time elapsed: 76.804 sec - in org.apache.phoenix.end2end.QueryIT
Running org.apache.phoenix.end2end.ToNumberFunctionIT
Tests run: 46, Failures: 0, Errors: 0, Skipped: 0, Time elapsed: 71.608 sec - in org.apache.phoenix.end2end.RowValueConstructorIT
Running org.apache.phoenix.end2end.TopNIT
Running org.apache.phoenix.end2end.SequenceIT
Tests run: 4, Failures: 0, Errors: 0, Skipped: 0, Time elapsed: 4.595 sec - in org.apache.phoenix.end2end.TopNIT
Running org.apache.phoenix.end2end.TruncateFunctionIT
Tests run: 18, Failures: 0, Errors: 0, Skipped: 0, Time elapsed: 10.353 sec - in org.apache.phoenix.end2end.ToNumberFunctionIT
Running org.apache.phoenix.end2end.UpsertSelectIT
Tests run: 1, Failures: 0, Errors: 0, Skipped: 0, Time elapsed: 2.967 sec - in org.apache.phoenix.end2end.TruncateFunctionIT
Running org.apache.phoenix.end2end.UpsertValuesIT
Tests run: 56, Failures: 0, Errors: 0, Skipped: 0, Time elapsed: 62.205 sec - in org.apache.phoenix.end2end.SequenceBulkAllocationIT
Tests run: 112, Failures: 0, Errors: 0, Skipped: 0, Time elapsed: 74.465 sec - in org.apache.phoenix.end2end.ScanQueryIT
Running org.apache.phoenix.end2end.VariableLengthPKIT
Tests run: 54, Failures: 0, Errors: 0, Skipped: 0, Time elapsed: 30.856 sec - in org.apache.phoenix.end2end.SequenceIT
Running org.apache.phoenix.rpc.UpdateCacheWithScnIT
Tests run: 1, Failures: 0, Errors: 0, Skipped: 0, Time elapsed: 3.786 sec - in org.apache.phoenix.rpc.UpdateCacheWithScnIT
Running org.apache.phoenix.end2end.salted.SaltedTableIT
Tests run: 8, Failures: 0, Errors: 0, Skipped: 0, Time elapsed: 5.856 sec - in org.apache.phoenix.end2end.salted.SaltedTableIT
Tests run: 25, Failures: 0, Errors: 0, Skipped: 0, Time elapsed: 58.362 sec - in org.apache.phoenix.end2end.UpsertValuesIT
Tests run: 50, Failures: 0, Errors: 0, Skipped: 0, Time elapsed: 46.379 sec - in org.apache.phoenix.end2end.VariableLengthPKIT
Tests run: 22, Failures: 0, Errors: 0, Skipped: 0, Time elapsed: 77.018 sec - in org.apache.phoenix.end2end.UpsertSelectIT

Results :

Tests run: 1420, Failures: 0, Errors: 0, Skipped: 0

[INFO] 
[INFO] --- maven-failsafe-plugin:2.19.1:integration-test (HBaseManagedTimeTests) @ phoenix-core ---

-------------------------------------------------------
 T E S T S
-------------------------------------------------------

Results :

Tests run: 0, Failures: 0, Errors: 0, Skipped: 0

[INFO] 
[INFO] --- maven-failsafe-plugin:2.19.1:integration-test (NeedTheirOwnClusterTests) @ phoenix-core ---

-------------------------------------------------------
 T E S T S
-------------------------------------------------------
Running org.apache.hadoop.hbase.regionserver.wal.WALReplayWithIndexWritesAndCompressedWALIT
Running org.apache.phoenix.end2end.ConnectionUtilIT
Tests run: 1, Failures: 0, Errors: 0, Skipped: 0, Time elapsed: 38.195 sec - in org.apache.hadoop.hbase.regionserver.wal.WALReplayWithIndexWritesAndCompressedWALIT
Running org.apache.phoenix.end2end.CountDistinctCompressionIT
Running org.apache.phoenix.end2end.ContextClassloaderIT
Running org.apache.phoenix.end2end.CsvBulkLoadToolIT
Tests run: 3, Failures: 0, Errors: 0, Skipped: 0, Time elapsed: 8.592 sec - in org.apache.phoenix.end2end.ContextClassloaderIT
Tests run: 1, Failures: 0, Errors: 0, Skipped: 0, Time elapsed: 9.613 sec - in org.apache.phoenix.end2end.CountDistinctCompressionIT
Tests run: 1, Failures: 0, Errors: 0, Skipped: 0, Time elapsed: 27.375 sec - in org.apache.phoenix.end2end.ConnectionUtilIT
Running org.apache.phoenix.end2end.FlappingLocalIndexIT
Running org.apache.phoenix.end2end.IndexExtendedIT
Running org.apache.phoenix.end2end.IndexToolForPartialBuildIT
Running org.apache.phoenix.end2end.IndexToolForPartialBuildWithNamespaceEnabledIT
Tests run: 11, Failures: 0, Errors: 0, Skipped: 0, Time elapsed: 82.551 sec - in org.apache.phoenix.end2end.CsvBulkLoadToolIT
Tests run: 2, Failures: 0, Errors: 0, Skipped: 0, Time elapsed: 30.44 sec - in org.apache.phoenix.end2end.IndexToolForPartialBuildWithNamespaceEnabledIT
Tests run: 2, Failures: 0, Errors: 0, Skipped: 0, Time elapsed: 39.725 sec - in org.apache.phoenix.end2end.IndexToolForPartialBuildIT
Tests run: 40, Failures: 0, Errors: 0, Skipped: 16, Time elapsed: 60.114 sec - in org.apache.phoenix.end2end.IndexExtendedIT
Tests run: 8, Failures: 0, Errors: 0, Skipped: 0, Time elapsed: 69.194 sec - in org.apache.phoenix.end2end.FlappingLocalIndexIT
Running org.apache.phoenix.end2end.QueryTimeoutIT
Running org.apache.phoenix.end2end.QueryWithLimitIT
Running org.apache.phoenix.end2end.RegexBulkLoadToolIT
Tests run: 2, Failures: 0, Errors: 0, Skipped: 0, Time elapsed: 10.048 sec - in org.apache.phoenix.end2end.QueryWithLimitIT
Running org.apache.phoenix.end2end.RenewLeaseIT
Tests run: 1, Failures: 0, Errors: 0, Skipped: 0, Time elapsed: 28.514 sec - in org.apache.phoenix.end2end.RenewLeaseIT
Running org.apache.phoenix.end2end.SpillableGroupByIT
Tests run: 2, Failures: 0, Errors: 0, Skipped: 0, Time elapsed: 49.741 sec - in org.apache.phoenix.end2end.QueryTimeoutIT
Running org.apache.phoenix.end2end.StatsCollectorIT
Tests run: 2, Failures: 0, Errors: 0, Skipped: 0, Time elapsed: 20.442 sec - in org.apache.phoenix.end2end.SpillableGroupByIT
Tests run: 10, Failures: 0, Errors: 0, Skipped: 0, Time elapsed: 71.973 sec - in org.apache.phoenix.end2end.RegexBulkLoadToolIT
Running org.apache.phoenix.end2end.SysTableNamespaceMappedStatsCollectorIT
Running org.apache.phoenix.end2end.UpdateCacheAcrossDifferentClientsIT
Running org.apache.phoenix.end2end.UserDefinedFunctionsIT
Tests run: 6, Failures: 0, Errors: 0, Skipped: 0, Time elapsed: 19.457 sec - in org.apache.phoenix.end2end.UpdateCacheAcrossDifferentClientsIT
Running org.apache.phoenix.end2end.index.ImmutableIndexIT
Tests run: 14, Failures: 0, Errors: 0, Skipped: 0, Time elapsed: 26.029 sec - in org.apache.phoenix.end2end.UserDefinedFunctionsIT
Running org.apache.phoenix.end2end.index.MutableIndexFailureIT
Tests run: 1, Failures: 0, Errors: 0, Skipped: 1, Time elapsed: 0.005 sec - in org.apache.phoenix.end2end.index.MutableIndexFailureIT
Running org.apache.phoenix.end2end.index.LocalIndexIT
Running org.apache.phoenix.end2end.index.MutableIndexReplicationIT
Tests run: 1, Failures: 0, Errors: 0, Skipped: 0, Time elapsed: 19.752 sec - in org.apache.phoenix.end2end.index.MutableIndexReplicationIT
Running org.apache.phoenix.end2end.index.txn.TxWriteFailureIT
Tests run: 132, Failures: 0, Errors: 0, Skipped: 24, Time elapsed: 243.916 sec - in org.apache.phoenix.end2end.StatsCollectorIT
Tests run: 132, Failures: 0, Errors: 0, Skipped: 24, Time elapsed: 251.896 sec - in org.apache.phoenix.end2end.SysTableNamespaceMappedStatsCollectorIT
Running org.apache.phoenix.hbase.index.FailForUnsupportedHBaseVersionsIT
Tests run: 8, Failures: 0, Errors: 0, Skipped: 0, Time elapsed: 49.264 sec - in org.apache.phoenix.end2end.index.txn.TxWriteFailureIT
Running org.apache.phoenix.execute.PartialCommitIT
Running org.apache.phoenix.hbase.index.covered.EndToEndCoveredColumnsIndexBuilderIT
Tests run: 2, Failures: 0, Errors: 0, Skipped: 0, Time elapsed: 26.214 sec - in org.apache.phoenix.hbase.index.FailForUnsupportedHBaseVersionsIT
Tests run: 12, Failures: 0, Errors: 0, Skipped: 0, Time elapsed: 11.423 sec - in org.apache.phoenix.execute.PartialCommitIT
Tests run: 2, Failures: 0, Errors: 0, Skipped: 0, Time elapsed: 7.697 sec - in org.apache.phoenix.hbase.index.covered.EndToEndCoveredColumnsIndexBuilderIT
Running org.apache.phoenix.hbase.index.covered.example.FailWithoutRetriesIT
Tests run: 1, Failures: 0, Errors: 0, Skipped: 0, Time elapsed: 7.63 sec - in org.apache.phoenix.hbase.index.covered.example.FailWithoutRetriesIT
Running org.apache.phoenix.hbase.index.covered.example.EndtoEndIndexingWithCompressionIT
Running org.apache.phoenix.hbase.index.covered.example.EndToEndCoveredIndexingIT
Tests run: 32, Failures: 0, Errors: 0, Skipped: 0, Time elapsed: 255.013 sec - in org.apache.phoenix.end2end.index.LocalIndexIT
Tests run: 24, Failures: 0, Errors: 0, Skipped: 0, Time elapsed: 312.777 sec - in org.apache.phoenix.end2end.index.ImmutableIndexIT
Running org.apache.phoenix.iterate.RoundRobinResultIteratorWithStatsIT
Tests run: 11, Failures: 0, Errors: 0, Skipped: 0, Time elapsed: 60.323 sec - in org.apache.phoenix.hbase.index.covered.example.EndToEndCoveredIndexingIT
Tests run: 11, Failures: 0, Errors: 0, Skipped: 0, Time elapsed: 60.494 sec - in org.apache.phoenix.hbase.index.covered.example.EndtoEndIndexingWithCompressionIT
Running org.apache.phoenix.iterate.ScannerLeaseRenewalIT
Tests run: 1, Failures: 0, Errors: 0, Skipped: 0, Time elapsed: 28.896 sec - in org.apache.phoenix.iterate.RoundRobinResultIteratorWithStatsIT
Running org.apache.phoenix.monitoring.PhoenixMetricsIT
Running org.apache.phoenix.rpc.PhoenixClientRpcIT
Running org.apache.phoenix.rpc.PhoenixServerRpcIT
Tests run: 2, Failures: 0, Errors: 0, Skipped: 0, Time elapsed: 11.233 sec - in org.apache.phoenix.rpc.PhoenixClientRpcIT
Tests run: 2, Failures: 0, Errors: 0, Skipped: 0, Time elapsed: 20.297 sec - in org.apache.phoenix.rpc.PhoenixServerRpcIT
Tests run: 21, Failures: 0, Errors: 0, Skipped: 0, Time elapsed: 50.124 sec - in org.apache.phoenix.monitoring.PhoenixMetricsIT
Tests run: 2, Failures: 0, Errors: 0, Skipped: 0, Time elapsed: 160.32 sec - in org.apache.phoenix.iterate.ScannerLeaseRenewalIT

Results :

Tests run: 503, Failures: 0, Errors: 0, Skipped: 65

[INFO] 
[INFO] --- maven-failsafe-plugin:2.19.1:verify (ParallelStatsEnabledTest) @ phoenix-core ---
[INFO] ------------------------------------------------------------------------
[INFO] Reactor Summary:
[INFO] 
[INFO] Apache Phoenix ..................................... SUCCESS [  5.136 s]
[INFO] Phoenix Core ....................................... FAILURE [  01:04 h]
[INFO] Phoenix - Flume .................................... SKIPPED
[INFO] Phoenix - Kafka .................................... SKIPPED
[INFO] Phoenix - Pig ...................................... SKIPPED
[INFO] Phoenix Query Server Client ........................ SKIPPED
[INFO] Phoenix Query Server ............................... SKIPPED
[INFO] Phoenix - Pherf .................................... SKIPPED
[INFO] Phoenix - Spark .................................... SKIPPED
[INFO] Phoenix - Hive ..................................... SKIPPED
[INFO] Phoenix Client ..................................... SKIPPED
[INFO] Phoenix Server ..................................... SKIPPED
[INFO] Phoenix Assembly ................................... SKIPPED
[INFO] Phoenix - Tracing Web Application .................. SKIPPED
[INFO] ------------------------------------------------------------------------
[INFO] BUILD FAILURE
[INFO] ------------------------------------------------------------------------
[INFO] Total time: 01:04 h
[INFO] Finished at: 2017-06-07T22:05:09Z
[INFO] Final Memory: 61M/1075M
[INFO] ------------------------------------------------------------------------
[ERROR] Failed to execute goal org.apache.maven.plugins:maven-failsafe-plugin:2.19.1:verify (ParallelStatsEnabledTest) on project phoenix-core: There are test failures.
[ERROR] 
[ERROR] Please refer to <https://builds.apache.org/job/Phoenix-4.x-HBase-0.98/ws/phoenix-core/target/failsafe-reports> for the individual test results.
[ERROR] -> [Help 1]
[ERROR] 
[ERROR] To see the full stack trace of the errors, re-run Maven with the -e switch.
[ERROR] Re-run Maven using the -X switch to enable full debug logging.
[ERROR] 
[ERROR] For more information about the errors and possible solutions, please read the following articles:
[ERROR] [Help 1] http://cwiki.apache.org/confluence/display/MAVEN/MojoFailureException
[ERROR] 
[ERROR] After correcting the problems, you can resume the build with the command
[ERROR]   mvn <goals> -rf :phoenix-core
Build step 'Invoke top-level Maven targets' marked build as failure
Archiving artifacts
Recording test results
Not sending mail to unregistered user ankitsinghal59@gmail.com