You are viewing a plain text version of this content. The canonical link for it is here.
Posted to builds@beam.apache.org by Apache Jenkins Server <je...@builds.apache.org> on 2023/04/26 13:16:47 UTC
Build failed in Jenkins: beam_PostCommit_Java_DataflowV2 #2967
See <https://ci-beam.apache.org/job/beam_PostCommit_Java_DataflowV2/2967/display/redirect>
Changes:
------------------------------------------
[...truncated 67.09 KB...]
> Task :release:go-licenses:java:createLicenses
> Task :sdks:java:container:java8:copyGolangLicenses
> Task :sdks:java:container:java8:dockerPrepare
> Task :sdks:java:container:java8:docker
#1 [internal] load build definition from Dockerfile
#1 transferring dockerfile:
#1 transferring dockerfile: 2.58kB done
#1 DONE 0.0s
#2 [internal] load .dockerignore
#2 transferring context: 2B done
#2 DONE 0.0s
#3 [internal] load metadata for docker.io/library/eclipse-temurin:8
#3 DONE 0.3s
#4 [ 1/16] FROM docker.io/library/eclipse-temurin:8@sha256:1f41c45c94ce6b02640030362ebd29eaec22ccc65c3e42f3c28f5edd5ca2aab8
#4 resolve docker.io/library/eclipse-temurin:8@sha256:1f41c45c94ce6b02640030362ebd29eaec22ccc65c3e42f3c28f5edd5ca2aab8 0.0s done
#4 ...
#5 [internal] load build context
#5 transferring context: 46.96MB 0.4s done
#5 DONE 0.4s
#6 [ 2/16] ADD target/slf4j-api.jar /opt/apache/beam/jars/
#6 DONE 1.2s
#4 [ 1/16] FROM docker.io/library/eclipse-temurin:8@sha256:1f41c45c94ce6b02640030362ebd29eaec22ccc65c3e42f3c28f5edd5ca2aab8
#4 ...
#7 [ 3/16] ADD target/slf4j-jdk14.jar /opt/apache/beam/jars/
#7 DONE 0.1s
#8 [ 4/16] ADD target/jcl-over-slf4j.jar /opt/apache/beam/jars/
#8 DONE 0.1s
#9 [ 5/16] ADD target/log4j-over-slf4j.jar /opt/apache/beam/jars/
#9 DONE 0.1s
#10 [ 6/16] ADD target/log4j-to-slf4j.jar /opt/apache/beam/jars/
#10 DONE 0.1s
#4 [ 1/16] FROM docker.io/library/eclipse-temurin:8@sha256:1f41c45c94ce6b02640030362ebd29eaec22ccc65c3e42f3c28f5edd5ca2aab8
#4 ...
#11 [ 7/16] ADD target/beam-sdks-java-harness.jar /opt/apache/beam/jars/
#11 DONE 0.1s
#12 [ 8/16] COPY target/jamm.jar target/open-module-agent*.jar /opt/apache/beam/jars/
#12 DONE 0.1s
#13 [ 9/16] COPY target/linux_amd64/boot /opt/apache/beam/
#13 DONE 0.2s
#14 [10/16] COPY target/LICENSE /opt/apache/beam/
#14 DONE 0.1s
#15 [11/16] COPY target/NOTICE /opt/apache/beam/
#15 DONE 0.1s
#4 [ 1/16] FROM docker.io/library/eclipse-temurin:8@sha256:1f41c45c94ce6b02640030362ebd29eaec22ccc65c3e42f3c28f5edd5ca2aab8
#4 ...
#16 [12/16] ADD target/third_party_licenses /opt/apache/beam/third_party_licenses/
#16 DONE 0.2s
#17 [13/16] COPY target/LICENSE target/options/* /opt/apache/beam/options/
#17 DONE 0.1s
#18 [14/16] COPY target/go-licenses/* /opt/apache/beam/third_party_licenses/golang/
#18 DONE 0.1s
#19 [15/16] RUN if [ "true" = "false" ] ; then rm -rf /opt/apache/beam/third_party_licenses ; fi
#19 DONE 0.3s
#4 [ 1/16] FROM docker.io/library/eclipse-temurin:8@sha256:1f41c45c94ce6b02640030362ebd29eaec22ccc65c3e42f3c28f5edd5ca2aab8
#4 ...
#20 [16/16] COPY target/profiler/* /opt/google_cloud_profiler/
#20 DONE 0.1s
#21 exporting to image
#21 exporting layers
#21 exporting layers 0.3s done
#21 writing image sha256:d0177703579fb49f8bd0840d74721f2d4cdfbdca688209df496fa96a4eeba15e done
#21 naming to docker.io/apache/beam_java8_sdk:2.48.0.dev done
#21 DONE 0.3s
#4 [ 1/16] FROM docker.io/library/eclipse-temurin:8@sha256:1f41c45c94ce6b02640030362ebd29eaec22ccc65c3e42f3c28f5edd5ca2aab8
> Task :runners:google-cloud-dataflow-java:buildAndPushDockerJavaContainer
WARNING: `gcloud docker` will not be supported for Docker client versions above 18.03.
As an alternative, use `gcloud auth configure-docker` to configure `docker` to
use `gcloud` as a credential helper, then use `docker` as you would for non-GCR
registries, e.g. `docker pull gcr.io/project-id/my-image`. Add
`--verbosity=error` to silence this warning: `gcloud docker
--verbosity=error -- pull gcr.io/project-id/my-image`.
See: https://cloud.google.com/container-registry/docs/support/deprecation-notices#gcloud-docker
The push refers to repository [us.gcr.io/apache-beam-testing/java-postcommit-it/java]
6208d330e47f: Preparing
5f70bf18a086: Preparing
644d8410af5e: Preparing
51ee2ed04c73: Preparing
bbfa14312af1: Preparing
90f3f04a9cb3: Preparing
9dee713dfa83: Preparing
eceb7be1cee1: Preparing
25ed2a2f867e: Preparing
b483d8a71806: Preparing
c8c4a61f7200: Preparing
c450ce34ad86: Preparing
ae02340c99b4: Preparing
a6b732db8436: Preparing
9b4c9f66c6a6: Preparing
533af4d05d89: Preparing
d09fdd9ad3ef: Preparing
04d1dcab20cb: Preparing
b93c1bd012ab: Preparing
d09fdd9ad3ef: Waiting
c450ce34ad86: Waiting
04d1dcab20cb: Waiting
ae02340c99b4: Waiting
b93c1bd012ab: Waiting
90f3f04a9cb3: Waiting
533af4d05d89: Waiting
9b4c9f66c6a6: Waiting
9dee713dfa83: Waiting
b483d8a71806: Waiting
c8c4a61f7200: Waiting
25ed2a2f867e: Waiting
eceb7be1cee1: Waiting
5f70bf18a086: Layer already exists
644d8410af5e: Pushed
51ee2ed04c73: Pushed
90f3f04a9cb3: Pushed
bbfa14312af1: Pushed
6208d330e47f: Pushed
25ed2a2f867e: Pushed
9dee713dfa83: Pushed
c8c4a61f7200: Pushed
eceb7be1cee1: Pushed
b483d8a71806: Pushed
533af4d05d89: Layer already exists
ae02340c99b4: Pushed
04d1dcab20cb: Layer already exists
d09fdd9ad3ef: Layer already exists
c450ce34ad86: Pushed
b93c1bd012ab: Layer already exists
a6b732db8436: Pushed
9b4c9f66c6a6: Pushed
20230426095742: digest: sha256:daa724af0e64010d885b0145bbe25d7e49172375bee72f5032f44eee9294370e size: 4296
> Task :runners:google-cloud-dataflow-java:coreSDKJavaRunnerV2IntegrationTest NO-SOURCE
> Task :runners:google-cloud-dataflow-java:examplesJavaRunnerV2IntegrationTest
***********************************************************
***********************************************************
**********************Set Up Pubsub************************
The Pub/Sub topic has been set up for this example: projects/apache-beam-testing/topics/testpipeline-jenkins-0426095922-8cce3a7c
The Pub/Sub subscription has been set up for this example: projects/apache-beam-testing/subscriptions/testpipeline-jenkins-0426095922-8cce3a7c
*************************Tear Down*************************
The Pub/Sub topic has been deleted: projects/apache-beam-testing/topics/testpipeline-jenkins-0426095922-8cce3a7c
The Pub/Sub subscription has been deleted: projects/apache-beam-testing/subscriptions/testpipeline-jenkins-0426095922-8cce3a7c
***********************************************************
***********************************************************
***********************************************************
***********************************************************
**********************Set Up Pubsub************************
The Pub/Sub topic has been set up for this example: projects/apache-beam-testing/topics/testpipeline-jenkins-0426095922-3ed4854c
The Pub/Sub subscription has been set up for this example: projects/apache-beam-testing/subscriptions/testpipeline-jenkins-0426095922-3ed4854c
*************************Tear Down*************************
The Pub/Sub topic has been deleted: projects/apache-beam-testing/topics/testpipeline-jenkins-0426095922-3ed4854c
The Pub/Sub subscription has been deleted: projects/apache-beam-testing/subscriptions/testpipeline-jenkins-0426095922-3ed4854c
***********************************************************
***********************************************************
> Task :runners:google-cloud-dataflow-java:googleCloudPlatformRunnerV2IntegrationTest
org.apache.beam.sdk.io.gcp.storage.GcsMatchIT > testGcsMatchContinuously FAILED
java.lang.RuntimeException at GcsMatchIT.java:176
87 tests completed, 1 failed, 2 skipped
> Task :runners:google-cloud-dataflow-java:googleCloudPlatformRunnerV2IntegrationTest FAILED
> Task :runners:google-cloud-dataflow-java:cleanUpDockerJavaImages
Untagged: us.gcr.io/apache-beam-testing/java-postcommit-it/java:20230426095742
Untagged: us.gcr.io/apache-beam-testing/java-postcommit-it/java@sha256:daa724af0e64010d885b0145bbe25d7e49172375bee72f5032f44eee9294370e
Deleted: sha256:d0177703579fb49f8bd0840d74721f2d4cdfbdca688209df496fa96a4eeba15e
WARNING: Successfully resolved tag to sha256, but it is recommended to use sha256 directly.
Tag: [us.gcr.io/apache-beam-testing/java-postcommit-it/java:20230426095742]
- referencing digest: [us.gcr.io/apache-beam-testing/java-postcommit-it/java@sha256:daa724af0e64010d885b0145bbe25d7e49172375bee72f5032f44eee9294370e]
Deleted [[us.gcr.io/apache-beam-testing/java-postcommit-it/java:20230426095742] (referencing [us.gcr.io/apache-beam-testing/java-postcommit-it/java@sha256:daa724af0e64010d885b0145bbe25d7e49172375bee72f5032f44eee9294370e])].
Removing untagged image us.gcr.io/apache-beam-testing/java-postcommit-it/java@sha256:daa724af0e64010d885b0145bbe25d7e49172375bee72f5032f44eee9294370e
Digests:
- us.gcr.io/apache-beam-testing/java-postcommit-it/java@sha256:daa724af0e64010d885b0145bbe25d7e49172375bee72f5032f44eee9294370e
Deleted [us.gcr.io/apache-beam-testing/java-postcommit-it/java@sha256:daa724af0e64010d885b0145bbe25d7e49172375bee72f5032f44eee9294370e].
FAILURE: Build failed with an exception.
* What went wrong:
Execution failed for task ':runners:google-cloud-dataflow-java:googleCloudPlatformRunnerV2IntegrationTest'.
> There were failing tests. See the report at: file://<https://ci-beam.apache.org/job/beam_PostCommit_Java_DataflowV2/ws/src/runners/google-cloud-dataflow-java/build/reports/tests/googleCloudPlatformRunnerV2IntegrationTest/index.html>
* Try:
> Run with --stacktrace option to get the stack trace.
> Run with --info or --debug option to get more log output.
* Get more help at https://help.gradle.org
Deprecated Gradle features were used in this build, making it incompatible with Gradle 8.0.
You can use '--warning-mode all' to show the individual deprecation warnings and determine if they come from your own scripts or plugins.
See https://docs.gradle.org/7.5.1/userguide/command_line_interface.html#sec:command_line_warnings
Execution optimizations have been disabled for 1 invalid unit(s) of work during this build to ensure correctness.
Please consult deprecation warnings for more details.
BUILD FAILED in 3h 19m 19s
152 actionable tasks: 98 executed, 50 from cache, 4 up-to-date
Build scan background action failed.
java.lang.IllegalArgumentException: com.gradle.enterprise.gradleplugin.internal.extension.a is not an interface
at java.lang.reflect.Proxy$ProxyClassFactory.apply(Proxy.java:590)
at java.lang.reflect.Proxy$ProxyClassFactory.apply(Proxy.java:557)
at java.lang.reflect.WeakCache$Factory.get(WeakCache.java:230)
at java.lang.reflect.WeakCache.get(WeakCache.java:127)
at java.lang.reflect.Proxy.getProxyClass0(Proxy.java:419)
at java.lang.reflect.Proxy.newProxyInstance(Proxy.java:719)
at com.gradle.ProxyFactory$ProxyingInvocationHandler.createLocalProxy(ProxyFactory.java:64)
at com.gradle.ProxyFactory$ProxyingInvocationHandler.lambda$adaptActionArg$1(ProxyFactory.java:59)
at com.gradle.enterprise.gradleplugin.internal.extension.b$3.run(SourceFile:100)
at java.util.concurrent.Executors$RunnableAdapter.call(Executors.java:511)
at java.util.concurrent.FutureTask.run(FutureTask.java:266)
at java.util.concurrent.ThreadPoolExecutor.runWorker(ThreadPoolExecutor.java:1149)
at java.util.concurrent.ThreadPoolExecutor$Worker.run(ThreadPoolExecutor.java:624)
at java.lang.Thread.run(Thread.java:750)
Publishing build scan...
https://gradle.com/s/u4tvyqs4yl5pa
Build step 'Invoke Gradle script' changed build result to FAILURE
Build step 'Invoke Gradle script' marked build as failure
---------------------------------------------------------------------
To unsubscribe, e-mail: builds-unsubscribe@beam.apache.org
For additional commands, e-mail: builds-help@beam.apache.org
Jenkins build is back to normal : beam_PostCommit_Java_DataflowV2 #2968
Posted by Apache Jenkins Server <je...@builds.apache.org>.
See <https://ci-beam.apache.org/job/beam_PostCommit_Java_DataflowV2/2968/display/redirect?page=changes>
---------------------------------------------------------------------
To unsubscribe, e-mail: builds-unsubscribe@beam.apache.org
For additional commands, e-mail: builds-help@beam.apache.org