You are viewing a plain text version of this content. The canonical link for it is here.
Posted to dev@kafka.apache.org by Apache Jenkins Server <je...@builds.apache.org> on 2015/11/12 20:22:46 UTC

Build failed in Jenkins: kafka-trunk-jdk7 #809

See <https://builds.apache.org/job/kafka-trunk-jdk7/809/changes>

Changes:

[wangguoz] KAFKA-2815: Fix KafkaStreamingPartitionAssignorTest.testSubscription

[cshapi] KAFKA-2690: Hide passwords while logging the config.

------------------------------------------
[...truncated 1398 lines...]

kafka.log.LogTest > testParseTopicPartitionNameForMissingPartition PASSED

kafka.log.LogTest > testParseTopicPartitionNameForEmptyName PASSED

kafka.log.LogTest > testOpenDeletesObsoleteFiles PASSED

kafka.log.LogTest > testSizeBasedLogRoll PASSED

kafka.log.LogTest > testTimeBasedLogRollJitter PASSED

kafka.log.LogTest > testParseTopicPartitionName PASSED

kafka.log.LogTest > testTruncateTo PASSED

kafka.log.LogTest > testCleanShutdownFile PASSED

kafka.log.OffsetIndexTest > lookupExtremeCases PASSED

kafka.log.OffsetIndexTest > appendTooMany PASSED

kafka.log.OffsetIndexTest > randomLookupTest PASSED

kafka.log.OffsetIndexTest > testReopen PASSED

kafka.log.OffsetIndexTest > appendOutOfOrder PASSED

kafka.log.OffsetIndexTest > truncate PASSED

kafka.log.LogSegmentTest > testRecoveryWithCorruptMessage PASSED

kafka.log.LogSegmentTest > testRecoveryFixesCorruptIndex PASSED

kafka.log.LogSegmentTest > testReadFromGap PASSED

kafka.log.LogSegmentTest > testTruncate PASSED

kafka.log.LogSegmentTest > testReadBeforeFirstOffset PASSED

kafka.log.LogSegmentTest > testCreateWithInitFileSizeAppendMessage PASSED

kafka.log.LogSegmentTest > testChangeFileSuffixes PASSED

kafka.log.LogSegmentTest > testMaxOffset PASSED

kafka.log.LogSegmentTest > testNextOffsetCalculation PASSED

kafka.log.LogSegmentTest > testReadOnEmptySegment PASSED

kafka.log.LogSegmentTest > testReadAfterLast PASSED

kafka.log.LogSegmentTest > testCreateWithInitFileSizeClearShutdown PASSED

kafka.log.LogSegmentTest > testTruncateFull PASSED

kafka.log.CleanerTest > testBuildOffsetMap PASSED

kafka.log.CleanerTest > testSegmentGrouping PASSED

kafka.log.CleanerTest > testCleanSegmentsWithAbort PASSED

kafka.log.CleanerTest > testSegmentGroupingWithSparseOffsets PASSED

kafka.log.CleanerTest > testRecoveryAfterCrash PASSED

kafka.log.CleanerTest > testLogToClean PASSED

kafka.log.CleanerTest > testCleaningWithDeletes PASSED

kafka.log.CleanerTest > testCleanSegments PASSED

kafka.log.CleanerTest > testCleaningWithUnkeyedMessages PASSED

kafka.log.OffsetMapTest > testClear PASSED

kafka.log.OffsetMapTest > testBasicValidation PASSED

kafka.coordinator.GroupCoordinatorResponseTest > testHeartbeatWrongCoordinator PASSED

kafka.coordinator.GroupCoordinatorResponseTest > testDescribeGroupStable PASSED

kafka.coordinator.GroupCoordinatorResponseTest > testHeartbeatIllegalGeneration PASSED

kafka.coordinator.GroupCoordinatorResponseTest > testDescribeGroupWrongCoordinator PASSED

kafka.coordinator.GroupCoordinatorResponseTest > testDescribeGroupRebalancing PASSED

kafka.coordinator.GroupCoordinatorResponseTest > testLeaderFailureInSyncGroup PASSED

kafka.coordinator.GroupCoordinatorResponseTest > testGenerationIdIncrementsOnRebalance PASSED

kafka.coordinator.GroupCoordinatorResponseTest > testSyncGroupFromIllegalGeneration PASSED

kafka.coordinator.GroupCoordinatorResponseTest > testInvalidGroupId PASSED

kafka.coordinator.GroupCoordinatorResponseTest > testHeartbeatUnknownGroup PASSED

kafka.coordinator.GroupCoordinatorResponseTest > testListGroupsIncludesStableGroups PASSED

kafka.coordinator.GroupCoordinatorResponseTest > testHeartbeatDuringRebalanceCausesRebalanceInProgress PASSED

kafka.coordinator.GroupCoordinatorResponseTest > testJoinGroupInconsistentGroupProtocol PASSED

kafka.coordinator.GroupCoordinatorResponseTest > testJoinGroupSessionTimeoutTooLarge PASSED

kafka.coordinator.GroupCoordinatorResponseTest > testJoinGroupSessionTimeoutTooSmall PASSED

kafka.coordinator.GroupCoordinatorResponseTest > testSyncGroupEmptyAssignment PASSED

kafka.coordinator.GroupCoordinatorResponseTest > testCommitOffsetWithDefaultGeneration PASSED

kafka.coordinator.GroupCoordinatorResponseTest > testJoinGroupFromUnchangedLeaderShouldRebalance PASSED

kafka.coordinator.GroupCoordinatorResponseTest > testHeartbeatRebalanceInProgress PASSED

kafka.coordinator.GroupCoordinatorResponseTest > testLeaveGroupUnknownGroup PASSED

kafka.coordinator.GroupCoordinatorResponseTest > testListGroupsIncludesRebalancingGroups PASSED

kafka.coordinator.GroupCoordinatorResponseTest > testSyncGroupFollowerAfterLeader PASSED

kafka.coordinator.GroupCoordinatorResponseTest > testCommitOffsetInAwaitingSync PASSED

kafka.coordinator.GroupCoordinatorResponseTest > testJoinGroupWrongCoordinator PASSED

kafka.coordinator.GroupCoordinatorResponseTest > testJoinGroupUnknownConsumerExistingGroup PASSED

kafka.coordinator.GroupCoordinatorResponseTest > testSyncGroupFromUnknownGroup PASSED

kafka.coordinator.GroupCoordinatorResponseTest > testJoinGroupInconsistentProtocolType PASSED

kafka.coordinator.GroupCoordinatorResponseTest > testCommitOffsetFromUnknownGroup PASSED

kafka.coordinator.GroupCoordinatorResponseTest > testLeaveGroupWrongCoordinator PASSED

kafka.coordinator.GroupCoordinatorResponseTest > testLeaveGroupUnknownConsumerExistingGroup PASSED

kafka.coordinator.GroupCoordinatorResponseTest > testJoinGroupUnknownConsumerNewGroup PASSED

kafka.coordinator.GroupCoordinatorResponseTest > testJoinGroupFromUnchangedFollowerDoesNotRebalance PASSED

kafka.coordinator.GroupCoordinatorResponseTest > testValidJoinGroup PASSED

kafka.coordinator.GroupCoordinatorResponseTest > testSyncGroupLeaderAfterFollower PASSED

kafka.coordinator.GroupCoordinatorResponseTest > testSyncGroupFromUnknownMember PASSED

kafka.coordinator.GroupCoordinatorResponseTest > testValidLeaveGroup PASSED

kafka.coordinator.GroupCoordinatorResponseTest > testDescribeGroupInactiveGroup PASSED

kafka.coordinator.GroupCoordinatorResponseTest > testSyncGroupNotCoordinator PASSED

kafka.coordinator.GroupCoordinatorResponseTest > testHeartbeatUnknownConsumerExistingGroup PASSED

kafka.coordinator.GroupCoordinatorResponseTest > testValidHeartbeat PASSED

kafka.coordinator.MemberMetadataTest > testMatchesSupportedProtocols PASSED

kafka.coordinator.MemberMetadataTest > testMetadata PASSED

kafka.coordinator.MemberMetadataTest > testMetadataRaisesOnUnsupportedProtocol PASSED

kafka.coordinator.MemberMetadataTest > testVoteForPreferredProtocol PASSED

kafka.coordinator.MemberMetadataTest > testVoteRaisesOnNoSupportedProtocols PASSED

kafka.coordinator.GroupMetadataTest > testDeadToAwaitingSyncIllegalTransition PASSED

kafka.coordinator.GroupMetadataTest > testPreparingRebalanceToStableIllegalTransition PASSED

kafka.coordinator.GroupMetadataTest > testCannotRebalanceWhenDead PASSED

kafka.coordinator.GroupMetadataTest > testSelectProtocol PASSED

kafka.coordinator.GroupMetadataTest > testCannotRebalanceWhenPreparingRebalance PASSED

kafka.coordinator.GroupMetadataTest > testDeadToPreparingRebalanceIllegalTransition PASSED

kafka.coordinator.GroupMetadataTest > testCanRebalanceWhenAwaitingSync PASSED

kafka.coordinator.GroupMetadataTest > testAwaitingSyncToPreparingRebalanceTransition PASSED

kafka.coordinator.GroupMetadataTest > testStableToAwaitingSyncIllegalTransition PASSED

kafka.coordinator.GroupMetadataTest > testDeadToDeadIllegalTransition PASSED

kafka.coordinator.GroupMetadataTest > testSelectProtocolRaisesIfNoMembers PASSED

kafka.coordinator.GroupMetadataTest > testStableToPreparingRebalanceTransition PASSED

kafka.coordinator.GroupMetadataTest > testPreparingRebalanceToDeadTransition PASSED

kafka.coordinator.GroupMetadataTest > testStableToStableIllegalTransition PASSED

kafka.coordinator.GroupMetadataTest > testAwaitingSyncToStableTransition PASSED

kafka.coordinator.GroupMetadataTest > testDeadToStableIllegalTransition PASSED

kafka.coordinator.GroupMetadataTest > testAwaitingSyncToAwaitingSyncIllegalTransition PASSED

kafka.coordinator.GroupMetadataTest > testSupportsProtocols PASSED

kafka.coordinator.GroupMetadataTest > testCanRebalanceWhenStable PASSED

kafka.coordinator.GroupMetadataTest > testPreparingRebalanceToPreparingRebalanceIllegalTransition PASSED

kafka.coordinator.GroupMetadataTest > testSelectProtocolChoosesCompatibleProtocol PASSED

kafka.javaapi.message.ByteBufferMessageSetTest > testSizeInBytesWithCompression PASSED

kafka.javaapi.message.ByteBufferMessageSetTest > testIteratorIsConsistentWithCompression PASSED

kafka.javaapi.message.ByteBufferMessageSetTest > testIteratorIsConsistent PASSED

kafka.javaapi.message.ByteBufferMessageSetTest > testEqualsWithCompression PASSED

kafka.javaapi.message.ByteBufferMessageSetTest > testWrittenEqualsRead PASSED

kafka.javaapi.message.ByteBufferMessageSetTest > testEquals PASSED

kafka.javaapi.message.ByteBufferMessageSetTest > testSizeInBytes PASSED

kafka.javaapi.consumer.ZookeeperConsumerConnectorTest > testBasic PASSED

kafka.controller.ControllerFailoverTest > testMetadataUpdate PASSED

635 tests completed, 1 failed
:kafka-trunk-jdk7:core:test FAILED
:test_core_2_10_5 FAILED

FAILURE: Build failed with an exception.

* What went wrong:
Execution failed for task ':core:test'.
> There were failing tests. See the report at: file://<https://builds.apache.org/job/kafka-trunk-jdk7/ws/core/build/reports/tests/index.html>

* Try:
Run with --stacktrace option to get the stack trace. Run with --info or --debug option to get more log output.

BUILD FAILED

Total time: 44 mins 3.891 secs
Build step 'Execute shell' marked build as failure
Recording test results
Setting GRADLE_2_4_RC_2_HOME=/home/jenkins/jenkins-slave/tools/hudson.plugins.gradle.GradleInstallation/Gradle_2.4-rc-2
Setting JDK_1_7U51_HOME=/home/jenkins/jenkins-slave/tools/hudson.model.JDK/jdk-1.7u51
Setting GRADLE_2_4_RC_2_HOME=/home/jenkins/jenkins-slave/tools/hudson.plugins.gradle.GradleInstallation/Gradle_2.4-rc-2
Setting JDK_1_7U51_HOME=/home/jenkins/jenkins-slave/tools/hudson.model.JDK/jdk-1.7u51

Jenkins build is back to normal : kafka-trunk-jdk7 #812

Posted by Apache Jenkins Server <je...@builds.apache.org>.
See <https://builds.apache.org/job/kafka-trunk-jdk7/812/changes>


Build failed in Jenkins: kafka-trunk-jdk7 #811

Posted by Apache Jenkins Server <je...@builds.apache.org>.
See <https://builds.apache.org/job/kafka-trunk-jdk7/811/changes>

Changes:

[wangguoz] KAFKA-2822: DescribeConsumerGroup now returns empty list for

------------------------------------------
[...truncated 610 lines...]
kafka.server.ReplicaManagerTest > testHighwaterMarkRelativeDirectoryMapping PASSED

kafka.server.ServerShutdownTest > testCleanShutdownAfterFailedStartup PASSED

kafka.server.ServerShutdownTest > testConsecutiveShutdown PASSED

kafka.server.ServerShutdownTest > testCleanShutdown PASSED

kafka.server.ServerShutdownTest > testCleanShutdownWithDeleteTopicEnabled PASSED

kafka.server.LeaderElectionTest > testLeaderElectionWithStaleControllerEpoch PASSED

kafka.server.LeaderElectionTest > testLeaderElectionAndEpoch PASSED

kafka.server.OffsetCommitTest > testUpdateOffsets PASSED

kafka.server.OffsetCommitTest > testLargeMetadataPayload PASSED

kafka.server.OffsetCommitTest > testCommitAndFetchOffsets PASSED

kafka.server.OffsetCommitTest > testOffsetExpiration PASSED

kafka.server.OffsetCommitTest > testNonExistingTopicOffsetCommit PASSED

kafka.server.SimpleFetchTest > testReadFromLog PASSED

kafka.server.DynamicConfigChangeTest > testProcessNotification PASSED

kafka.server.DynamicConfigChangeTest > testClientQuotaConfigChange PASSED

kafka.server.DynamicConfigChangeTest > testConfigChangeOnNonExistingTopic PASSED

kafka.server.DynamicConfigChangeTest > testConfigChange PASSED

kafka.server.LogOffsetTest > testGetOffsetsBeforeEarliestTime PASSED

kafka.server.LogOffsetTest > testGetOffsetsForUnknownTopic PASSED

kafka.server.LogOffsetTest > testEmptyLogsGetOffsets PASSED

kafka.server.LogOffsetTest > testGetOffsetsBeforeLatestTime PASSED

kafka.server.LogOffsetTest > testGetOffsetsBeforeNow PASSED

kafka.server.ClientQuotaManagerTest > testQuotaViolation PASSED

kafka.server.ClientQuotaManagerTest > testQuotaParsing PASSED

kafka.server.KafkaConfigTest > testAdvertiseConfigured PASSED

kafka.server.KafkaConfigTest > testLogRetentionTimeHoursProvided PASSED

kafka.server.KafkaConfigTest > testLogRollTimeBothMsAndHoursProvided PASSED

kafka.server.KafkaConfigTest > testLogRetentionValid PASSED

kafka.server.KafkaConfigTest > testSpecificProperties PASSED

kafka.server.KafkaConfigTest > testDefaultCompressionType PASSED

kafka.server.KafkaConfigTest > testDuplicateListeners PASSED

kafka.server.KafkaConfigTest > testLogRetentionUnlimited PASSED

kafka.server.KafkaConfigTest > testLogRetentionTimeMsProvided PASSED

kafka.server.KafkaConfigTest > testLogRollTimeNoConfigProvided PASSED

kafka.server.KafkaConfigTest > testAdvertiseDefaults PASSED

kafka.server.KafkaConfigTest > testBadListenerProtocol PASSED

kafka.server.KafkaConfigTest > testListenerDefaults PASSED

kafka.server.KafkaConfigTest > testLogRetentionTimeBothMinutesAndHoursProvided PASSED

kafka.server.KafkaConfigTest > testUncleanElectionDisabled PASSED

kafka.server.KafkaConfigTest > testLogRetentionTimeNoConfigProvided PASSED

kafka.server.KafkaConfigTest > testFromPropsInvalid PASSED

kafka.server.KafkaConfigTest > testInvalidCompressionType PASSED

kafka.server.KafkaConfigTest > testAdvertiseHostNameDefault PASSED

kafka.server.KafkaConfigTest > testLogRetentionTimeMinutesProvided PASSED

kafka.server.KafkaConfigTest > testValidCompressionType PASSED

kafka.server.KafkaConfigTest > testUncleanElectionInvalid PASSED

kafka.server.KafkaConfigTest > testLogRetentionTimeBothMinutesAndMsProvided PASSED

kafka.server.KafkaConfigTest > testLogRollTimeMsProvided PASSED

kafka.server.KafkaConfigTest > testUncleanLeaderElectionDefault PASSED

kafka.server.KafkaConfigTest > testUncleanElectionEnabled PASSED

kafka.server.KafkaConfigTest > testAdvertisePortDefault PASSED

kafka.server.KafkaConfigTest > testVersionConfiguration PASSED

kafka.server.LogRecoveryTest > testHWCheckpointNoFailuresMultipleLogSegments PASSED

kafka.server.LogRecoveryTest > testHWCheckpointWithFailuresMultipleLogSegments PASSED

kafka.server.LogRecoveryTest > testHWCheckpointNoFailuresSingleLogSegment PASSED

kafka.server.LogRecoveryTest > testHWCheckpointWithFailuresSingleLogSegment PASSED

kafka.server.SaslPlaintextReplicaFetchTest > testReplicaFetcherThread PASSED

kafka.server.ServerStartupTest > testBrokerCreatesZKChroot PASSED

kafka.server.ServerStartupTest > testConflictBrokerRegistration PASSED

kafka.server.IsrExpirationTest > testIsrExpirationForSlowFollowers PASSED

kafka.server.IsrExpirationTest > testIsrExpirationForStuckFollowers PASSED

kafka.server.IsrExpirationTest > testIsrExpirationIfNoFetchRequestMade PASSED

kafka.server.AdvertiseBrokerTest > testBrokerAdvertiseToZK PASSED

kafka.server.SaslSslReplicaFetchTest > testReplicaFetcherThread PASSED

kafka.tools.ConsoleProducerTest > testParseKeyProp PASSED

kafka.tools.ConsoleProducerTest > testValidConfigsOldProducer PASSED

kafka.tools.ConsoleProducerTest > testInvalidConfigs PASSED

kafka.tools.ConsoleProducerTest > testValidConfigsNewProducer PASSED

kafka.api.RequestResponseSerializationTest > testSerializationAndDeserialization PASSED

kafka.api.RequestResponseSerializationTest > testFetchResponseVersion PASSED

kafka.api.RequestResponseSerializationTest > testProduceResponseVersion PASSED

kafka.api.SaslSslConsumerTest > testPauseStateNotPreservedByRebalance PASSED

kafka.api.SaslSslConsumerTest > testUnsubscribeTopic PASSED

kafka.api.SaslSslConsumerTest > testListTopics PASSED

kafka.api.SaslSslConsumerTest > testAutoCommitOnRebalance PASSED

kafka.api.SaslSslConsumerTest > testSimpleConsumption PASSED

kafka.api.SaslSslConsumerTest > testPartitionReassignmentCallback PASSED

kafka.api.SaslSslConsumerTest > testCommitSpecifiedOffsets PASSED

kafka.api.SslConsumerTest > testPauseStateNotPreservedByRebalance PASSED

kafka.api.SslConsumerTest > testUnsubscribeTopic PASSED

kafka.api.SslConsumerTest > testListTopics PASSED

kafka.api.SslConsumerTest > testAutoCommitOnRebalance PASSED

kafka.api.SslConsumerTest > testSimpleConsumption PASSED
ERROR: Could not install GRADLE_2_4_RC_2_HOME
java.lang.NullPointerException
	at hudson.plugins.toolenv.ToolEnvBuildWrapper$1.buildEnvVars(ToolEnvBuildWrapper.java:46)
	at hudson.model.AbstractBuild.getEnvironment(AbstractBuild.java:941)
	at hudson.plugins.git.GitSCM.getParamExpandedRepos(GitSCM.java:390)
	at hudson.plugins.git.GitSCM.compareRemoteRevisionWithImpl(GitSCM.java:577)
	at hudson.plugins.git.GitSCM.compareRemoteRevisionWith(GitSCM.java:527)
	at hudson.scm.SCM.compareRemoteRevisionWith(SCM.java:380)
	at hudson.scm.SCM.poll(SCM.java:397)
	at hudson.model.AbstractProject._poll(AbstractProject.java:1450)
	at hudson.model.AbstractProject.poll(AbstractProject.java:1353)
	at hudson.triggers.SCMTrigger$Runner.runPolling(SCMTrigger.java:510)
	at hudson.triggers.SCMTrigger$Runner.run(SCMTrigger.java:539)
	at hudson.util.SequentialExecutionQueue$QueueEntry.run(SequentialExecutionQueue.java:118)
	at java.util.concurrent.Executors$RunnableAdapter.call(Executors.java:471)
	at java.util.concurrent.FutureTask.run(FutureTask.java:262)
	at java.util.concurrent.ThreadPoolExecutor.runWorker(ThreadPoolExecutor.java:1145)
	at java.util.concurrent.ThreadPoolExecutor$Worker.run(ThreadPoolExecutor.java:615)
	at java.lang.Thread.run(Thread.java:745)
ERROR: Could not install JDK_1_7U51_HOME
java.lang.NullPointerException
	at hudson.plugins.toolenv.ToolEnvBuildWrapper$1.buildEnvVars(ToolEnvBuildWrapper.java:46)
	at hudson.model.AbstractBuild.getEnvironment(AbstractBuild.java:941)
	at hudson.plugins.git.GitSCM.getParamExpandedRepos(GitSCM.java:390)
	at hudson.plugins.git.GitSCM.compareRemoteRevisionWithImpl(GitSCM.java:577)
	at hudson.plugins.git.GitSCM.compareRemoteRevisionWith(GitSCM.java:527)
	at hudson.scm.SCM.compareRemoteRevisionWith(SCM.java:380)
	at hudson.scm.SCM.poll(SCM.java:397)
	at hudson.model.AbstractProject._poll(AbstractProject.java:1450)
	at hudson.model.AbstractProject.poll(AbstractProject.java:1353)
	at hudson.triggers.SCMTrigger$Runner.runPolling(SCMTrigger.java:510)
	at hudson.triggers.SCMTrigger$Runner.run(SCMTrigger.java:539)
	at hudson.util.SequentialExecutionQueue$QueueEntry.run(SequentialExecutionQueue.java:118)
	at java.util.concurrent.Executors$RunnableAdapter.call(Executors.java:471)
	at java.util.concurrent.FutureTask.run(FutureTask.java:262)
	at java.util.concurrent.ThreadPoolExecutor.runWorker(ThreadPoolExecutor.java:1145)
	at java.util.concurrent.ThreadPoolExecutor$Worker.run(ThreadPoolExecutor.java:615)
	at java.lang.Thread.run(Thread.java:745)
ERROR: Could not install GRADLE_2_4_RC_2_HOME
java.lang.NullPointerException
	at hudson.plugins.toolenv.ToolEnvBuildWrapper$1.buildEnvVars(ToolEnvBuildWrapper.java:46)
	at hudson.model.AbstractBuild.getEnvironment(AbstractBuild.java:941)
	at hudson.plugins.git.GitSCM.getParamExpandedRepos(GitSCM.java:390)
	at hudson.plugins.git.GitSCM.compareRemoteRevisionWithImpl(GitSCM.java:577)
	at hudson.plugins.git.GitSCM.compareRemoteRevisionWith(GitSCM.java:527)
	at hudson.scm.SCM.compareRemoteRevisionWith(SCM.java:380)
	at hudson.scm.SCM.poll(SCM.java:397)
	at hudson.model.AbstractProject._poll(AbstractProject.java:1450)
	at hudson.model.AbstractProject.poll(AbstractProject.java:1353)
	at hudson.triggers.SCMTrigger$Runner.runPolling(SCMTrigger.java:510)
	at hudson.triggers.SCMTrigger$Runner.run(SCMTrigger.java:539)
	at hudson.util.SequentialExecutionQueue$QueueEntry.run(SequentialExecutionQueue.java:118)
	at java.util.concurrent.Executors$RunnableAdapter.call(Executors.java:471)
	at java.util.concurrent.FutureTask.run(FutureTask.java:262)
	at java.util.concurrent.ThreadPoolExecutor.runWorker(ThreadPoolExecutor.java:1145)
	at java.util.concurrent.ThreadPoolExecutor$Worker.run(ThreadPoolExecutor.java:615)
	at java.lang.Thread.run(Thread.java:745)
ERROR: Could not install JDK_1_7U51_HOME
java.lang.NullPointerException
	at hudson.plugins.toolenv.ToolEnvBuildWrapper$1.buildEnvVars(ToolEnvBuildWrapper.java:46)
	at hudson.model.AbstractBuild.getEnvironment(AbstractBuild.java:941)
	at hudson.plugins.git.GitSCM.getParamExpandedRepos(GitSCM.java:390)
	at hudson.plugins.git.GitSCM.compareRemoteRevisionWithImpl(GitSCM.java:577)
	at hudson.plugins.git.GitSCM.compareRemoteRevisionWith(GitSCM.java:527)
	at hudson.scm.SCM.compareRemoteRevisionWith(SCM.java:380)
	at hudson.scm.SCM.poll(SCM.java:397)
	at hudson.model.AbstractProject._poll(AbstractProject.java:1450)
	at hudson.model.AbstractProject.poll(AbstractProject.java:1353)
	at hudson.triggers.SCMTrigger$Runner.runPolling(SCMTrigger.java:510)
	at hudson.triggers.SCMTrigger$Runner.run(SCMTrigger.java:539)
	at hudson.util.SequentialExecutionQueue$QueueEntry.run(SequentialExecutionQueue.java:118)
	at java.util.concurrent.Executors$RunnableAdapter.call(Executors.java:471)
	at java.util.concurrent.FutureTask.run(FutureTask.java:262)
	at java.util.concurrent.ThreadPoolExecutor.runWorker(ThreadPoolExecutor.java:1145)
	at java.util.concurrent.ThreadPoolExecutor$Worker.run(ThreadPoolExecutor.java:615)
	at java.lang.Thread.run(Thread.java:745)
Build timed out (after 120 minutes). Marking the build as failed.
Build was aborted
Recording test results
Setting GRADLE_2_4_RC_2_HOME=/home/jenkins/jenkins-slave/tools/hudson.plugins.gradle.GradleInstallation/Gradle_2.4-rc-2
Setting JDK_1_7U51_HOME=/home/jenkins/jenkins-slave/tools/hudson.model.JDK/jdk-1.7u51
ERROR: Publisher 'Publish JUnit test result report' failed: No test report files were found. Configuration error?
Setting GRADLE_2_4_RC_2_HOME=/home/jenkins/jenkins-slave/tools/hudson.plugins.gradle.GradleInstallation/Gradle_2.4-rc-2
Setting JDK_1_7U51_HOME=/home/jenkins/jenkins-slave/tools/hudson.model.JDK/jdk-1.7u51

Build failed in Jenkins: kafka-trunk-jdk7 #810

Posted by Apache Jenkins Server <je...@builds.apache.org>.
See <https://builds.apache.org/job/kafka-trunk-jdk7/810/changes>

Changes:

[cshapi] KAFKA-2807: Fix Kafka Connect packaging and move VerifiableSource/Sink

------------------------------------------
[...truncated 1399 lines...]

kafka.log.LogTest > testParseTopicPartitionNameForMissingPartition PASSED

kafka.log.LogTest > testParseTopicPartitionNameForEmptyName PASSED

kafka.log.LogTest > testOpenDeletesObsoleteFiles PASSED

kafka.log.LogTest > testSizeBasedLogRoll PASSED

kafka.log.LogTest > testTimeBasedLogRollJitter PASSED

kafka.log.LogTest > testParseTopicPartitionName PASSED

kafka.log.LogTest > testTruncateTo PASSED

kafka.log.LogTest > testCleanShutdownFile PASSED

kafka.log.OffsetIndexTest > lookupExtremeCases PASSED

kafka.log.OffsetIndexTest > appendTooMany PASSED

kafka.log.OffsetIndexTest > randomLookupTest PASSED

kafka.log.OffsetIndexTest > testReopen PASSED

kafka.log.OffsetIndexTest > appendOutOfOrder PASSED

kafka.log.OffsetIndexTest > truncate PASSED

kafka.log.LogSegmentTest > testRecoveryWithCorruptMessage PASSED

kafka.log.LogSegmentTest > testRecoveryFixesCorruptIndex PASSED

kafka.log.LogSegmentTest > testReadFromGap PASSED

kafka.log.LogSegmentTest > testTruncate PASSED

kafka.log.LogSegmentTest > testReadBeforeFirstOffset PASSED

kafka.log.LogSegmentTest > testCreateWithInitFileSizeAppendMessage PASSED

kafka.log.LogSegmentTest > testChangeFileSuffixes PASSED

kafka.log.LogSegmentTest > testMaxOffset PASSED

kafka.log.LogSegmentTest > testNextOffsetCalculation PASSED

kafka.log.LogSegmentTest > testReadOnEmptySegment PASSED

kafka.log.LogSegmentTest > testReadAfterLast PASSED

kafka.log.LogSegmentTest > testCreateWithInitFileSizeClearShutdown PASSED

kafka.log.LogSegmentTest > testTruncateFull PASSED

kafka.log.CleanerTest > testBuildOffsetMap PASSED

kafka.log.CleanerTest > testSegmentGrouping PASSED

kafka.log.CleanerTest > testCleanSegmentsWithAbort PASSED

kafka.log.CleanerTest > testSegmentGroupingWithSparseOffsets PASSED

kafka.log.CleanerTest > testRecoveryAfterCrash PASSED

kafka.log.CleanerTest > testLogToClean PASSED

kafka.log.CleanerTest > testCleaningWithDeletes PASSED

kafka.log.CleanerTest > testCleanSegments PASSED

kafka.log.CleanerTest > testCleaningWithUnkeyedMessages PASSED

kafka.log.OffsetMapTest > testClear PASSED

kafka.log.OffsetMapTest > testBasicValidation PASSED

kafka.coordinator.GroupCoordinatorResponseTest > testHeartbeatWrongCoordinator PASSED

kafka.coordinator.GroupCoordinatorResponseTest > testDescribeGroupStable PASSED

kafka.coordinator.GroupCoordinatorResponseTest > testHeartbeatIllegalGeneration PASSED

kafka.coordinator.GroupCoordinatorResponseTest > testDescribeGroupWrongCoordinator PASSED

kafka.coordinator.GroupCoordinatorResponseTest > testDescribeGroupRebalancing PASSED

kafka.coordinator.GroupCoordinatorResponseTest > testLeaderFailureInSyncGroup PASSED

kafka.coordinator.GroupCoordinatorResponseTest > testGenerationIdIncrementsOnRebalance PASSED

kafka.coordinator.GroupCoordinatorResponseTest > testSyncGroupFromIllegalGeneration PASSED

kafka.coordinator.GroupCoordinatorResponseTest > testInvalidGroupId PASSED

kafka.coordinator.GroupCoordinatorResponseTest > testHeartbeatUnknownGroup PASSED

kafka.coordinator.GroupCoordinatorResponseTest > testListGroupsIncludesStableGroups PASSED

kafka.coordinator.GroupCoordinatorResponseTest > testHeartbeatDuringRebalanceCausesRebalanceInProgress PASSED

kafka.coordinator.GroupCoordinatorResponseTest > testJoinGroupInconsistentGroupProtocol PASSED

kafka.coordinator.GroupCoordinatorResponseTest > testJoinGroupSessionTimeoutTooLarge PASSED

kafka.coordinator.GroupCoordinatorResponseTest > testJoinGroupSessionTimeoutTooSmall PASSED

kafka.coordinator.GroupCoordinatorResponseTest > testSyncGroupEmptyAssignment PASSED

kafka.coordinator.GroupCoordinatorResponseTest > testCommitOffsetWithDefaultGeneration PASSED

kafka.coordinator.GroupCoordinatorResponseTest > testJoinGroupFromUnchangedLeaderShouldRebalance PASSED

kafka.coordinator.GroupCoordinatorResponseTest > testHeartbeatRebalanceInProgress PASSED

kafka.coordinator.GroupCoordinatorResponseTest > testLeaveGroupUnknownGroup PASSED

kafka.coordinator.GroupCoordinatorResponseTest > testListGroupsIncludesRebalancingGroups PASSED

kafka.coordinator.GroupCoordinatorResponseTest > testSyncGroupFollowerAfterLeader PASSED

kafka.coordinator.GroupCoordinatorResponseTest > testCommitOffsetInAwaitingSync PASSED

kafka.coordinator.GroupCoordinatorResponseTest > testJoinGroupWrongCoordinator PASSED

kafka.coordinator.GroupCoordinatorResponseTest > testJoinGroupUnknownConsumerExistingGroup PASSED

kafka.coordinator.GroupCoordinatorResponseTest > testSyncGroupFromUnknownGroup PASSED

kafka.coordinator.GroupCoordinatorResponseTest > testJoinGroupInconsistentProtocolType PASSED

kafka.coordinator.GroupCoordinatorResponseTest > testCommitOffsetFromUnknownGroup PASSED

kafka.coordinator.GroupCoordinatorResponseTest > testLeaveGroupWrongCoordinator PASSED

kafka.coordinator.GroupCoordinatorResponseTest > testLeaveGroupUnknownConsumerExistingGroup PASSED

kafka.coordinator.GroupCoordinatorResponseTest > testJoinGroupUnknownConsumerNewGroup PASSED

kafka.coordinator.GroupCoordinatorResponseTest > testJoinGroupFromUnchangedFollowerDoesNotRebalance PASSED

kafka.coordinator.GroupCoordinatorResponseTest > testValidJoinGroup PASSED

kafka.coordinator.GroupCoordinatorResponseTest > testSyncGroupLeaderAfterFollower PASSED

kafka.coordinator.GroupCoordinatorResponseTest > testSyncGroupFromUnknownMember PASSED

kafka.coordinator.GroupCoordinatorResponseTest > testValidLeaveGroup PASSED

kafka.coordinator.GroupCoordinatorResponseTest > testDescribeGroupInactiveGroup PASSED

kafka.coordinator.GroupCoordinatorResponseTest > testSyncGroupNotCoordinator PASSED

kafka.coordinator.GroupCoordinatorResponseTest > testHeartbeatUnknownConsumerExistingGroup PASSED

kafka.coordinator.GroupCoordinatorResponseTest > testValidHeartbeat PASSED

kafka.coordinator.MemberMetadataTest > testMatchesSupportedProtocols PASSED

kafka.coordinator.MemberMetadataTest > testMetadata PASSED

kafka.coordinator.MemberMetadataTest > testMetadataRaisesOnUnsupportedProtocol PASSED

kafka.coordinator.MemberMetadataTest > testVoteForPreferredProtocol PASSED

kafka.coordinator.MemberMetadataTest > testVoteRaisesOnNoSupportedProtocols PASSED

kafka.coordinator.GroupMetadataTest > testDeadToAwaitingSyncIllegalTransition PASSED

kafka.coordinator.GroupMetadataTest > testPreparingRebalanceToStableIllegalTransition PASSED

kafka.coordinator.GroupMetadataTest > testCannotRebalanceWhenDead PASSED

kafka.coordinator.GroupMetadataTest > testSelectProtocol PASSED

kafka.coordinator.GroupMetadataTest > testCannotRebalanceWhenPreparingRebalance PASSED

kafka.coordinator.GroupMetadataTest > testDeadToPreparingRebalanceIllegalTransition PASSED

kafka.coordinator.GroupMetadataTest > testCanRebalanceWhenAwaitingSync PASSED

kafka.coordinator.GroupMetadataTest > testAwaitingSyncToPreparingRebalanceTransition PASSED

kafka.coordinator.GroupMetadataTest > testStableToAwaitingSyncIllegalTransition PASSED

kafka.coordinator.GroupMetadataTest > testDeadToDeadIllegalTransition PASSED

kafka.coordinator.GroupMetadataTest > testSelectProtocolRaisesIfNoMembers PASSED

kafka.coordinator.GroupMetadataTest > testStableToPreparingRebalanceTransition PASSED

kafka.coordinator.GroupMetadataTest > testPreparingRebalanceToDeadTransition PASSED

kafka.coordinator.GroupMetadataTest > testStableToStableIllegalTransition PASSED

kafka.coordinator.GroupMetadataTest > testAwaitingSyncToStableTransition PASSED

kafka.coordinator.GroupMetadataTest > testDeadToStableIllegalTransition PASSED

kafka.coordinator.GroupMetadataTest > testAwaitingSyncToAwaitingSyncIllegalTransition PASSED

kafka.coordinator.GroupMetadataTest > testSupportsProtocols PASSED

kafka.coordinator.GroupMetadataTest > testCanRebalanceWhenStable PASSED

kafka.coordinator.GroupMetadataTest > testPreparingRebalanceToPreparingRebalanceIllegalTransition PASSED

kafka.coordinator.GroupMetadataTest > testSelectProtocolChoosesCompatibleProtocol PASSED

kafka.javaapi.message.ByteBufferMessageSetTest > testSizeInBytesWithCompression PASSED

kafka.javaapi.message.ByteBufferMessageSetTest > testIteratorIsConsistentWithCompression PASSED

kafka.javaapi.message.ByteBufferMessageSetTest > testIteratorIsConsistent PASSED

kafka.javaapi.message.ByteBufferMessageSetTest > testEqualsWithCompression PASSED

kafka.javaapi.message.ByteBufferMessageSetTest > testWrittenEqualsRead PASSED

kafka.javaapi.message.ByteBufferMessageSetTest > testEquals PASSED

kafka.javaapi.message.ByteBufferMessageSetTest > testSizeInBytes PASSED

kafka.javaapi.consumer.ZookeeperConsumerConnectorTest > testBasic PASSED

kafka.controller.ControllerFailoverTest > testMetadataUpdate PASSED

635 tests completed, 1 failed
:kafka-trunk-jdk7:core:test FAILED
:test_core_2_10_5 FAILED

FAILURE: Build failed with an exception.

* What went wrong:
Execution failed for task ':core:test'.
> There were failing tests. See the report at: file://<https://builds.apache.org/job/kafka-trunk-jdk7/ws/core/build/reports/tests/index.html>

* Try:
Run with --stacktrace option to get the stack trace. Run with --info or --debug option to get more log output.

BUILD FAILED

Total time: 43 mins 53.538 secs
Build step 'Execute shell' marked build as failure
Recording test results
Setting GRADLE_2_4_RC_2_HOME=/home/jenkins/jenkins-slave/tools/hudson.plugins.gradle.GradleInstallation/Gradle_2.4-rc-2
Setting JDK_1_7U51_HOME=/home/jenkins/jenkins-slave/tools/hudson.model.JDK/jdk-1.7u51
Setting GRADLE_2_4_RC_2_HOME=/home/jenkins/jenkins-slave/tools/hudson.plugins.gradle.GradleInstallation/Gradle_2.4-rc-2
Setting JDK_1_7U51_HOME=/home/jenkins/jenkins-slave/tools/hudson.model.JDK/jdk-1.7u51