You are viewing a plain text version of this content. The canonical link for it is here.
Posted to notifications@directory.apache.org by Apache Jenkins Server <je...@builds.apache.org> on 2018/06/11 12:39:27 UTC

Build failed in Jenkins: dir-apacheds-ubuntu-deploy #2083

See <https://builds.apache.org/job/dir-apacheds-ubuntu-deploy/2083/display/redirect>

------------------------------------------
[...truncated 427.30 KB...]
[ERROR] location: class org.apache.directory.api.i18n.I18n
[ERROR] <https://builds.apache.org/job/dir-apacheds-ubuntu-deploy/ws/kerberos-codec/src/main/java/org/apache/directory/shared/kerberos/codec/encKrbPrivPart/actions/EncKrbPrivPartInit.java>:[69,55] cannot find symbol
[ERROR] symbol:   variable ERR_04067
[ERROR] location: class org.apache.directory.api.i18n.I18n
[ERROR] <https://builds.apache.org/job/dir-apacheds-ubuntu-deploy/ws/kerberos-codec/src/main/java/org/apache/directory/shared/kerberos/codec/asReq/actions/StoreKdcReq.java>:[69,38] cannot find symbol
[ERROR] symbol:   variable ERR_04066
[ERROR] location: class org.apache.directory.api.i18n.I18n
[ERROR] <https://builds.apache.org/job/dir-apacheds-ubuntu-deploy/ws/kerberos-codec/src/main/java/org/apache/directory/shared/kerberos/codec/asReq/actions/StoreKdcReq.java>:[72,55] cannot find symbol
[ERROR] symbol:   variable ERR_04067
[ERROR] location: class org.apache.directory.api.i18n.I18n
[ERROR] <https://builds.apache.org/job/dir-apacheds-ubuntu-deploy/ws/kerberos-codec/src/main/java/org/apache/directory/shared/kerberos/codec/encTgsRepPart/actions/StoreEncTgsRepPart.java>:[68,38] cannot find symbol
[ERROR] symbol:   variable ERR_04066
[ERROR] location: class org.apache.directory.api.i18n.I18n
[ERROR] <https://builds.apache.org/job/dir-apacheds-ubuntu-deploy/ws/kerberos-codec/src/main/java/org/apache/directory/shared/kerberos/codec/encTgsRepPart/actions/StoreEncTgsRepPart.java>:[71,55] cannot find symbol
[ERROR] symbol:   variable ERR_04067
[ERROR] location: class org.apache.directory.api.i18n.I18n
[ERROR] <https://builds.apache.org/job/dir-apacheds-ubuntu-deploy/ws/kerberos-codec/src/main/java/org/apache/directory/shared/kerberos/codec/actions/AbstractReadMsgType.java>:[82,38] cannot find symbol
[ERROR] symbol:   variable ERR_04066
[ERROR] location: class org.apache.directory.api.i18n.I18n
[ERROR] <https://builds.apache.org/job/dir-apacheds-ubuntu-deploy/ws/kerberos-codec/src/main/java/org/apache/directory/shared/kerberos/codec/actions/AbstractReadMsgType.java>:[85,55] cannot find symbol
[ERROR] symbol:   variable ERR_04067
[ERROR] location: class org.apache.directory.api.i18n.I18n
[ERROR] <https://builds.apache.org/job/dir-apacheds-ubuntu-deploy/ws/kerberos-codec/src/main/java/org/apache/directory/shared/kerberos/codec/kdcReqBody/actions/AddEType.java>:[71,38] cannot find symbol
[ERROR] symbol:   variable ERR_04066
[ERROR] location: class org.apache.directory.api.i18n.I18n
[ERROR] <https://builds.apache.org/job/dir-apacheds-ubuntu-deploy/ws/kerberos-codec/src/main/java/org/apache/directory/shared/kerberos/codec/kdcReqBody/actions/AddEType.java>:[74,55] cannot find symbol
[ERROR] symbol:   variable ERR_04067
[ERROR] location: class org.apache.directory.api.i18n.I18n
[ERROR] <https://builds.apache.org/job/dir-apacheds-ubuntu-deploy/ws/kerberos-codec/src/main/java/org/apache/directory/shared/kerberos/codec/actions/AbstractReadHostAddresses.java>:[77,38] cannot find symbol
[ERROR] symbol:   variable ERR_04066
[ERROR] location: class org.apache.directory.api.i18n.I18n
[ERROR] <https://builds.apache.org/job/dir-apacheds-ubuntu-deploy/ws/kerberos-codec/src/main/java/org/apache/directory/shared/kerberos/codec/actions/AbstractReadHostAddresses.java>:[80,55] cannot find symbol
[ERROR] symbol:   variable ERR_04067
[ERROR] location: class org.apache.directory.api.i18n.I18n
[ERROR] <https://builds.apache.org/job/dir-apacheds-ubuntu-deploy/ws/kerberos-codec/src/main/java/org/apache/directory/shared/kerberos/codec/lastReq/actions/LastReqInit.java>:[66,38] cannot find symbol
[ERROR] symbol:   variable ERR_04066
[ERROR] location: class org.apache.directory.api.i18n.I18n
[ERROR] <https://builds.apache.org/job/dir-apacheds-ubuntu-deploy/ws/kerberos-codec/src/main/java/org/apache/directory/shared/kerberos/codec/lastReq/actions/LastReqInit.java>:[69,55] cannot find symbol
[ERROR] symbol:   variable ERR_04067
[ERROR] location: class org.apache.directory.api.i18n.I18n
[ERROR] <https://builds.apache.org/job/dir-apacheds-ubuntu-deploy/ws/kerberos-codec/src/main/java/org/apache/directory/shared/kerberos/codec/encApRepPart/actions/EncApRepPartInit.java>:[66,38] cannot find symbol
[ERROR] symbol:   variable ERR_04066
[ERROR] location: class org.apache.directory.api.i18n.I18n
[ERROR] <https://builds.apache.org/job/dir-apacheds-ubuntu-deploy/ws/kerberos-codec/src/main/java/org/apache/directory/shared/kerberos/codec/encApRepPart/actions/EncApRepPartInit.java>:[69,55] cannot find symbol
[ERROR] symbol:   variable ERR_04067
[ERROR] location: class org.apache.directory.api.i18n.I18n
[ERROR] <https://builds.apache.org/job/dir-apacheds-ubuntu-deploy/ws/kerberos-codec/src/main/java/org/apache/directory/shared/kerberos/codec/actions/AbstractReadEncryptionKey.java>:[77,38] cannot find symbol
[ERROR] symbol:   variable ERR_04066
[ERROR] location: class org.apache.directory.api.i18n.I18n
[ERROR] <https://builds.apache.org/job/dir-apacheds-ubuntu-deploy/ws/kerberos-codec/src/main/java/org/apache/directory/shared/kerberos/codec/actions/AbstractReadEncryptionKey.java>:[80,55] cannot find symbol
[ERROR] symbol:   variable ERR_04067
[ERROR] location: class org.apache.directory.api.i18n.I18n
[ERROR] <https://builds.apache.org/job/dir-apacheds-ubuntu-deploy/ws/kerberos-codec/src/main/java/org/apache/directory/shared/kerberos/codec/actions/AbstractReadPvno.java>:[80,38] cannot find symbol
[ERROR] symbol:   variable ERR_04066
[ERROR] location: class org.apache.directory.api.i18n.I18n
[ERROR] <https://builds.apache.org/job/dir-apacheds-ubuntu-deploy/ws/kerberos-codec/src/main/java/org/apache/directory/shared/kerberos/codec/actions/AbstractReadPvno.java>:[83,55] cannot find symbol
[ERROR] symbol:   variable ERR_04067
[ERROR] location: class org.apache.directory.api.i18n.I18n
[ERROR] <https://builds.apache.org/job/dir-apacheds-ubuntu-deploy/ws/kerberos-codec/src/main/java/org/apache/directory/shared/kerberos/codec/checksum/actions/StoreCksumType.java>:[72,38] cannot find symbol
[ERROR] symbol:   variable ERR_04066
[ERROR] location: class org.apache.directory.api.i18n.I18n
[ERROR] <https://builds.apache.org/job/dir-apacheds-ubuntu-deploy/ws/kerberos-codec/src/main/java/org/apache/directory/shared/kerberos/codec/checksum/actions/StoreCksumType.java>:[75,55] cannot find symbol
[ERROR] symbol:   variable ERR_04067
[ERROR] location: class org.apache.directory.api.i18n.I18n
[ERROR] <https://builds.apache.org/job/dir-apacheds-ubuntu-deploy/ws/kerberos-codec/src/main/java/org/apache/directory/shared/kerberos/codec/krbSafe/actions/KrbSafeInit.java>:[66,38] cannot find symbol
[ERROR] symbol:   variable ERR_04066
[ERROR] location: class org.apache.directory.api.i18n.I18n
[ERROR] <https://builds.apache.org/job/dir-apacheds-ubuntu-deploy/ws/kerberos-codec/src/main/java/org/apache/directory/shared/kerberos/codec/krbSafe/actions/KrbSafeInit.java>:[69,55] cannot find symbol
[ERROR] symbol:   variable ERR_04067
[ERROR] location: class org.apache.directory.api.i18n.I18n
[ERROR] <https://builds.apache.org/job/dir-apacheds-ubuntu-deploy/ws/kerberos-codec/src/main/java/org/apache/directory/shared/kerberos/codec/etypeInfoEntry/actions/ETypeInfoEntryInit.java>:[66,38] cannot find symbol
[ERROR] symbol:   variable ERR_04066
[ERROR] location: class org.apache.directory.api.i18n.I18n
[ERROR] <https://builds.apache.org/job/dir-apacheds-ubuntu-deploy/ws/kerberos-codec/src/main/java/org/apache/directory/shared/kerberos/codec/etypeInfoEntry/actions/ETypeInfoEntryInit.java>:[69,55] cannot find symbol
[ERROR] symbol:   variable ERR_04067
[ERROR] location: class org.apache.directory.api.i18n.I18n
[ERROR] <https://builds.apache.org/job/dir-apacheds-ubuntu-deploy/ws/kerberos-codec/src/main/java/org/apache/directory/shared/kerberos/codec/actions/AbstractReadAuthorizationData.java>:[77,38] cannot find symbol
[ERROR] symbol:   variable ERR_04066
[ERROR] location: class org.apache.directory.api.i18n.I18n
[ERROR] <https://builds.apache.org/job/dir-apacheds-ubuntu-deploy/ws/kerberos-codec/src/main/java/org/apache/directory/shared/kerberos/codec/actions/AbstractReadAuthorizationData.java>:[80,55] cannot find symbol
[ERROR] symbol:   variable ERR_04067
[ERROR] location: class org.apache.directory.api.i18n.I18n
[ERROR] <https://builds.apache.org/job/dir-apacheds-ubuntu-deploy/ws/kerberos-codec/src/main/java/org/apache/directory/shared/kerberos/codec/paEncTsEnc/actions/PaEncTsEncInit.java>:[66,38] cannot find symbol
[ERROR] symbol:   variable ERR_04066
[ERROR] location: class org.apache.directory.api.i18n.I18n
[ERROR] <https://builds.apache.org/job/dir-apacheds-ubuntu-deploy/ws/kerberos-codec/src/main/java/org/apache/directory/shared/kerberos/codec/paEncTsEnc/actions/PaEncTsEncInit.java>:[69,55] cannot find symbol
[ERROR] symbol:   variable ERR_04067
[ERROR] location: class org.apache.directory.api.i18n.I18n
[ERROR] <https://builds.apache.org/job/dir-apacheds-ubuntu-deploy/ws/kerberos-codec/src/main/java/org/apache/directory/shared/kerberos/codec/asRep/actions/StoreKdcRep.java>:[69,38] cannot find symbol
[ERROR] symbol:   variable ERR_04066
[ERROR] location: class org.apache.directory.api.i18n.I18n
[ERROR] <https://builds.apache.org/job/dir-apacheds-ubuntu-deploy/ws/kerberos-codec/src/main/java/org/apache/directory/shared/kerberos/codec/asRep/actions/StoreKdcRep.java>:[72,55] cannot find symbol
[ERROR] symbol:   variable ERR_04067
[ERROR] location: class org.apache.directory.api.i18n.I18n
[ERROR] <https://builds.apache.org/job/dir-apacheds-ubuntu-deploy/ws/kerberos-codec/src/main/java/org/apache/directory/shared/kerberos/codec/kdcReqBody/actions/KdcReqBodyInit.java>:[66,38] cannot find symbol
[ERROR] symbol:   variable ERR_04066
[ERROR] location: class org.apache.directory.api.i18n.I18n
[ERROR] <https://builds.apache.org/job/dir-apacheds-ubuntu-deploy/ws/kerberos-codec/src/main/java/org/apache/directory/shared/kerberos/codec/kdcReqBody/actions/KdcReqBodyInit.java>:[69,55] cannot find symbol
[ERROR] symbol:   variable ERR_04067
[ERROR] location: class org.apache.directory.api.i18n.I18n
[ERROR] <https://builds.apache.org/job/dir-apacheds-ubuntu-deploy/ws/kerberos-codec/src/main/java/org/apache/directory/shared/kerberos/codec/encTicketPart/actions/StoreTransited.java>:[69,38] cannot find symbol
[ERROR] symbol:   variable ERR_04066
[ERROR] location: class org.apache.directory.api.i18n.I18n
[ERROR] <https://builds.apache.org/job/dir-apacheds-ubuntu-deploy/ws/kerberos-codec/src/main/java/org/apache/directory/shared/kerberos/codec/encTicketPart/actions/StoreTransited.java>:[72,55] cannot find symbol
[ERROR] symbol:   variable ERR_04067
[ERROR] location: class org.apache.directory.api.i18n.I18n
[ERROR] <https://builds.apache.org/job/dir-apacheds-ubuntu-deploy/ws/kerberos-codec/src/main/java/org/apache/directory/shared/kerberos/codec/actions/AbstractReadRealm.java>:[76,38] cannot find symbol
[ERROR] symbol:   variable ERR_04066
[ERROR] location: class org.apache.directory.api.i18n.I18n
[ERROR] <https://builds.apache.org/job/dir-apacheds-ubuntu-deploy/ws/kerberos-codec/src/main/java/org/apache/directory/shared/kerberos/codec/actions/AbstractReadRealm.java>:[79,55] cannot find symbol
[ERROR] symbol:   variable ERR_04067
[ERROR] location: class org.apache.directory.api.i18n.I18n
[ERROR] <https://builds.apache.org/job/dir-apacheds-ubuntu-deploy/ws/kerberos-codec/src/main/java/org/apache/directory/shared/kerberos/codec/apRep/actions/ApRepInit.java>:[63,38] cannot find symbol
[ERROR] symbol:   variable ERR_04066
[ERROR] location: class org.apache.directory.api.i18n.I18n
[ERROR] <https://builds.apache.org/job/dir-apacheds-ubuntu-deploy/ws/kerberos-codec/src/main/java/org/apache/directory/shared/kerberos/codec/apRep/actions/ApRepInit.java>:[66,55] cannot find symbol
[ERROR] symbol:   variable ERR_04067
[ERROR] location: class org.apache.directory.api.i18n.I18n
[ERROR] <https://builds.apache.org/job/dir-apacheds-ubuntu-deploy/ws/kerberos-codec/src/main/java/org/apache/directory/shared/kerberos/codec/krbCred/actions/StoreTickets.java>:[60,38] cannot find symbol
[ERROR] symbol:   variable ERR_04066
[ERROR] location: class org.apache.directory.api.i18n.I18n
[ERROR] <https://builds.apache.org/job/dir-apacheds-ubuntu-deploy/ws/kerberos-codec/src/main/java/org/apache/directory/shared/kerberos/codec/krbCred/actions/StoreTickets.java>:[63,55] cannot find symbol
[ERROR] symbol:   variable ERR_04067
[ERROR] location: class org.apache.directory.api.i18n.I18n
[ERROR] <https://builds.apache.org/job/dir-apacheds-ubuntu-deploy/ws/kerberos-codec/src/main/java/org/apache/directory/shared/kerberos/codec/kdcRep/actions/StoreTicket.java>:[69,38] cannot find symbol
[ERROR] symbol:   variable ERR_04066
[ERROR] location: class org.apache.directory.api.i18n.I18n
[ERROR] <https://builds.apache.org/job/dir-apacheds-ubuntu-deploy/ws/kerberos-codec/src/main/java/org/apache/directory/shared/kerberos/codec/kdcRep/actions/StoreTicket.java>:[72,55] cannot find symbol
[ERROR] symbol:   variable ERR_04067
[ERROR] location: class org.apache.directory.api.i18n.I18n
[ERROR] <https://builds.apache.org/job/dir-apacheds-ubuntu-deploy/ws/kerberos-codec/src/main/java/org/apache/directory/shared/kerberos/codec/EncKdcRepPart/actions/EncKdcRepPartInit.java>:[66,38] cannot find symbol
[ERROR] symbol:   variable ERR_04066
[ERROR] location: class org.apache.directory.api.i18n.I18n
[ERROR] <https://builds.apache.org/job/dir-apacheds-ubuntu-deploy/ws/kerberos-codec/src/main/java/org/apache/directory/shared/kerberos/codec/EncKdcRepPart/actions/EncKdcRepPartInit.java>:[69,55] cannot find symbol
[ERROR] symbol:   variable ERR_04067
[ERROR] location: class org.apache.directory.api.i18n.I18n
[ERROR] <https://builds.apache.org/job/dir-apacheds-ubuntu-deploy/ws/kerberos-codec/src/main/java/org/apache/directory/shared/kerberos/codec/apReq/actions/ApReqInit.java>:[63,38] cannot find symbol
[ERROR] symbol:   variable ERR_04066
[ERROR] location: class org.apache.directory.api.i18n.I18n
[ERROR] <https://builds.apache.org/job/dir-apacheds-ubuntu-deploy/ws/kerberos-codec/src/main/java/org/apache/directory/shared/kerberos/codec/apReq/actions/ApReqInit.java>:[66,55] cannot find symbol
[ERROR] symbol:   variable ERR_04067
[ERROR] location: class org.apache.directory.api.i18n.I18n
[ERROR] <https://builds.apache.org/job/dir-apacheds-ubuntu-deploy/ws/kerberos-codec/src/main/java/org/apache/directory/shared/kerberos/codec/kdcReqBody/actions/AddTicket.java>:[69,38] cannot find symbol
[ERROR] symbol:   variable ERR_04066
[ERROR] location: class org.apache.directory.api.i18n.I18n
[ERROR] <https://builds.apache.org/job/dir-apacheds-ubuntu-deploy/ws/kerberos-codec/src/main/java/org/apache/directory/shared/kerberos/codec/kdcReqBody/actions/AddTicket.java>:[72,55] cannot find symbol
[ERROR] symbol:   variable ERR_04067
[ERROR] location: class org.apache.directory.api.i18n.I18n
[ERROR] <https://builds.apache.org/job/dir-apacheds-ubuntu-deploy/ws/kerberos-codec/src/main/java/org/apache/directory/shared/kerberos/codec/tgsReq/actions/StoreKdcReq.java>:[69,38] cannot find symbol
[ERROR] symbol:   variable ERR_04066
[ERROR] location: class org.apache.directory.api.i18n.I18n
[ERROR] <https://builds.apache.org/job/dir-apacheds-ubuntu-deploy/ws/kerberos-codec/src/main/java/org/apache/directory/shared/kerberos/codec/tgsReq/actions/StoreKdcReq.java>:[72,55] cannot find symbol
[ERROR] symbol:   variable ERR_04067
[ERROR] location: class org.apache.directory.api.i18n.I18n
[ERROR] <https://builds.apache.org/job/dir-apacheds-ubuntu-deploy/ws/kerberos-codec/src/main/java/org/apache/directory/shared/kerberos/codec/krbPriv/actions/KrbPrivInit.java>:[66,38] cannot find symbol
[ERROR] symbol:   variable ERR_04066
[ERROR] location: class org.apache.directory.api.i18n.I18n
[ERROR] <https://builds.apache.org/job/dir-apacheds-ubuntu-deploy/ws/kerberos-codec/src/main/java/org/apache/directory/shared/kerberos/codec/krbPriv/actions/KrbPrivInit.java>:[69,55] cannot find symbol
[ERROR] symbol:   variable ERR_04067
[ERROR] location: class org.apache.directory.api.i18n.I18n
[ERROR] <https://builds.apache.org/job/dir-apacheds-ubuntu-deploy/ws/kerberos-codec/src/main/java/org/apache/directory/shared/kerberos/codec/etypeInfo2Entry/actions/StoreEType.java>:[71,38] cannot find symbol
[ERROR] symbol:   variable ERR_04066
[ERROR] location: class org.apache.directory.api.i18n.I18n
[ERROR] <https://builds.apache.org/job/dir-apacheds-ubuntu-deploy/ws/kerberos-codec/src/main/java/org/apache/directory/shared/kerberos/codec/etypeInfo2Entry/actions/StoreEType.java>:[74,55] cannot find symbol
[ERROR] symbol:   variable ERR_04067
[ERROR] location: class org.apache.directory.api.i18n.I18n
[ERROR] <https://builds.apache.org/job/dir-apacheds-ubuntu-deploy/ws/kerberos-codec/src/main/java/org/apache/directory/shared/kerberos/codec/krbError/actions/KrbErrorInit.java>:[66,38] cannot find symbol
[ERROR] symbol:   variable ERR_04066
[ERROR] location: class org.apache.directory.api.i18n.I18n
[ERROR] <https://builds.apache.org/job/dir-apacheds-ubuntu-deploy/ws/kerberos-codec/src/main/java/org/apache/directory/shared/kerberos/codec/krbError/actions/KrbErrorInit.java>:[69,55] cannot find symbol
[ERROR] symbol:   variable ERR_04067
[ERROR] location: class org.apache.directory.api.i18n.I18n
[ERROR] <https://builds.apache.org/job/dir-apacheds-ubuntu-deploy/ws/kerberos-codec/src/main/java/org/apache/directory/shared/kerberos/codec/methodData/actions/AddPaData.java>:[68,38] cannot find symbol
[ERROR] symbol:   variable ERR_04066
[ERROR] location: class org.apache.directory.api.i18n.I18n
[ERROR] <https://builds.apache.org/job/dir-apacheds-ubuntu-deploy/ws/kerberos-codec/src/main/java/org/apache/directory/shared/kerberos/codec/methodData/actions/AddPaData.java>:[71,55] cannot find symbol
[ERROR] symbol:   variable ERR_04067
[ERROR] location: class org.apache.directory.api.i18n.I18n
[ERROR] <https://builds.apache.org/job/dir-apacheds-ubuntu-deploy/ws/kerberos-codec/src/main/java/org/apache/directory/shared/kerberos/codec/tgsRep/actions/StoreKdcRep.java>:[69,38] cannot find symbol
[ERROR] symbol:   variable ERR_04066
[ERROR] location: class org.apache.directory.api.i18n.I18n
[ERROR] <https://builds.apache.org/job/dir-apacheds-ubuntu-deploy/ws/kerberos-codec/src/main/java/org/apache/directory/shared/kerberos/codec/tgsRep/actions/StoreKdcRep.java>:[72,55] cannot find symbol
[ERROR] symbol:   variable ERR_04067
[ERROR] location: class org.apache.directory.api.i18n.I18n
[ERROR] <https://builds.apache.org/job/dir-apacheds-ubuntu-deploy/ws/kerberos-codec/src/main/java/org/apache/directory/shared/kerberos/codec/etypeInfo/actions/AddETypeInfoEntry.java>:[68,38] cannot find symbol
[ERROR] symbol:   variable ERR_04066
[ERROR] location: class org.apache.directory.api.i18n.I18n
[ERROR] <https://builds.apache.org/job/dir-apacheds-ubuntu-deploy/ws/kerberos-codec/src/main/java/org/apache/directory/shared/kerberos/codec/etypeInfo/actions/AddETypeInfoEntry.java>:[71,55] cannot find symbol
[ERROR] symbol:   variable ERR_04067
[ERROR] location: class org.apache.directory.api.i18n.I18n
[ERROR] <https://builds.apache.org/job/dir-apacheds-ubuntu-deploy/ws/kerberos-codec/src/main/java/org/apache/directory/shared/kerberos/codec/EncKdcRepPart/actions/StoreLastReq.java>:[68,38] cannot find symbol
[ERROR] symbol:   variable ERR_04066
[ERROR] location: class org.apache.directory.api.i18n.I18n
[ERROR] <https://builds.apache.org/job/dir-apacheds-ubuntu-deploy/ws/kerberos-codec/src/main/java/org/apache/directory/shared/kerberos/codec/EncKdcRepPart/actions/StoreLastReq.java>:[71,55] cannot find symbol
[ERROR] symbol:   variable ERR_04067
[ERROR] location: class org.apache.directory.api.i18n.I18n
[ERROR] <https://builds.apache.org/job/dir-apacheds-ubuntu-deploy/ws/kerberos-codec/src/main/java/org/apache/directory/shared/kerberos/codec/kdcReqBody/actions/StoreTill.java>:[69,38] cannot find symbol
[ERROR] symbol:   variable ERR_04066
[ERROR] location: class org.apache.directory.api.i18n.I18n
[ERROR] <https://builds.apache.org/job/dir-apacheds-ubuntu-deploy/ws/kerberos-codec/src/main/java/org/apache/directory/shared/kerberos/codec/kdcReqBody/actions/StoreTill.java>:[72,55] cannot find symbol
[ERROR] symbol:   variable ERR_04067
[ERROR] location: class org.apache.directory.api.i18n.I18n
[ERROR] <https://builds.apache.org/job/dir-apacheds-ubuntu-deploy/ws/kerberos-codec/src/main/java/org/apache/directory/shared/kerberos/codec/kdcReqBody/actions/StoreTill.java>:[93,38] cannot find symbol
[ERROR] symbol:   variable ERR_04066
[ERROR] location: class org.apache.directory.api.i18n.I18n
[ERROR] <https://builds.apache.org/job/dir-apacheds-ubuntu-deploy/ws/kerberos-codec/src/main/java/org/apache/directory/shared/kerberos/codec/kdcReqBody/actions/StoreTill.java>:[96,55] cannot find symbol
[ERROR] symbol:   variable ERR_04067
[ERROR] location: class org.apache.directory.api.i18n.I18n
[ERROR] <https://builds.apache.org/job/dir-apacheds-ubuntu-deploy/ws/kerberos-codec/src/main/java/org/apache/directory/shared/kerberos/codec/actions/AbstractReadCheckSum.java>:[77,38] cannot find symbol
[ERROR] symbol:   variable ERR_04066
[ERROR] location: class org.apache.directory.api.i18n.I18n
[ERROR] <https://builds.apache.org/job/dir-apacheds-ubuntu-deploy/ws/kerberos-codec/src/main/java/org/apache/directory/shared/kerberos/codec/actions/AbstractReadCheckSum.java>:[80,55] cannot find symbol
[ERROR] symbol:   variable ERR_04067
[ERROR] location: class org.apache.directory.api.i18n.I18n
[ERROR] <https://builds.apache.org/job/dir-apacheds-ubuntu-deploy/ws/kerberos-codec/src/main/java/org/apache/directory/shared/kerberos/codec/padata/actions/StoreDataType.java>:[72,38] cannot find symbol
[ERROR] symbol:   variable ERR_04066
[ERROR] location: class org.apache.directory.api.i18n.I18n
[ERROR] <https://builds.apache.org/job/dir-apacheds-ubuntu-deploy/ws/kerberos-codec/src/main/java/org/apache/directory/shared/kerberos/codec/padata/actions/StoreDataType.java>:[75,55] cannot find symbol
[ERROR] symbol:   variable ERR_04067
[ERROR] location: class org.apache.directory.api.i18n.I18n
[ERROR] <https://builds.apache.org/job/dir-apacheds-ubuntu-deploy/ws/kerberos-codec/src/main/java/org/apache/directory/shared/kerberos/codec/kdcReq/actions/StoreKdcReqBody.java>:[69,38] cannot find symbol
[ERROR] symbol:   variable ERR_04066
[ERROR] location: class org.apache.directory.api.i18n.I18n
[ERROR] <https://builds.apache.org/job/dir-apacheds-ubuntu-deploy/ws/kerberos-codec/src/main/java/org/apache/directory/shared/kerberos/codec/kdcReq/actions/StoreKdcReqBody.java>:[72,55] cannot find symbol
[ERROR] symbol:   variable ERR_04067
[ERROR] location: class org.apache.directory.api.i18n.I18n
[ERROR] <https://builds.apache.org/job/dir-apacheds-ubuntu-deploy/ws/kerberos-codec/src/main/java/org/apache/directory/shared/kerberos/codec/krbCred/actions/KrbCredInit.java>:[66,38] cannot find symbol
[ERROR] symbol:   variable ERR_04066
[ERROR] location: class org.apache.directory.api.i18n.I18n
[ERROR] <https://builds.apache.org/job/dir-apacheds-ubuntu-deploy/ws/kerberos-codec/src/main/java/org/apache/directory/shared/kerberos/codec/krbCred/actions/KrbCredInit.java>:[69,55] cannot find symbol
[ERROR] symbol:   variable ERR_04067
[ERROR] location: class org.apache.directory.api.i18n.I18n
[ERROR] <https://builds.apache.org/job/dir-apacheds-ubuntu-deploy/ws/kerberos-codec/src/main/java/org/apache/directory/shared/kerberos/codec/adAndOr/actions/AdAndOrInit.java>:[66,38] cannot find symbol
[ERROR] symbol:   variable ERR_04066
[ERROR] location: class org.apache.directory.api.i18n.I18n
[ERROR] <https://builds.apache.org/job/dir-apacheds-ubuntu-deploy/ws/kerberos-codec/src/main/java/org/apache/directory/shared/kerberos/codec/adAndOr/actions/AdAndOrInit.java>:[69,55] cannot find symbol
[ERROR] symbol:   variable ERR_04067
[ERROR] location: class org.apache.directory.api.i18n.I18n
[ERROR] -> [Help 1]
[ERROR] 
[ERROR] To see the full stack trace of the errors, re-run Maven with the -e switch.
[ERROR] Re-run Maven using the -X switch to enable full debug logging.
[ERROR] 
[ERROR] For more information about the errors and possible solutions, please read the following articles:
[ERROR] [Help 1] http://cwiki.apache.org/confluence/display/MAVEN/MojoFailureException
[ERROR] 
[ERROR] After correcting the problems, you can resume the build with the command
[ERROR]   mvn <goals> -rf :apacheds-kerberos-codec
channel stopped

Jenkins build is back to stable : dir-apacheds-ubuntu-deploy #2088

Posted by Apache Jenkins Server <je...@builds.apache.org>.
See <https://builds.apache.org/job/dir-apacheds-ubuntu-deploy/2088/display/redirect>


Jenkins build is still unstable: dir-apacheds-ubuntu-deploy #2087

Posted by Apache Jenkins Server <je...@builds.apache.org>.
See <https://builds.apache.org/job/dir-apacheds-ubuntu-deploy/2087/display/redirect>


Jenkins build is still unstable: dir-apacheds-ubuntu-deploy #2086

Posted by Apache Jenkins Server <je...@builds.apache.org>.
See <https://builds.apache.org/job/dir-apacheds-ubuntu-deploy/2086/display/redirect?page=changes>


Jenkins build is unstable: dir-apacheds-ubuntu-deploy #2085

Posted by Apache Jenkins Server <je...@builds.apache.org>.
See <https://builds.apache.org/job/dir-apacheds-ubuntu-deploy/2085/display/redirect?page=changes>


Build failed in Jenkins: dir-apacheds-ubuntu-deploy #2084

Posted by Apache Jenkins Server <je...@builds.apache.org>.
See <https://builds.apache.org/job/dir-apacheds-ubuntu-deploy/2084/display/redirect?page=changes>

Changes:

[elecharny] un-ignoring some tests

------------------------------------------
[...truncated 456.16 KB...]
[ERROR] location: class org.apache.directory.api.i18n.I18n
[ERROR] <https://builds.apache.org/job/dir-apacheds-ubuntu-deploy/ws/kerberos-codec/src/main/java/org/apache/directory/shared/kerberos/codec/encKrbPrivPart/actions/EncKrbPrivPartInit.java>:[69,55] cannot find symbol
[ERROR] symbol:   variable ERR_04067
[ERROR] location: class org.apache.directory.api.i18n.I18n
[ERROR] <https://builds.apache.org/job/dir-apacheds-ubuntu-deploy/ws/kerberos-codec/src/main/java/org/apache/directory/shared/kerberos/codec/asReq/actions/StoreKdcReq.java>:[69,38] cannot find symbol
[ERROR] symbol:   variable ERR_04066
[ERROR] location: class org.apache.directory.api.i18n.I18n
[ERROR] <https://builds.apache.org/job/dir-apacheds-ubuntu-deploy/ws/kerberos-codec/src/main/java/org/apache/directory/shared/kerberos/codec/asReq/actions/StoreKdcReq.java>:[72,55] cannot find symbol
[ERROR] symbol:   variable ERR_04067
[ERROR] location: class org.apache.directory.api.i18n.I18n
[ERROR] <https://builds.apache.org/job/dir-apacheds-ubuntu-deploy/ws/kerberos-codec/src/main/java/org/apache/directory/shared/kerberos/codec/encTgsRepPart/actions/StoreEncTgsRepPart.java>:[68,38] cannot find symbol
[ERROR] symbol:   variable ERR_04066
[ERROR] location: class org.apache.directory.api.i18n.I18n
[ERROR] <https://builds.apache.org/job/dir-apacheds-ubuntu-deploy/ws/kerberos-codec/src/main/java/org/apache/directory/shared/kerberos/codec/encTgsRepPart/actions/StoreEncTgsRepPart.java>:[71,55] cannot find symbol
[ERROR] symbol:   variable ERR_04067
[ERROR] location: class org.apache.directory.api.i18n.I18n
[ERROR] <https://builds.apache.org/job/dir-apacheds-ubuntu-deploy/ws/kerberos-codec/src/main/java/org/apache/directory/shared/kerberos/codec/actions/AbstractReadMsgType.java>:[82,38] cannot find symbol
[ERROR] symbol:   variable ERR_04066
[ERROR] location: class org.apache.directory.api.i18n.I18n
[ERROR] <https://builds.apache.org/job/dir-apacheds-ubuntu-deploy/ws/kerberos-codec/src/main/java/org/apache/directory/shared/kerberos/codec/actions/AbstractReadMsgType.java>:[85,55] cannot find symbol
[ERROR] symbol:   variable ERR_04067
[ERROR] location: class org.apache.directory.api.i18n.I18n
[ERROR] <https://builds.apache.org/job/dir-apacheds-ubuntu-deploy/ws/kerberos-codec/src/main/java/org/apache/directory/shared/kerberos/codec/kdcReqBody/actions/AddEType.java>:[71,38] cannot find symbol
[ERROR] symbol:   variable ERR_04066
[ERROR] location: class org.apache.directory.api.i18n.I18n
[ERROR] <https://builds.apache.org/job/dir-apacheds-ubuntu-deploy/ws/kerberos-codec/src/main/java/org/apache/directory/shared/kerberos/codec/kdcReqBody/actions/AddEType.java>:[74,55] cannot find symbol
[ERROR] symbol:   variable ERR_04067
[ERROR] location: class org.apache.directory.api.i18n.I18n
[ERROR] <https://builds.apache.org/job/dir-apacheds-ubuntu-deploy/ws/kerberos-codec/src/main/java/org/apache/directory/shared/kerberos/codec/actions/AbstractReadHostAddresses.java>:[77,38] cannot find symbol
[ERROR] symbol:   variable ERR_04066
[ERROR] location: class org.apache.directory.api.i18n.I18n
[ERROR] <https://builds.apache.org/job/dir-apacheds-ubuntu-deploy/ws/kerberos-codec/src/main/java/org/apache/directory/shared/kerberos/codec/actions/AbstractReadHostAddresses.java>:[80,55] cannot find symbol
[ERROR] symbol:   variable ERR_04067
[ERROR] location: class org.apache.directory.api.i18n.I18n
[ERROR] <https://builds.apache.org/job/dir-apacheds-ubuntu-deploy/ws/kerberos-codec/src/main/java/org/apache/directory/shared/kerberos/codec/lastReq/actions/LastReqInit.java>:[66,38] cannot find symbol
[ERROR] symbol:   variable ERR_04066
[ERROR] location: class org.apache.directory.api.i18n.I18n
[ERROR] <https://builds.apache.org/job/dir-apacheds-ubuntu-deploy/ws/kerberos-codec/src/main/java/org/apache/directory/shared/kerberos/codec/lastReq/actions/LastReqInit.java>:[69,55] cannot find symbol
[ERROR] symbol:   variable ERR_04067
[ERROR] location: class org.apache.directory.api.i18n.I18n
[ERROR] <https://builds.apache.org/job/dir-apacheds-ubuntu-deploy/ws/kerberos-codec/src/main/java/org/apache/directory/shared/kerberos/codec/encApRepPart/actions/EncApRepPartInit.java>:[66,38] cannot find symbol
[ERROR] symbol:   variable ERR_04066
[ERROR] location: class org.apache.directory.api.i18n.I18n
[ERROR] <https://builds.apache.org/job/dir-apacheds-ubuntu-deploy/ws/kerberos-codec/src/main/java/org/apache/directory/shared/kerberos/codec/encApRepPart/actions/EncApRepPartInit.java>:[69,55] cannot find symbol
[ERROR] symbol:   variable ERR_04067
[ERROR] location: class org.apache.directory.api.i18n.I18n
[ERROR] <https://builds.apache.org/job/dir-apacheds-ubuntu-deploy/ws/kerberos-codec/src/main/java/org/apache/directory/shared/kerberos/codec/actions/AbstractReadEncryptionKey.java>:[77,38] cannot find symbol
[ERROR] symbol:   variable ERR_04066
[ERROR] location: class org.apache.directory.api.i18n.I18n
[ERROR] <https://builds.apache.org/job/dir-apacheds-ubuntu-deploy/ws/kerberos-codec/src/main/java/org/apache/directory/shared/kerberos/codec/actions/AbstractReadEncryptionKey.java>:[80,55] cannot find symbol
[ERROR] symbol:   variable ERR_04067
[ERROR] location: class org.apache.directory.api.i18n.I18n
[ERROR] <https://builds.apache.org/job/dir-apacheds-ubuntu-deploy/ws/kerberos-codec/src/main/java/org/apache/directory/shared/kerberos/codec/actions/AbstractReadPvno.java>:[80,38] cannot find symbol
[ERROR] symbol:   variable ERR_04066
[ERROR] location: class org.apache.directory.api.i18n.I18n
[ERROR] <https://builds.apache.org/job/dir-apacheds-ubuntu-deploy/ws/kerberos-codec/src/main/java/org/apache/directory/shared/kerberos/codec/actions/AbstractReadPvno.java>:[83,55] cannot find symbol
[ERROR] symbol:   variable ERR_04067
[ERROR] location: class org.apache.directory.api.i18n.I18n
[ERROR] <https://builds.apache.org/job/dir-apacheds-ubuntu-deploy/ws/kerberos-codec/src/main/java/org/apache/directory/shared/kerberos/codec/checksum/actions/StoreCksumType.java>:[72,38] cannot find symbol
[ERROR] symbol:   variable ERR_04066
[ERROR] location: class org.apache.directory.api.i18n.I18n
[ERROR] <https://builds.apache.org/job/dir-apacheds-ubuntu-deploy/ws/kerberos-codec/src/main/java/org/apache/directory/shared/kerberos/codec/checksum/actions/StoreCksumType.java>:[75,55] cannot find symbol
[ERROR] symbol:   variable ERR_04067
[ERROR] location: class org.apache.directory.api.i18n.I18n
[ERROR] <https://builds.apache.org/job/dir-apacheds-ubuntu-deploy/ws/kerberos-codec/src/main/java/org/apache/directory/shared/kerberos/codec/krbSafe/actions/KrbSafeInit.java>:[66,38] cannot find symbol
[ERROR] symbol:   variable ERR_04066
[ERROR] location: class org.apache.directory.api.i18n.I18n
[ERROR] <https://builds.apache.org/job/dir-apacheds-ubuntu-deploy/ws/kerberos-codec/src/main/java/org/apache/directory/shared/kerberos/codec/krbSafe/actions/KrbSafeInit.java>:[69,55] cannot find symbol
[ERROR] symbol:   variable ERR_04067
[ERROR] location: class org.apache.directory.api.i18n.I18n
[ERROR] <https://builds.apache.org/job/dir-apacheds-ubuntu-deploy/ws/kerberos-codec/src/main/java/org/apache/directory/shared/kerberos/codec/etypeInfoEntry/actions/ETypeInfoEntryInit.java>:[66,38] cannot find symbol
[ERROR] symbol:   variable ERR_04066
[ERROR] location: class org.apache.directory.api.i18n.I18n
[ERROR] <https://builds.apache.org/job/dir-apacheds-ubuntu-deploy/ws/kerberos-codec/src/main/java/org/apache/directory/shared/kerberos/codec/etypeInfoEntry/actions/ETypeInfoEntryInit.java>:[69,55] cannot find symbol
[ERROR] symbol:   variable ERR_04067
[ERROR] location: class org.apache.directory.api.i18n.I18n
[ERROR] <https://builds.apache.org/job/dir-apacheds-ubuntu-deploy/ws/kerberos-codec/src/main/java/org/apache/directory/shared/kerberos/codec/actions/AbstractReadAuthorizationData.java>:[77,38] cannot find symbol
[ERROR] symbol:   variable ERR_04066
[ERROR] location: class org.apache.directory.api.i18n.I18n
[ERROR] <https://builds.apache.org/job/dir-apacheds-ubuntu-deploy/ws/kerberos-codec/src/main/java/org/apache/directory/shared/kerberos/codec/actions/AbstractReadAuthorizationData.java>:[80,55] cannot find symbol
[ERROR] symbol:   variable ERR_04067
[ERROR] location: class org.apache.directory.api.i18n.I18n
[ERROR] <https://builds.apache.org/job/dir-apacheds-ubuntu-deploy/ws/kerberos-codec/src/main/java/org/apache/directory/shared/kerberos/codec/paEncTsEnc/actions/PaEncTsEncInit.java>:[66,38] cannot find symbol
[ERROR] symbol:   variable ERR_04066
[ERROR] location: class org.apache.directory.api.i18n.I18n
[ERROR] <https://builds.apache.org/job/dir-apacheds-ubuntu-deploy/ws/kerberos-codec/src/main/java/org/apache/directory/shared/kerberos/codec/paEncTsEnc/actions/PaEncTsEncInit.java>:[69,55] cannot find symbol
[ERROR] symbol:   variable ERR_04067
[ERROR] location: class org.apache.directory.api.i18n.I18n
[ERROR] <https://builds.apache.org/job/dir-apacheds-ubuntu-deploy/ws/kerberos-codec/src/main/java/org/apache/directory/shared/kerberos/codec/asRep/actions/StoreKdcRep.java>:[69,38] cannot find symbol
[ERROR] symbol:   variable ERR_04066
[ERROR] location: class org.apache.directory.api.i18n.I18n
[ERROR] <https://builds.apache.org/job/dir-apacheds-ubuntu-deploy/ws/kerberos-codec/src/main/java/org/apache/directory/shared/kerberos/codec/asRep/actions/StoreKdcRep.java>:[72,55] cannot find symbol
[ERROR] symbol:   variable ERR_04067
[ERROR] location: class org.apache.directory.api.i18n.I18n
[ERROR] <https://builds.apache.org/job/dir-apacheds-ubuntu-deploy/ws/kerberos-codec/src/main/java/org/apache/directory/shared/kerberos/codec/kdcReqBody/actions/KdcReqBodyInit.java>:[66,38] cannot find symbol
[ERROR] symbol:   variable ERR_04066
[ERROR] location: class org.apache.directory.api.i18n.I18n
[ERROR] <https://builds.apache.org/job/dir-apacheds-ubuntu-deploy/ws/kerberos-codec/src/main/java/org/apache/directory/shared/kerberos/codec/kdcReqBody/actions/KdcReqBodyInit.java>:[69,55] cannot find symbol
[ERROR] symbol:   variable ERR_04067
[ERROR] location: class org.apache.directory.api.i18n.I18n
[ERROR] <https://builds.apache.org/job/dir-apacheds-ubuntu-deploy/ws/kerberos-codec/src/main/java/org/apache/directory/shared/kerberos/codec/encTicketPart/actions/StoreTransited.java>:[69,38] cannot find symbol
[ERROR] symbol:   variable ERR_04066
[ERROR] location: class org.apache.directory.api.i18n.I18n
[ERROR] <https://builds.apache.org/job/dir-apacheds-ubuntu-deploy/ws/kerberos-codec/src/main/java/org/apache/directory/shared/kerberos/codec/encTicketPart/actions/StoreTransited.java>:[72,55] cannot find symbol
[ERROR] symbol:   variable ERR_04067
[ERROR] location: class org.apache.directory.api.i18n.I18n
[ERROR] <https://builds.apache.org/job/dir-apacheds-ubuntu-deploy/ws/kerberos-codec/src/main/java/org/apache/directory/shared/kerberos/codec/actions/AbstractReadRealm.java>:[76,38] cannot find symbol
[ERROR] symbol:   variable ERR_04066
[ERROR] location: class org.apache.directory.api.i18n.I18n
[ERROR] <https://builds.apache.org/job/dir-apacheds-ubuntu-deploy/ws/kerberos-codec/src/main/java/org/apache/directory/shared/kerberos/codec/actions/AbstractReadRealm.java>:[79,55] cannot find symbol
[ERROR] symbol:   variable ERR_04067
[ERROR] location: class org.apache.directory.api.i18n.I18n
[ERROR] <https://builds.apache.org/job/dir-apacheds-ubuntu-deploy/ws/kerberos-codec/src/main/java/org/apache/directory/shared/kerberos/codec/apRep/actions/ApRepInit.java>:[63,38] cannot find symbol
[ERROR] symbol:   variable ERR_04066
[ERROR] location: class org.apache.directory.api.i18n.I18n
[ERROR] <https://builds.apache.org/job/dir-apacheds-ubuntu-deploy/ws/kerberos-codec/src/main/java/org/apache/directory/shared/kerberos/codec/apRep/actions/ApRepInit.java>:[66,55] cannot find symbol
[ERROR] symbol:   variable ERR_04067
[ERROR] location: class org.apache.directory.api.i18n.I18n
[ERROR] <https://builds.apache.org/job/dir-apacheds-ubuntu-deploy/ws/kerberos-codec/src/main/java/org/apache/directory/shared/kerberos/codec/krbCred/actions/StoreTickets.java>:[60,38] cannot find symbol
[ERROR] symbol:   variable ERR_04066
[ERROR] location: class org.apache.directory.api.i18n.I18n
[ERROR] <https://builds.apache.org/job/dir-apacheds-ubuntu-deploy/ws/kerberos-codec/src/main/java/org/apache/directory/shared/kerberos/codec/krbCred/actions/StoreTickets.java>:[63,55] cannot find symbol
[ERROR] symbol:   variable ERR_04067
[ERROR] location: class org.apache.directory.api.i18n.I18n
[ERROR] <https://builds.apache.org/job/dir-apacheds-ubuntu-deploy/ws/kerberos-codec/src/main/java/org/apache/directory/shared/kerberos/codec/kdcRep/actions/StoreTicket.java>:[69,38] cannot find symbol
[ERROR] symbol:   variable ERR_04066
[ERROR] location: class org.apache.directory.api.i18n.I18n
[ERROR] <https://builds.apache.org/job/dir-apacheds-ubuntu-deploy/ws/kerberos-codec/src/main/java/org/apache/directory/shared/kerberos/codec/kdcRep/actions/StoreTicket.java>:[72,55] cannot find symbol
[ERROR] symbol:   variable ERR_04067
[ERROR] location: class org.apache.directory.api.i18n.I18n
[ERROR] <https://builds.apache.org/job/dir-apacheds-ubuntu-deploy/ws/kerberos-codec/src/main/java/org/apache/directory/shared/kerberos/codec/EncKdcRepPart/actions/EncKdcRepPartInit.java>:[66,38] cannot find symbol
[ERROR] symbol:   variable ERR_04066
[ERROR] location: class org.apache.directory.api.i18n.I18n
[ERROR] <https://builds.apache.org/job/dir-apacheds-ubuntu-deploy/ws/kerberos-codec/src/main/java/org/apache/directory/shared/kerberos/codec/EncKdcRepPart/actions/EncKdcRepPartInit.java>:[69,55] cannot find symbol
[ERROR] symbol:   variable ERR_04067
[ERROR] location: class org.apache.directory.api.i18n.I18n
[ERROR] <https://builds.apache.org/job/dir-apacheds-ubuntu-deploy/ws/kerberos-codec/src/main/java/org/apache/directory/shared/kerberos/codec/apReq/actions/ApReqInit.java>:[63,38] cannot find symbol
[ERROR] symbol:   variable ERR_04066
[ERROR] location: class org.apache.directory.api.i18n.I18n
[ERROR] <https://builds.apache.org/job/dir-apacheds-ubuntu-deploy/ws/kerberos-codec/src/main/java/org/apache/directory/shared/kerberos/codec/apReq/actions/ApReqInit.java>:[66,55] cannot find symbol
[ERROR] symbol:   variable ERR_04067
[ERROR] location: class org.apache.directory.api.i18n.I18n
[ERROR] <https://builds.apache.org/job/dir-apacheds-ubuntu-deploy/ws/kerberos-codec/src/main/java/org/apache/directory/shared/kerberos/codec/kdcReqBody/actions/AddTicket.java>:[69,38] cannot find symbol
[ERROR] symbol:   variable ERR_04066
[ERROR] location: class org.apache.directory.api.i18n.I18n
[ERROR] <https://builds.apache.org/job/dir-apacheds-ubuntu-deploy/ws/kerberos-codec/src/main/java/org/apache/directory/shared/kerberos/codec/kdcReqBody/actions/AddTicket.java>:[72,55] cannot find symbol
[ERROR] symbol:   variable ERR_04067
[ERROR] location: class org.apache.directory.api.i18n.I18n
[ERROR] <https://builds.apache.org/job/dir-apacheds-ubuntu-deploy/ws/kerberos-codec/src/main/java/org/apache/directory/shared/kerberos/codec/tgsReq/actions/StoreKdcReq.java>:[69,38] cannot find symbol
[ERROR] symbol:   variable ERR_04066
[ERROR] location: class org.apache.directory.api.i18n.I18n
[ERROR] <https://builds.apache.org/job/dir-apacheds-ubuntu-deploy/ws/kerberos-codec/src/main/java/org/apache/directory/shared/kerberos/codec/tgsReq/actions/StoreKdcReq.java>:[72,55] cannot find symbol
[ERROR] symbol:   variable ERR_04067
[ERROR] location: class org.apache.directory.api.i18n.I18n
[ERROR] <https://builds.apache.org/job/dir-apacheds-ubuntu-deploy/ws/kerberos-codec/src/main/java/org/apache/directory/shared/kerberos/codec/krbPriv/actions/KrbPrivInit.java>:[66,38] cannot find symbol
[ERROR] symbol:   variable ERR_04066
[ERROR] location: class org.apache.directory.api.i18n.I18n
[ERROR] <https://builds.apache.org/job/dir-apacheds-ubuntu-deploy/ws/kerberos-codec/src/main/java/org/apache/directory/shared/kerberos/codec/krbPriv/actions/KrbPrivInit.java>:[69,55] cannot find symbol
[ERROR] symbol:   variable ERR_04067
[ERROR] location: class org.apache.directory.api.i18n.I18n
[ERROR] <https://builds.apache.org/job/dir-apacheds-ubuntu-deploy/ws/kerberos-codec/src/main/java/org/apache/directory/shared/kerberos/codec/etypeInfo2Entry/actions/StoreEType.java>:[71,38] cannot find symbol
[ERROR] symbol:   variable ERR_04066
[ERROR] location: class org.apache.directory.api.i18n.I18n
[ERROR] <https://builds.apache.org/job/dir-apacheds-ubuntu-deploy/ws/kerberos-codec/src/main/java/org/apache/directory/shared/kerberos/codec/etypeInfo2Entry/actions/StoreEType.java>:[74,55] cannot find symbol
[ERROR] symbol:   variable ERR_04067
[ERROR] location: class org.apache.directory.api.i18n.I18n
[ERROR] <https://builds.apache.org/job/dir-apacheds-ubuntu-deploy/ws/kerberos-codec/src/main/java/org/apache/directory/shared/kerberos/codec/krbError/actions/KrbErrorInit.java>:[66,38] cannot find symbol
[ERROR] symbol:   variable ERR_04066
[ERROR] location: class org.apache.directory.api.i18n.I18n
[ERROR] <https://builds.apache.org/job/dir-apacheds-ubuntu-deploy/ws/kerberos-codec/src/main/java/org/apache/directory/shared/kerberos/codec/krbError/actions/KrbErrorInit.java>:[69,55] cannot find symbol
[ERROR] symbol:   variable ERR_04067
[ERROR] location: class org.apache.directory.api.i18n.I18n
[ERROR] <https://builds.apache.org/job/dir-apacheds-ubuntu-deploy/ws/kerberos-codec/src/main/java/org/apache/directory/shared/kerberos/codec/methodData/actions/AddPaData.java>:[68,38] cannot find symbol
[ERROR] symbol:   variable ERR_04066
[ERROR] location: class org.apache.directory.api.i18n.I18n
[ERROR] <https://builds.apache.org/job/dir-apacheds-ubuntu-deploy/ws/kerberos-codec/src/main/java/org/apache/directory/shared/kerberos/codec/methodData/actions/AddPaData.java>:[71,55] cannot find symbol
[ERROR] symbol:   variable ERR_04067
[ERROR] location: class org.apache.directory.api.i18n.I18n
[ERROR] <https://builds.apache.org/job/dir-apacheds-ubuntu-deploy/ws/kerberos-codec/src/main/java/org/apache/directory/shared/kerberos/codec/tgsRep/actions/StoreKdcRep.java>:[69,38] cannot find symbol
[ERROR] symbol:   variable ERR_04066
[ERROR] location: class org.apache.directory.api.i18n.I18n
[ERROR] <https://builds.apache.org/job/dir-apacheds-ubuntu-deploy/ws/kerberos-codec/src/main/java/org/apache/directory/shared/kerberos/codec/tgsRep/actions/StoreKdcRep.java>:[72,55] cannot find symbol
[ERROR] symbol:   variable ERR_04067
[ERROR] location: class org.apache.directory.api.i18n.I18n
[ERROR] <https://builds.apache.org/job/dir-apacheds-ubuntu-deploy/ws/kerberos-codec/src/main/java/org/apache/directory/shared/kerberos/codec/etypeInfo/actions/AddETypeInfoEntry.java>:[68,38] cannot find symbol
[ERROR] symbol:   variable ERR_04066
[ERROR] location: class org.apache.directory.api.i18n.I18n
[ERROR] <https://builds.apache.org/job/dir-apacheds-ubuntu-deploy/ws/kerberos-codec/src/main/java/org/apache/directory/shared/kerberos/codec/etypeInfo/actions/AddETypeInfoEntry.java>:[71,55] cannot find symbol
[ERROR] symbol:   variable ERR_04067
[ERROR] location: class org.apache.directory.api.i18n.I18n
[ERROR] <https://builds.apache.org/job/dir-apacheds-ubuntu-deploy/ws/kerberos-codec/src/main/java/org/apache/directory/shared/kerberos/codec/EncKdcRepPart/actions/StoreLastReq.java>:[68,38] cannot find symbol
[ERROR] symbol:   variable ERR_04066
[ERROR] location: class org.apache.directory.api.i18n.I18n
[ERROR] <https://builds.apache.org/job/dir-apacheds-ubuntu-deploy/ws/kerberos-codec/src/main/java/org/apache/directory/shared/kerberos/codec/EncKdcRepPart/actions/StoreLastReq.java>:[71,55] cannot find symbol
[ERROR] symbol:   variable ERR_04067
[ERROR] location: class org.apache.directory.api.i18n.I18n
[ERROR] <https://builds.apache.org/job/dir-apacheds-ubuntu-deploy/ws/kerberos-codec/src/main/java/org/apache/directory/shared/kerberos/codec/kdcReqBody/actions/StoreTill.java>:[69,38] cannot find symbol
[ERROR] symbol:   variable ERR_04066
[ERROR] location: class org.apache.directory.api.i18n.I18n
[ERROR] <https://builds.apache.org/job/dir-apacheds-ubuntu-deploy/ws/kerberos-codec/src/main/java/org/apache/directory/shared/kerberos/codec/kdcReqBody/actions/StoreTill.java>:[72,55] cannot find symbol
[ERROR] symbol:   variable ERR_04067
[ERROR] location: class org.apache.directory.api.i18n.I18n
[ERROR] <https://builds.apache.org/job/dir-apacheds-ubuntu-deploy/ws/kerberos-codec/src/main/java/org/apache/directory/shared/kerberos/codec/kdcReqBody/actions/StoreTill.java>:[93,38] cannot find symbol
[ERROR] symbol:   variable ERR_04066
[ERROR] location: class org.apache.directory.api.i18n.I18n
[ERROR] <https://builds.apache.org/job/dir-apacheds-ubuntu-deploy/ws/kerberos-codec/src/main/java/org/apache/directory/shared/kerberos/codec/kdcReqBody/actions/StoreTill.java>:[96,55] cannot find symbol
[ERROR] symbol:   variable ERR_04067
[ERROR] location: class org.apache.directory.api.i18n.I18n
[ERROR] <https://builds.apache.org/job/dir-apacheds-ubuntu-deploy/ws/kerberos-codec/src/main/java/org/apache/directory/shared/kerberos/codec/actions/AbstractReadCheckSum.java>:[77,38] cannot find symbol
[ERROR] symbol:   variable ERR_04066
[ERROR] location: class org.apache.directory.api.i18n.I18n
[ERROR] <https://builds.apache.org/job/dir-apacheds-ubuntu-deploy/ws/kerberos-codec/src/main/java/org/apache/directory/shared/kerberos/codec/actions/AbstractReadCheckSum.java>:[80,55] cannot find symbol
[ERROR] symbol:   variable ERR_04067
[ERROR] location: class org.apache.directory.api.i18n.I18n
[ERROR] <https://builds.apache.org/job/dir-apacheds-ubuntu-deploy/ws/kerberos-codec/src/main/java/org/apache/directory/shared/kerberos/codec/padata/actions/StoreDataType.java>:[72,38] cannot find symbol
[ERROR] symbol:   variable ERR_04066
[ERROR] location: class org.apache.directory.api.i18n.I18n
[ERROR] <https://builds.apache.org/job/dir-apacheds-ubuntu-deploy/ws/kerberos-codec/src/main/java/org/apache/directory/shared/kerberos/codec/padata/actions/StoreDataType.java>:[75,55] cannot find symbol
[ERROR] symbol:   variable ERR_04067
[ERROR] location: class org.apache.directory.api.i18n.I18n
[ERROR] <https://builds.apache.org/job/dir-apacheds-ubuntu-deploy/ws/kerberos-codec/src/main/java/org/apache/directory/shared/kerberos/codec/kdcReq/actions/StoreKdcReqBody.java>:[69,38] cannot find symbol
[ERROR] symbol:   variable ERR_04066
[ERROR] location: class org.apache.directory.api.i18n.I18n
[ERROR] <https://builds.apache.org/job/dir-apacheds-ubuntu-deploy/ws/kerberos-codec/src/main/java/org/apache/directory/shared/kerberos/codec/kdcReq/actions/StoreKdcReqBody.java>:[72,55] cannot find symbol
[ERROR] symbol:   variable ERR_04067
[ERROR] location: class org.apache.directory.api.i18n.I18n
[ERROR] <https://builds.apache.org/job/dir-apacheds-ubuntu-deploy/ws/kerberos-codec/src/main/java/org/apache/directory/shared/kerberos/codec/krbCred/actions/KrbCredInit.java>:[66,38] cannot find symbol
[ERROR] symbol:   variable ERR_04066
[ERROR] location: class org.apache.directory.api.i18n.I18n
[ERROR] <https://builds.apache.org/job/dir-apacheds-ubuntu-deploy/ws/kerberos-codec/src/main/java/org/apache/directory/shared/kerberos/codec/krbCred/actions/KrbCredInit.java>:[69,55] cannot find symbol
[ERROR] symbol:   variable ERR_04067
[ERROR] location: class org.apache.directory.api.i18n.I18n
[ERROR] <https://builds.apache.org/job/dir-apacheds-ubuntu-deploy/ws/kerberos-codec/src/main/java/org/apache/directory/shared/kerberos/codec/adAndOr/actions/AdAndOrInit.java>:[66,38] cannot find symbol
[ERROR] symbol:   variable ERR_04066
[ERROR] location: class org.apache.directory.api.i18n.I18n
[ERROR] <https://builds.apache.org/job/dir-apacheds-ubuntu-deploy/ws/kerberos-codec/src/main/java/org/apache/directory/shared/kerberos/codec/adAndOr/actions/AdAndOrInit.java>:[69,55] cannot find symbol
[ERROR] symbol:   variable ERR_04067
[ERROR] location: class org.apache.directory.api.i18n.I18n
[ERROR] -> [Help 1]
[ERROR] 
[ERROR] To see the full stack trace of the errors, re-run Maven with the -e switch.
[ERROR] Re-run Maven using the -X switch to enable full debug logging.
[ERROR] 
[ERROR] For more information about the errors and possible solutions, please read the following articles:
[ERROR] [Help 1] http://cwiki.apache.org/confluence/display/MAVEN/MojoFailureException
[ERROR] 
[ERROR] After correcting the problems, you can resume the build with the command
[ERROR]   mvn <goals> -rf :apacheds-kerberos-codec
channel stopped