You are viewing a plain text version of this content. The canonical link for it is here.
Posted to builds@hbase.apache.org by Apache Jenkins Server <je...@builds.apache.org> on 2015/08/26 05:16:11 UTC

Build failed in Jenkins: HBase-1.3 » latest1.7,Hadoop #135

See <https://builds.apache.org/job/HBase-1.3/jdk=latest1.7,label=Hadoop/135/changes>

Changes:

[stack] HBASE-14290 Spin up less threads in tests

[tedyu] HBASE-14258 Make region_mover.rb script case insensitive with regard to hostname (Vladimir Rodionov)

------------------------------------------
[...truncated 45859 lines...]
Running org.apache.hadoop.hbase.client.TestHTablePool$TestHTableReusablePool
Running org.apache.hadoop.hbase.client.TestRestoreSnapshotFromClientWithRegionReplicas
Running org.apache.hadoop.hbase.client.TestReplicaWithCluster
Tests run: 9, Failures: 0, Errors: 0, Skipped: 0, Time elapsed: 8.661 sec - in org.apache.hadoop.hbase.client.TestHTablePool$TestHTableReusablePool
Running org.apache.hadoop.hbase.client.TestHTableMultiplexer
Tests run: 1, Failures: 0, Errors: 0, Skipped: 0, Time elapsed: 9.817 sec - in org.apache.hadoop.hbase.client.TestHTableMultiplexer
Running org.apache.hadoop.hbase.client.TestScannerTimeout
Tests run: 4, Failures: 0, Errors: 0, Skipped: 0, Time elapsed: 44.552 sec - in org.apache.hadoop.hbase.client.TestReplicaWithCluster
Running org.apache.hadoop.hbase.client.TestHTablePool$TestHTableReusablePool
Tests run: 5, Failures: 0, Errors: 0, Skipped: 0, Time elapsed: 172.404 sec - in org.apache.hadoop.hbase.client.TestCloneSnapshotFromClientWithRegionReplicas
Tests run: 9, Failures: 0, Errors: 0, Skipped: 0, Time elapsed: 14.028 sec - in org.apache.hadoop.hbase.client.TestHTablePool$TestHTableReusablePool
Running org.apache.hadoop.hbase.client.TestHTablePool$TestHTableThreadLocalPool
Tests run: 4, Failures: 0, Errors: 0, Skipped: 0, Time elapsed: 39.991 sec - in org.apache.hadoop.hbase.client.TestScannerTimeout
Tests run: 9, Failures: 0, Errors: 0, Skipped: 0, Time elapsed: 9.106 sec - in org.apache.hadoop.hbase.client.TestHTablePool$TestHTableThreadLocalPool
Running org.apache.hadoop.hbase.client.TestTableSnapshotScanner
Running org.apache.hadoop.hbase.client.TestReplicasClient
Running org.apache.hadoop.hbase.client.TestFromClientSide3
Tests run: 3, Failures: 0, Errors: 0, Skipped: 0, Time elapsed: 48.859 sec - in org.apache.hadoop.hbase.client.TestTableSnapshotScanner
Running org.apache.hadoop.hbase.client.TestMetaWithReplicas
Tests run: 5, Failures: 0, Errors: 0, Skipped: 0, Time elapsed: 168.369 sec - in org.apache.hadoop.hbase.client.TestRestoreSnapshotFromClientWithRegionReplicas
Tests run: 82, Failures: 0, Errors: 0, Skipped: 4, Time elapsed: 210.412 sec - in org.apache.hadoop.hbase.client.TestFromClientSide
Tests run: 9, Failures: 0, Errors: 0, Skipped: 0, Time elapsed: 83.797 sec - in org.apache.hadoop.hbase.client.TestFromClientSide3
Running org.apache.hadoop.hbase.client.TestResultSizeEstimation
Running org.apache.hadoop.hbase.client.TestRestoreSnapshotFromClient
Tests run: 2, Failures: 0, Errors: 0, Skipped: 0, Time elapsed: 4.28 sec - in org.apache.hadoop.hbase.client.TestResultSizeEstimation
Running org.apache.hadoop.hbase.client.TestSnapshotMetadata
Running org.apache.hadoop.hbase.client.TestHTableMultiplexerFlushCache
Tests run: 1, Failures: 0, Errors: 0, Skipped: 0, Time elapsed: 6.432 sec - in org.apache.hadoop.hbase.client.TestHTableMultiplexerFlushCache
Running org.apache.hadoop.hbase.TestMultiVersions
Tests run: 4, Failures: 0, Errors: 0, Skipped: 0, Time elapsed: 33.211 sec - in org.apache.hadoop.hbase.client.TestSnapshotMetadata
Tests run: 3, Failures: 0, Errors: 0, Skipped: 0, Time elapsed: 9.169 sec - in org.apache.hadoop.hbase.TestMultiVersions
Running org.apache.hadoop.hbase.procedure.TestZKProcedure
Tests run: 4, Failures: 0, Errors: 0, Skipped: 0, Time elapsed: 2.058 sec - in org.apache.hadoop.hbase.procedure.TestZKProcedure
Running org.apache.hadoop.hbase.TestHColumnDescriptorDefaultVersions
Running org.apache.hadoop.hbase.procedure.TestZKProcedureControllers
Tests run: 4, Failures: 0, Errors: 0, Skipped: 0, Time elapsed: 1.76 sec - in org.apache.hadoop.hbase.procedure.TestZKProcedureControllers
Running org.apache.hadoop.hbase.TestNamespace
Tests run: 3, Failures: 0, Errors: 0, Skipped: 0, Time elapsed: 24.065 sec - in org.apache.hadoop.hbase.TestHColumnDescriptorDefaultVersions
Running org.apache.hadoop.hbase.constraint.TestConstraint
Tests run: 9, Failures: 0, Errors: 0, Skipped: 1, Time elapsed: 25.466 sec - in org.apache.hadoop.hbase.TestNamespace
Running org.apache.hadoop.hbase.TestZooKeeper
Tests run: 12, Failures: 0, Errors: 0, Skipped: 0, Time elapsed: 140.024 sec - in org.apache.hadoop.hbase.client.TestMetaWithReplicas
Tests run: 5, Failures: 0, Errors: 0, Skipped: 0, Time elapsed: 22.505 sec - in org.apache.hadoop.hbase.constraint.TestConstraint
Running org.apache.hadoop.hbase.snapshot.TestFlushSnapshotFromClient
Running org.apache.hadoop.hbase.snapshot.TestExportSnapshot
Tests run: 5, Failures: 0, Errors: 0, Skipped: 0, Time elapsed: 142.483 sec - in org.apache.hadoop.hbase.client.TestRestoreSnapshotFromClient
Tests run: 14, Failures: 0, Errors: 0, Skipped: 0, Time elapsed: 260.211 sec - in org.apache.hadoop.hbase.client.TestReplicasClient
Running org.apache.hadoop.hbase.snapshot.TestSecureExportSnapshot
Running org.apache.hadoop.hbase.snapshot.TestRestoreFlushSnapshotFromClient
Tests run: 9, Failures: 0, Errors: 0, Skipped: 0, Time elapsed: 79.913 sec - in org.apache.hadoop.hbase.snapshot.TestFlushSnapshotFromClient
Running org.apache.hadoop.hbase.snapshot.TestSnapshotClientRetries
Tests run: 2, Failures: 0, Errors: 0, Skipped: 0, Time elapsed: 17.483 sec - in org.apache.hadoop.hbase.snapshot.TestSnapshotClientRetries
Running org.apache.hadoop.hbase.snapshot.TestSnapshotDescriptionUtils
Tests run: 2, Failures: 0, Errors: 0, Skipped: 0, Time elapsed: 0.239 sec - in org.apache.hadoop.hbase.snapshot.TestSnapshotDescriptionUtils
Running org.apache.hadoop.hbase.TestIOFencing
Tests run: 5, Failures: 0, Errors: 0, Skipped: 0, Time elapsed: 75.735 sec - in org.apache.hadoop.hbase.snapshot.TestRestoreFlushSnapshotFromClient
Running org.apache.hadoop.hbase.coprocessor.TestRegionObserverScannerOpenHook
Tests run: 3, Failures: 0, Errors: 0, Skipped: 0, Time elapsed: 11.423 sec - in org.apache.hadoop.hbase.coprocessor.TestRegionObserverScannerOpenHook
Tests run: 12, Failures: 0, Errors: 0, Skipped: 0, Time elapsed: 177.329 sec - in org.apache.hadoop.hbase.TestZooKeeper
Running org.apache.hadoop.hbase.coprocessor.TestOpenTableInCoprocessor
Running org.apache.hadoop.hbase.coprocessor.TestMasterCoprocessorExceptionWithAbort
Tests run: 2, Failures: 0, Errors: 0, Skipped: 0, Time elapsed: 19.082 sec - in org.apache.hadoop.hbase.coprocessor.TestOpenTableInCoprocessor
Tests run: 1, Failures: 0, Errors: 0, Skipped: 0, Time elapsed: 19.202 sec - in org.apache.hadoop.hbase.coprocessor.TestMasterCoprocessorExceptionWithAbort
Running org.apache.hadoop.hbase.coprocessor.TestCoprocessorTableEndpoint
Running org.apache.hadoop.hbase.coprocessor.TestRegionServerCoprocessorEndpoint
Tests run: 2, Failures: 0, Errors: 0, Skipped: 0, Time elapsed: 9.251 sec - in org.apache.hadoop.hbase.coprocessor.TestCoprocessorTableEndpoint
Tests run: 2, Failures: 0, Errors: 0, Skipped: 0, Time elapsed: 2.127 sec - in org.apache.hadoop.hbase.coprocessor.TestRegionServerCoprocessorEndpoint
Running org.apache.hadoop.hbase.coprocessor.TestRegionObserverInterface
Running org.apache.hadoop.hbase.coprocessor.TestMasterCoprocessorExceptionWithRemove
Tests run: 1, Failures: 0, Errors: 0, Skipped: 0, Time elapsed: 6.005 sec - in org.apache.hadoop.hbase.coprocessor.TestMasterCoprocessorExceptionWithRemove
Running org.apache.hadoop.hbase.coprocessor.TestAggregateProtocol
Tests run: 44, Failures: 0, Errors: 0, Skipped: 0, Time elapsed: 5.679 sec - in org.apache.hadoop.hbase.coprocessor.TestAggregateProtocol
Running org.apache.hadoop.hbase.coprocessor.TestBatchCoprocessorEndpoint
Tests run: 4, Failures: 0, Errors: 0, Skipped: 0, Time elapsed: 2.344 sec - in org.apache.hadoop.hbase.coprocessor.TestBatchCoprocessorEndpoint
Running org.apache.hadoop.hbase.coprocessor.TestHTableWrapper
Tests run: 1, Failures: 0, Errors: 0, Skipped: 0, Time elapsed: 6.043 sec - in org.apache.hadoop.hbase.coprocessor.TestHTableWrapper
Running org.apache.hadoop.hbase.coprocessor.TestRegionServerObserver
Tests run: 13, Failures: 0, Errors: 0, Skipped: 2, Time elapsed: 65.959 sec - in org.apache.hadoop.hbase.coprocessor.TestRegionObserverInterface
Tests run: 1, Failures: 0, Errors: 0, Skipped: 0, Time elapsed: 16.835 sec - in org.apache.hadoop.hbase.coprocessor.TestRegionServerObserver
Running org.apache.hadoop.hbase.coprocessor.TestRegionServerCoprocessorExceptionWithAbort
Running org.apache.hadoop.hbase.coprocessor.TestClassLoading
Tests run: 2, Failures: 0, Errors: 0, Skipped: 0, Time elapsed: 17.451 sec - in org.apache.hadoop.hbase.coprocessor.TestRegionServerCoprocessorExceptionWithAbort
Running org.apache.hadoop.hbase.coprocessor.TestDoubleColumnInterpreter
Tests run: 9, Failures: 0, Errors: 0, Skipped: 0, Time elapsed: 28.961 sec - in org.apache.hadoop.hbase.coprocessor.TestClassLoading
Tests run: 38, Failures: 0, Errors: 0, Skipped: 0, Time elapsed: 4.467 sec - in org.apache.hadoop.hbase.coprocessor.TestDoubleColumnInterpreter
Tests run: 2, Failures: 0, Errors: 0, Skipped: 0, Time elapsed: 216.983 sec - in org.apache.hadoop.hbase.TestIOFencing
Running org.apache.hadoop.hbase.coprocessor.TestRegionObserverBypass
Tests run: 9, Failures: 0, Errors: 0, Skipped: 0, Time elapsed: 317.382 sec - in org.apache.hadoop.hbase.snapshot.TestExportSnapshot
Running org.apache.hadoop.hbase.coprocessor.TestRowProcessorEndpoint
Running org.apache.hadoop.hbase.coprocessor.TestCoprocessorStop
Tests run: 2, Failures: 0, Errors: 0, Skipped: 0, Time elapsed: 7.915 sec - in org.apache.hadoop.hbase.coprocessor.TestRegionObserverBypass
Running org.apache.hadoop.hbase.coprocessor.TestRegionServerCoprocessorExceptionWithRemove
Running org.apache.hadoop.hbase.coprocessor.TestBigDecimalColumnInterpreter
Tests run: 4, Failures: 0, Errors: 0, Skipped: 0, Time elapsed: 17.844 sec - in org.apache.hadoop.hbase.coprocessor.TestRowProcessorEndpoint
Tests run: 38, Failures: 0, Errors: 0, Skipped: 0, Time elapsed: 4.492 sec - in org.apache.hadoop.hbase.coprocessor.TestBigDecimalColumnInterpreter
Tests run: 1, Failures: 0, Errors: 0, Skipped: 0, Time elapsed: 17.061 sec - in org.apache.hadoop.hbase.coprocessor.TestCoprocessorStop
Tests run: 1, Failures: 0, Errors: 0, Skipped: 0, Time elapsed: 16.125 sec - in org.apache.hadoop.hbase.coprocessor.TestRegionServerCoprocessorExceptionWithRemove
Running org.apache.hadoop.hbase.TestGlobalMemStoreSize
Running org.apache.hadoop.hbase.coprocessor.TestMasterObserver
Running org.apache.hadoop.hbase.coprocessor.TestWALObserver
Running org.apache.hadoop.hbase.coprocessor.TestCoprocessorEndpoint
Tests run: 6, Failures: 0, Errors: 0, Skipped: 0, Time elapsed: 2.568 sec - in org.apache.hadoop.hbase.coprocessor.TestCoprocessorEndpoint
Tests run: 1, Failures: 0, Errors: 0, Skipped: 0, Time elapsed: 13.92 sec - in org.apache.hadoop.hbase.TestGlobalMemStoreSize
Tests run: 6, Failures: 0, Errors: 0, Skipped: 0, Time elapsed: 7.561 sec - in org.apache.hadoop.hbase.coprocessor.TestWALObserver
Running org.apache.hadoop.hbase.TestMetaTableLocator
Tests run: 7, Failures: 0, Errors: 0, Skipped: 0, Time elapsed: 3.672 sec - in org.apache.hadoop.hbase.TestMetaTableLocator
Running org.apache.hadoop.hbase.TestJMXListener
Tests run: 9, Failures: 0, Errors: 0, Skipped: 0, Time elapsed: 313.2 sec - in org.apache.hadoop.hbase.snapshot.TestSecureExportSnapshot
Running org.apache.hadoop.hbase.TestStochasticBalancerJmxMetrics
Running org.apache.hadoop.hbase.zookeeper.TestZKTableStateManager
Tests run: 1, Failures: 0, Errors: 0, Skipped: 0, Time elapsed: 0.757 sec - in org.apache.hadoop.hbase.zookeeper.TestZKTableStateManager
Tests run: 2, Failures: 0, Errors: 0, Skipped: 0, Time elapsed: 1.342 sec - in org.apache.hadoop.hbase.TestStochasticBalancerJmxMetrics
Running org.apache.hadoop.hbase.zookeeper.TestZKMulti
Running org.apache.hadoop.hbase.zookeeper.lock.TestZKInterProcessReadWriteLock
Tests run: 12, Failures: 0, Errors: 0, Skipped: 0, Time elapsed: 1.598 sec - in org.apache.hadoop.hbase.zookeeper.TestZKMulti
Running org.apache.hadoop.hbase.zookeeper.TestZKLeaderManager
Tests run: 1, Failures: 0, Errors: 0, Skipped: 0, Time elapsed: 0.152 sec - in org.apache.hadoop.hbase.zookeeper.TestZKLeaderManager
Running org.apache.hadoop.hbase.zookeeper.TestZooKeeperACL
Tests run: 6, Failures: 0, Errors: 0, Skipped: 0, Time elapsed: 0.268 sec - in org.apache.hadoop.hbase.zookeeper.TestZooKeeperACL
Running org.apache.hadoop.hbase.zookeeper.TestRecoverableZooKeeper
Tests run: 1, Failures: 0, Errors: 0, Skipped: 0, Time elapsed: 1.25 sec - in org.apache.hadoop.hbase.zookeeper.TestRecoverableZooKeeper
Running org.apache.hadoop.hbase.zookeeper.TestHQuorumPeer
Running org.apache.hadoop.hbase.zookeeper.TestZooKeeperNodeTracker
Tests run: 3, Failures: 0, Errors: 0, Skipped: 0, Time elapsed: 0.864 sec - in org.apache.hadoop.hbase.zookeeper.TestZooKeeperNodeTracker
Tests run: 4, Failures: 0, Errors: 0, Skipped: 0, Time elapsed: 1.035 sec - in org.apache.hadoop.hbase.zookeeper.TestHQuorumPeer
Running org.apache.hadoop.hbase.TestClusterBootOrder
Tests run: 2, Failures: 0, Errors: 0, Skipped: 0, Time elapsed: 16.41 sec - in org.apache.hadoop.hbase.TestJMXListener
Tests run: 7, Failures: 0, Errors: 0, Skipped: 0, Time elapsed: 37.106 sec - in org.apache.hadoop.hbase.coprocessor.TestMasterObserver
Running org.apache.hadoop.hbase.TestPartialResultsFromClientSide
Running org.apache.hadoop.hbase.TestServerSideScanMetricsFromClientSide
Tests run: 6, Failures: 0, Errors: 0, Skipped: 0, Time elapsed: 24.603 sec - in org.apache.hadoop.hbase.zookeeper.lock.TestZKInterProcessReadWriteLock
Tests run: 2, Failures: 0, Errors: 0, Skipped: 0, Time elapsed: 3.115 sec - in org.apache.hadoop.hbase.TestServerSideScanMetricsFromClientSide
Tests run: 2, Failures: 0, Errors: 0, Skipped: 0, Time elapsed: 28.634 sec - in org.apache.hadoop.hbase.TestClusterBootOrder
Tests run: 13, Failures: 0, Errors: 0, Skipped: 0, Time elapsed: 54.984 sec - in org.apache.hadoop.hbase.TestPartialResultsFromClientSide

Results :


Tests in error: 
  TestHFileOutputFormat2.testMRIncrementalLoadWithSplit:383->doIncrementalLoadTest:466 » IO


Tests run: 2635, Failures: 0, Errors: 1, Skipped: 20

[INFO] ------------------------------------------------------------------------
[INFO] Reactor Summary:
[INFO] 
[INFO] Apache HBase ...................................... SUCCESS [1:03.475s]
[INFO] Apache HBase - Checkstyle ......................... SUCCESS [5.687s]
[INFO] Apache HBase - Resource Bundle .................... SUCCESS [0.222s]
[INFO] Apache HBase - Annotations ........................ SUCCESS [1.416s]
[INFO] Apache HBase - Protocol ........................... SUCCESS [14.895s]
[INFO] Apache HBase - Common ............................. SUCCESS [1:53.595s]
[INFO] Apache HBase - Procedure .......................... SUCCESS [1:53.379s]
[INFO] Apache HBase - Client ............................. SUCCESS [1:25.649s]
[INFO] Apache HBase - Hadoop Compatibility ............... SUCCESS [7.749s]
[INFO] Apache HBase - Hadoop Two Compatibility ........... SUCCESS [8.992s]
[INFO] Apache HBase - Prefix Tree ........................ SUCCESS [9.643s]
[INFO] Apache HBase - Server ............................. FAILURE [1:53:08.992s]
[INFO] Apache HBase - Testing Util ....................... SKIPPED
[INFO] Apache HBase - Thrift ............................. SKIPPED
[INFO] Apache HBase - Rest ............................... SKIPPED
[INFO] Apache HBase - Shell .............................. SKIPPED
[INFO] Apache HBase - Integration Tests .................. SKIPPED
[INFO] Apache HBase - Examples ........................... SKIPPED
[INFO] Apache HBase - Assembly ........................... SKIPPED
[INFO] Apache HBase - Shaded ............................. SKIPPED
[INFO] Apache HBase - Shaded - Client .................... SKIPPED
[INFO] Apache HBase - Shaded - Server .................... SKIPPED
[INFO] ------------------------------------------------------------------------
[INFO] BUILD FAILURE
[INFO] ------------------------------------------------------------------------
[INFO] Total time: 2:00:34.045s
[INFO] Finished at: Wed Aug 26 03:14:21 UTC 2015
[INFO] Final Memory: 98M/733M
[INFO] ------------------------------------------------------------------------
[ERROR] Failed to execute goal org.apache.maven.plugins:maven-surefire-plugin:2.18:test (secondPartTestsExecution) on project hbase-server: ExecutionException: java.lang.RuntimeException: java.lang.RuntimeException: org.apache.maven.surefire.report.ReporterException: When writing xml report stdout/stderr: /tmp/stderr152738648828044685deferred (No such file or directory) -> [Help 1]
[ERROR] 
[ERROR] To see the full stack trace of the errors, re-run Maven with the -e switch.
[ERROR] Re-run Maven using the -X switch to enable full debug logging.
[ERROR] 
[ERROR] For more information about the errors and possible solutions, please read the following articles:
[ERROR] [Help 1] http://cwiki.apache.org/confluence/display/MAVEN/MojoFailureException
[ERROR] 
[ERROR] After correcting the problems, you can resume the build with the command
[ERROR]   mvn <goals> -rf :hbase-server
Build step 'Invoke top-level Maven targets' marked build as failure
Performing Post build task...
Match found for :.* : True
Logical operation result is TRUE
Running script  :   ZOMBIE_TESTS_COUNT=`jps | grep surefirebooter | wc -l`
  if [[ $ZOMBIE_TESTS_COUNT != 0 ]] ; then
    #It seems sometimes the tests are not dying immediately. Let's give them 10s
    echo "Suspicious java process found - waiting 10s to see if there are just slow to stop"
    sleep 10   
    ZOMBIE_TESTS_COUNT=`jps | grep surefirebooter | wc -l`
    if [[ $ZOMBIE_TESTS_COUNT != 0 ]] ; then
      echo "There are $ZOMBIE_TESTS_COUNT zombie tests, they should have been killed by surefire but survived"
      echo "************ BEGIN zombies jstack extract"
      ZB_STACK=`jps | grep surefirebooter | cut -d ' ' -f 1 | xargs -n 1 jstack | grep ".test" | grep "\.java"`
      jps | grep surefirebooter | cut -d ' ' -f 1 | xargs -n 1 jstack
      echo "************ END  zombies jstack extract"
      JIRA_COMMENT="$JIRA_COMMENT

     {color:red}-1 core zombie tests{color}.  There are ${ZOMBIE_TESTS_COUNT} zombie test(s): ${ZB_STACK}"
      BAD=1
      jps | grep surefirebooter | cut -d ' ' -f 1 | xargs kill -9
    else
      echo "We're ok: there is no zombie test, but some tests took some time to stop"
    fi
  else
    echo "We're ok: there is no zombie test"
  fi
[Hadoop] $ /bin/bash -xe /tmp/hudson8815877083469873702.sh
++ jps
++ grep surefirebooter
++ wc -l
+ ZOMBIE_TESTS_COUNT=5
+ [[ 5 != 0 ]]
+ echo 'Suspicious java process found - waiting 10s to see if there are just slow to stop'
Suspicious java process found - waiting 10s to see if there are just slow to stop
+ sleep 10
++ jps
++ grep surefirebooter
++ wc -l
+ ZOMBIE_TESTS_COUNT=5
+ [[ 5 != 0 ]]
+ echo 'There are 5 zombie tests, they should have been killed by surefire but survived'
There are 5 zombie tests, they should have been killed by surefire but survived
+ echo '************ BEGIN zombies jstack extract'
************ BEGIN zombies jstack extract
++ jps
++ grep surefirebooter
++ cut -d ' ' -f 1
++ xargs -n 1 jstack
++ grep .test
++ grep '\.java'
30424: Unable to open socket file: target process not responding or HotSpot VM not loaded
The -F option can be used when the target process is not responding
+ ZB_STACK=
POST BUILD TASK : FAILURE
END OF POST BUILD TASK : 0
Archiving artifacts
Sending artifact delta relative to HBase-1.3 » latest1.7,Hadoop #108
Archived 2122 artifacts
Archive block size is 32768
Received 27 blocks and 684770847 bytes
Compression is 0.1%
Took 2 min 35 sec

Build failed in Jenkins: HBase-1.3 » latest1.7,Hadoop #139

Posted by Apache Jenkins Server <je...@builds.apache.org>.
See <https://builds.apache.org/job/HBase-1.3/jdk=latest1.7,label=Hadoop/139/changes>

Changes:

[larsh] HBASE-14315 Save one call to KeyValueHeap.peek per row.

------------------------------------------
[...truncated 57525 lines...]
	at org.apache.hadoop.ipc.Server$Handler.run(Server.java:1985)

"IPC Server listener on 36799" daemon prio=10 tid=0x00007f58bd17d800 nid=0x5400 runnable [0x00007f58a5533000]
   java.lang.Thread.State: RUNNABLE
	at sun.nio.ch.EPollArrayWrapper.epollWait(Native Method)
	at sun.nio.ch.EPollArrayWrapper.poll(EPollArrayWrapper.java:269)
	at sun.nio.ch.EPollSelectorImpl.doSelect(EPollSelectorImpl.java:79)
	at sun.nio.ch.SelectorImpl.lockAndDoSelect(SelectorImpl.java:87)
	- locked <0x0000000755b37278> (a sun.nio.ch.Util$2)
	- locked <0x0000000755b37288> (a java.util.Collections$UnmodifiableSet)
	- locked <0x0000000755b37230> (a sun.nio.ch.EPollSelectorImpl)
	at sun.nio.ch.SelectorImpl.select(SelectorImpl.java:98)
	at sun.nio.ch.SelectorImpl.select(SelectorImpl.java:102)
	at org.apache.hadoop.ipc.Server$Listener.run(Server.java:668)

"IPC Server Responder" daemon prio=10 tid=0x00007f58bd17d000 nid=0x53ff runnable [0x00007f58a5a38000]
   java.lang.Thread.State: RUNNABLE
	at sun.nio.ch.EPollArrayWrapper.epollWait(Native Method)
	at sun.nio.ch.EPollArrayWrapper.poll(EPollArrayWrapper.java:269)
	at sun.nio.ch.EPollSelectorImpl.doSelect(EPollSelectorImpl.java:79)
	at sun.nio.ch.SelectorImpl.lockAndDoSelect(SelectorImpl.java:87)
	- locked <0x0000000755b47ca0> (a sun.nio.ch.Util$2)
	- locked <0x0000000755b47cb0> (a java.util.Collections$UnmodifiableSet)
	- locked <0x0000000755b47c58> (a sun.nio.ch.EPollSelectorImpl)
	at sun.nio.ch.SelectorImpl.select(SelectorImpl.java:98)
	at org.apache.hadoop.ipc.Server$Responder.doRunLoop(Server.java:835)
	at org.apache.hadoop.ipc.Server$Responder.run(Server.java:818)

"org.apache.hadoop.hdfs.server.blockmanagement.BlockManager$ReplicationMonitor@5fa63fa" daemon prio=10 tid=0x00007f58bd165000 nid=0x53fe waiting on condition [0x00007f58a5634000]
   java.lang.Thread.State: TIMED_WAITING (sleeping)
	at java.lang.Thread.sleep(Native Method)
	at org.apache.hadoop.hdfs.server.blockmanagement.BlockManager$ReplicationMonitor.run(BlockManager.java:3397)
	at java.lang.Thread.run(Thread.java:745)

"org.apache.hadoop.hdfs.server.blockmanagement.HeartbeatManager$Monitor@79b9b526" daemon prio=10 tid=0x00007f58bd163800 nid=0x53fd waiting on condition [0x00007f58a5735000]
   java.lang.Thread.State: TIMED_WAITING (sleeping)
	at java.lang.Thread.sleep(Native Method)
	at org.apache.hadoop.hdfs.server.blockmanagement.HeartbeatManager$Monitor.run(HeartbeatManager.java:319)
	at java.lang.Thread.run(Thread.java:745)

"org.apache.hadoop.hdfs.server.blockmanagement.DecommissionManager$Monitor@4d42851a" daemon prio=10 tid=0x00007f58bd162800 nid=0x53fc waiting on condition [0x00007f58a5836000]
   java.lang.Thread.State: TIMED_WAITING (sleeping)
	at java.lang.Thread.sleep(Native Method)
	at org.apache.hadoop.hdfs.server.blockmanagement.DecommissionManager$Monitor.run(DecommissionManager.java:76)
	at java.lang.Thread.run(Thread.java:745)

"org.apache.hadoop.hdfs.server.blockmanagement.PendingReplicationBlocks$PendingReplicationMonitor@20614169" daemon prio=10 tid=0x00007f58bd160000 nid=0x53fb waiting on condition [0x00007f58a5937000]
   java.lang.Thread.State: TIMED_WAITING (sleeping)
	at java.lang.Thread.sleep(Native Method)
	at org.apache.hadoop.hdfs.server.blockmanagement.PendingReplicationBlocks$PendingReplicationMonitor.run(PendingReplicationBlocks.java:221)
	at java.lang.Thread.run(Thread.java:745)

"org.apache.hadoop.util.JvmPauseMonitor$Monitor@4985566f" daemon prio=10 tid=0x00007f58bd158000 nid=0x53f5 waiting on condition [0x00007f58a5b39000]
   java.lang.Thread.State: TIMED_WAITING (sleeping)
	at java.lang.Thread.sleep(Native Method)
	at org.apache.hadoop.util.JvmPauseMonitor$Monitor.run(JvmPauseMonitor.java:180)
	at java.lang.Thread.run(Thread.java:745)

"IPC Server idle connection scanner for port 36799" daemon prio=10 tid=0x00007f58bd138800 nid=0x53ee in Object.wait() [0x00007f58a5c3a000]
   java.lang.Thread.State: TIMED_WAITING (on object monitor)
	at java.lang.Object.wait(Native Method)
	- waiting on <0x0000000755b48270> (a java.util.TaskQueue)
	at java.util.TimerThread.mainLoop(Timer.java:552)
	- locked <0x0000000755b48270> (a java.util.TaskQueue)
	at java.util.TimerThread.run(Timer.java:505)

"Socket Reader #1 for port 36799" prio=10 tid=0x00007f58bd137000 nid=0x53ec runnable [0x00007f58a5d3b000]
   java.lang.Thread.State: RUNNABLE
	at sun.nio.ch.EPollArrayWrapper.epollWait(Native Method)
	at sun.nio.ch.EPollArrayWrapper.poll(EPollArrayWrapper.java:269)
	at sun.nio.ch.EPollSelectorImpl.doSelect(EPollSelectorImpl.java:79)
	at sun.nio.ch.SelectorImpl.lockAndDoSelect(SelectorImpl.java:87)
	- locked <0x0000000755b46620> (a sun.nio.ch.Util$2)
	- locked <0x0000000755b46610> (a java.util.Collections$UnmodifiableSet)
	- locked <0x0000000755b374d0> (a sun.nio.ch.EPollSelectorImpl)
	at sun.nio.ch.SelectorImpl.select(SelectorImpl.java:98)
	at sun.nio.ch.SelectorImpl.select(SelectorImpl.java:102)
	at org.apache.hadoop.ipc.Server$Listener$Reader.doRunLoop(Server.java:616)
	- locked <0x0000000755b476b8> (a org.apache.hadoop.ipc.Server$Listener$Reader)
	at org.apache.hadoop.ipc.Server$Listener$Reader.run(Server.java:595)

"Timer-0" daemon prio=10 tid=0x00007f58bd007000 nid=0x53a8 in Object.wait() [0x00007f58a5e3c000]
   java.lang.Thread.State: TIMED_WAITING (on object monitor)
	at java.lang.Object.wait(Native Method)
	- waiting on <0x0000000755b82438> (a java.util.TaskQueue)
	at java.util.TimerThread.mainLoop(Timer.java:552)
	- locked <0x0000000755b82438> (a java.util.TaskQueue)
	at java.util.TimerThread.run(Timer.java:505)

"62827821@qtp-1129564105-1 - Acceptor0 HttpServer2$SelectChannelConnectorWithSafeStartup@localhost:58377" daemon prio=10 tid=0x00007f58bcfe7800 nid=0x538e runnable [0x00007f58a5f3d000]
   java.lang.Thread.State: RUNNABLE
	at sun.nio.ch.EPollArrayWrapper.epollWait(Native Method)
	at sun.nio.ch.EPollArrayWrapper.poll(EPollArrayWrapper.java:269)
	at sun.nio.ch.EPollSelectorImpl.doSelect(EPollSelectorImpl.java:79)
	at sun.nio.ch.SelectorImpl.lockAndDoSelect(SelectorImpl.java:87)
	- locked <0x0000000755b89cf0> (a sun.nio.ch.Util$2)
	- locked <0x0000000755b89ce0> (a java.util.Collections$UnmodifiableSet)
	- locked <0x0000000755b89910> (a sun.nio.ch.EPollSelectorImpl)
	at sun.nio.ch.SelectorImpl.select(SelectorImpl.java:98)
	at org.mortbay.io.nio.SelectorManager$SelectSet.doSelect(SelectorManager.java:498)
	at org.mortbay.io.nio.SelectorManager.doSelect(SelectorManager.java:192)
	at org.mortbay.jetty.nio.SelectChannelConnector.accept(SelectChannelConnector.java:124)
	at org.mortbay.jetty.AbstractConnector$Acceptor.run(AbstractConnector.java:708)
	at org.mortbay.thread.QueuedThreadPool$PoolThread.run(QueuedThreadPool.java:582)

"1893298698@qtp-1129564105-0" daemon prio=10 tid=0x00007f58bcfe7000 nid=0x538d in Object.wait() [0x00007f58a603e000]
   java.lang.Thread.State: TIMED_WAITING (on object monitor)
	at java.lang.Object.wait(Native Method)
	- waiting on <0x0000000755b89fc0> (a org.mortbay.thread.QueuedThreadPool$PoolThread)
	at org.mortbay.thread.QueuedThreadPool$PoolThread.run(QueuedThreadPool.java:626)
	- locked <0x0000000755b89fc0> (a org.mortbay.thread.QueuedThreadPool$PoolThread)

"Service Thread" daemon prio=10 tid=0x00007f58bc29b800 nid=0x5221 runnable [0x0000000000000000]
   java.lang.Thread.State: RUNNABLE

"C2 CompilerThread1" daemon prio=10 tid=0x00007f58bc299000 nid=0x5220 waiting on condition [0x0000000000000000]
   java.lang.Thread.State: RUNNABLE

"C2 CompilerThread0" daemon prio=10 tid=0x00007f58bc296000 nid=0x521f waiting on condition [0x0000000000000000]
   java.lang.Thread.State: RUNNABLE

"Signal Dispatcher" daemon prio=10 tid=0x00007f58bc294000 nid=0x521e runnable [0x0000000000000000]
   java.lang.Thread.State: RUNNABLE

"Finalizer" daemon prio=10 tid=0x00007f58bc26b800 nid=0x521b in Object.wait() [0x00007f58a7efd000]
   java.lang.Thread.State: WAITING (on object monitor)
	at java.lang.Object.wait(Native Method)
	- waiting on <0x00000007dd6ae738> (a java.lang.ref.ReferenceQueue$Lock)
	at java.lang.ref.ReferenceQueue.remove(ReferenceQueue.java:135)
	- locked <0x00000007dd6ae738> (a java.lang.ref.ReferenceQueue$Lock)
	at java.lang.ref.ReferenceQueue.remove(ReferenceQueue.java:151)
	at java.lang.ref.Finalizer$FinalizerThread.run(Finalizer.java:209)

"Reference Handler" daemon prio=10 tid=0x00007f58bc269000 nid=0x521a in Object.wait() [0x00007f58a7ffe000]
   java.lang.Thread.State: WAITING (on object monitor)
	at java.lang.Object.wait(Native Method)
	- waiting on <0x00000007dd6ae300> (a java.lang.ref.Reference$Lock)
	at java.lang.Object.wait(Object.java:503)
	at java.lang.ref.Reference$ReferenceHandler.run(Reference.java:133)
	- locked <0x00000007dd6ae300> (a java.lang.ref.Reference$Lock)

"main" prio=10 tid=0x00007f58bc00a800 nid=0x520b in Object.wait() [0x00007f58c2a06000]
   java.lang.Thread.State: WAITING (on object monitor)
	at java.lang.Object.wait(Native Method)
	- waiting on <0x00000007caff2508> (a [Lorg.apache.hadoop.hbase.client.ResultBoundedCompletionService$QueueingFuture;)
	at java.lang.Object.wait(Object.java:503)
	at org.apache.hadoop.hbase.client.ResultBoundedCompletionService.take(ResultBoundedCompletionService.java:148)
	- locked <0x00000007caff2508> (a [Lorg.apache.hadoop.hbase.client.ResultBoundedCompletionService$QueueingFuture;)
	at org.apache.hadoop.hbase.client.ScannerCallableWithReplicas.call(ScannerCallableWithReplicas.java:188)
	at org.apache.hadoop.hbase.client.ScannerCallableWithReplicas.call(ScannerCallableWithReplicas.java:59)
	at org.apache.hadoop.hbase.client.RpcRetryingCaller.callWithoutRetries(RpcRetryingCaller.java:200)
	at org.apache.hadoop.hbase.client.ClientSmallReversedScanner.loadCache(ClientSmallReversedScanner.java:212)
	at org.apache.hadoop.hbase.client.ClientSmallReversedScanner.next(ClientSmallReversedScanner.java:186)
	at org.apache.hadoop.hbase.client.ConnectionManager$HConnectionImplementation.locateRegionInMeta(ConnectionManager.java:1252)
	at org.apache.hadoop.hbase.client.ConnectionManager$HConnectionImplementation.locateRegion(ConnectionManager.java:1158)
	at org.apache.hadoop.hbase.client.ConnectionManager$HConnectionImplementation.relocateRegion(ConnectionManager.java:1129)
	at org.apache.hadoop.hbase.client.ConnectionManager$HConnectionImplementation.relocateRegion(ConnectionManager.java:1113)
	at org.apache.hadoop.hbase.client.ConnectionManager$HConnectionImplementation.getRegionLocation(ConnectionManager.java:934)
	at org.apache.hadoop.hbase.client.HRegionLocator.getRegionLocation(HRegionLocator.java:83)
	at org.apache.hadoop.hbase.client.RegionServerCallable.prepare(RegionServerCallable.java:79)
	at org.apache.hadoop.hbase.client.RpcRetryingCaller.callWithRetries(RpcRetryingCaller.java:124)
	at org.apache.hadoop.hbase.ipc.RegionCoprocessorRpcChannel.callExecService(RegionCoprocessorRpcChannel.java:95)
	at org.apache.hadoop.hbase.ipc.CoprocessorRpcChannel.callBlockingMethod(CoprocessorRpcChannel.java:73)
	at org.apache.hadoop.hbase.protobuf.generated.AccessControlProtos$AccessControlService$BlockingStub.grant(AccessControlProtos.java:10280)
	at org.apache.hadoop.hbase.protobuf.ProtobufUtil.grant(ProtobufUtil.java:2181)
	at org.apache.hadoop.hbase.security.access.SecureTestUtil$2.call(SecureTestUtil.java:367)
	at org.apache.hadoop.hbase.security.access.SecureTestUtil$2.call(SecureTestUtil.java:359)
	at org.apache.hadoop.hbase.security.access.SecureTestUtil.updateACLs(SecureTestUtil.java:324)
	at org.apache.hadoop.hbase.security.access.SecureTestUtil.grantGlobal(SecureTestUtil.java:359)
	at org.apache.hadoop.hbase.security.access.TestNamespaceCommands.beforeClass(TestNamespaceCommands.java:152)
	at sun.reflect.NativeMethodAccessorImpl.invoke0(Native Method)
	at sun.reflect.NativeMethodAccessorImpl.invoke(NativeMethodAccessorImpl.java:57)
	at sun.reflect.DelegatingMethodAccessorImpl.invoke(DelegatingMethodAccessorImpl.java:43)
	at java.lang.reflect.Method.invoke(Method.java:606)
	at org.junit.runners.model.FrameworkMethod$1.runReflectiveCall(FrameworkMethod.java:50)
	at org.junit.internal.runners.model.ReflectiveCallable.run(ReflectiveCallable.java:12)
	at org.junit.runners.model.FrameworkMethod.invokeExplosively(FrameworkMethod.java:47)
	at org.junit.internal.runners.statements.RunBefores.evaluate(RunBefores.java:24)
	at org.junit.internal.runners.statements.RunAfters.evaluate(RunAfters.java:27)
	at org.junit.runners.ParentRunner.run(ParentRunner.java:363)
	at org.junit.runners.Suite.runChild(Suite.java:128)
	at org.junit.runners.Suite.runChild(Suite.java:27)
	at org.junit.runners.ParentRunner$3.run(ParentRunner.java:290)
	at org.junit.runners.ParentRunner$1.schedule(ParentRunner.java:71)
	at org.junit.runners.ParentRunner.runChildren(ParentRunner.java:288)
	at org.junit.runners.ParentRunner.access$000(ParentRunner.java:58)
	at org.junit.runners.ParentRunner$2.evaluate(ParentRunner.java:268)
	at org.junit.runners.ParentRunner.run(ParentRunner.java:363)
	at org.junit.runner.JUnitCore.run(JUnitCore.java:137)
	at org.junit.runner.JUnitCore.run(JUnitCore.java:115)
	at org.apache.maven.surefire.junitcore.JUnitCoreWrapper.createRequestAndRun(JUnitCoreWrapper.java:107)
	at org.apache.maven.surefire.junitcore.JUnitCoreWrapper.executeEager(JUnitCoreWrapper.java:77)
	at org.apache.maven.surefire.junitcore.JUnitCoreWrapper.execute(JUnitCoreWrapper.java:53)
	at org.apache.maven.surefire.junitcore.JUnitCoreProvider.invoke(JUnitCoreProvider.java:144)
	at org.apache.maven.surefire.booter.ForkedBooter.invokeProviderInSameClassLoader(ForkedBooter.java:203)
	at org.apache.maven.surefire.booter.ForkedBooter.runSuitesInProcess(ForkedBooter.java:155)
	at org.apache.maven.surefire.booter.ForkedBooter.main(ForkedBooter.java:103)

"VM Thread" prio=10 tid=0x00007f58bc265000 nid=0x5219 runnable 

"GC task thread#0 (ParallelGC)" prio=10 tid=0x00007f58bc020800 nid=0x520c runnable 

"GC task thread#1 (ParallelGC)" prio=10 tid=0x00007f58bc022000 nid=0x520d runnable 

"GC task thread#2 (ParallelGC)" prio=10 tid=0x00007f58bc024000 nid=0x520e runnable 

"GC task thread#3 (ParallelGC)" prio=10 tid=0x00007f58bc026000 nid=0x520f runnable 

"GC task thread#4 (ParallelGC)" prio=10 tid=0x00007f58bc028000 nid=0x5210 runnable 

"GC task thread#5 (ParallelGC)" prio=10 tid=0x00007f58bc029800 nid=0x5211 runnable 

"GC task thread#6 (ParallelGC)" prio=10 tid=0x00007f58bc02b800 nid=0x5212 runnable 

"GC task thread#7 (ParallelGC)" prio=10 tid=0x00007f58bc02d800 nid=0x5213 runnable 

"GC task thread#8 (ParallelGC)" prio=10 tid=0x00007f58bc02f000 nid=0x5214 runnable 

"GC task thread#9 (ParallelGC)" prio=10 tid=0x00007f58bc031000 nid=0x5215 runnable 

"GC task thread#10 (ParallelGC)" prio=10 tid=0x00007f58bc033000 nid=0x5216 runnable 

"GC task thread#11 (ParallelGC)" prio=10 tid=0x00007f58bc035000 nid=0x5217 runnable 

"GC task thread#12 (ParallelGC)" prio=10 tid=0x00007f58bc036800 nid=0x5218 runnable 

"VM Periodic Task Thread" prio=10 tid=0x00007f58bc2a6000 nid=0x5222 waiting on condition 

JNI global references: 203

+ echo '************ END  zombies jstack extract'
************ END  zombies jstack extract
+ JIRA_COMMENT='

     {color:red}-1 core zombie tests{color}.  There are 5 zombie test(s): 	at org.apache.hadoop.hdfs.web.TestWebHDFS.testNamenodeRestart(TestWebHDFS.java:241)'
+ BAD=1
+ jps
+ grep surefirebooter
+ cut -d ' ' -f 1
+ xargs kill -9
POST BUILD TASK : SUCCESS
END OF POST BUILD TASK : 0
Archiving artifacts
Sending artifact delta relative to HBase-1.3 » latest1.7,Hadoop #108
Archived 1847 artifacts
Archive block size is 32768
Received 27 blocks and 422673457 bytes
Compression is 0.2%
Took 1 min 54 sec

Build failed in Jenkins: HBase-1.3 » latest1.7,Hadoop #138

Posted by Apache Jenkins Server <je...@builds.apache.org>.
See <https://builds.apache.org/job/HBase-1.3/jdk=latest1.7,label=Hadoop/138/changes>

Changes:

[eclark] HBASE-14313 After a Connection sees ConnectionClosingException on a connection it never recovers

[eclark] HBASE-14313 After a Connection sees ConnectionClosingException it never recovers -- ADDENDUM

------------------------------------------
[...truncated 51425 lines...]

"GC task thread#9 (ParallelGC)" prio=10 tid=0x00007fde80031000 nid=0x2293 runnable 

"GC task thread#10 (ParallelGC)" prio=10 tid=0x00007fde80033000 nid=0x2294 runnable 

"GC task thread#11 (ParallelGC)" prio=10 tid=0x00007fde80035000 nid=0x2295 runnable 

"GC task thread#12 (ParallelGC)" prio=10 tid=0x00007fde80036800 nid=0x2296 runnable 

"VM Periodic Task Thread" prio=10 tid=0x00007fde802a6000 nid=0x229e waiting on condition 

JNI global references: 211

2015-08-28 01:44:56
Full thread dump Java HotSpot(TM) 64-Bit Server VM (25.0-b70 mixed mode):

"Attach Listener" #139 daemon prio=9 os_prio=0 tid=0x00007f470834e800 nid=0x453f waiting on condition [0x0000000000000000]
   java.lang.Thread.State: RUNNABLE

"Readahead Thread #3" #39 daemon prio=5 os_prio=0 tid=0x00007f4708430000 nid=0x40a5 waiting on condition [0x00007f46fdd7e000]
   java.lang.Thread.State: WAITING (parking)
	at sun.misc.Unsafe.park(Native Method)
	- parking to wait for  <0x00000006c0d0ddc8> (a java.util.concurrent.locks.AbstractQueuedSynchronizer$ConditionObject)
	at java.util.concurrent.locks.LockSupport.park(LockSupport.java:175)
	at java.util.concurrent.locks.AbstractQueuedSynchronizer$ConditionObject.await(AbstractQueuedSynchronizer.java:2039)
	at java.util.concurrent.ArrayBlockingQueue.take(ArrayBlockingQueue.java:403)
	at java.util.concurrent.ThreadPoolExecutor.getTask(ThreadPoolExecutor.java:1067)
	at java.util.concurrent.ThreadPoolExecutor.runWorker(ThreadPoolExecutor.java:1127)
	at java.util.concurrent.ThreadPoolExecutor$Worker.run(ThreadPoolExecutor.java:617)
	at java.lang.Thread.run(Thread.java:744)

"Readahead Thread #2" #38 daemon prio=5 os_prio=0 tid=0x00007f470842e800 nid=0x40a4 waiting on condition [0x00007f46fde7f000]
   java.lang.Thread.State: WAITING (parking)
	at sun.misc.Unsafe.park(Native Method)
	- parking to wait for  <0x00000006c0d0ddc8> (a java.util.concurrent.locks.AbstractQueuedSynchronizer$ConditionObject)
	at java.util.concurrent.locks.LockSupport.park(LockSupport.java:175)
	at java.util.concurrent.locks.AbstractQueuedSynchronizer$ConditionObject.await(AbstractQueuedSynchronizer.java:2039)
	at java.util.concurrent.ArrayBlockingQueue.take(ArrayBlockingQueue.java:403)
	at java.util.concurrent.ThreadPoolExecutor.getTask(ThreadPoolExecutor.java:1067)
	at java.util.concurrent.ThreadPoolExecutor.runWorker(ThreadPoolExecutor.java:1127)
	at java.util.concurrent.ThreadPoolExecutor$Worker.run(ThreadPoolExecutor.java:617)
	at java.lang.Thread.run(Thread.java:744)

"Readahead Thread #1" #37 daemon prio=5 os_prio=0 tid=0x00007f47083dc800 nid=0x40a2 waiting on condition [0x00007f46fdf80000]
   java.lang.Thread.State: WAITING (parking)
	at sun.misc.Unsafe.park(Native Method)
	- parking to wait for  <0x00000006c0d0ddc8> (a java.util.concurrent.locks.AbstractQueuedSynchronizer$ConditionObject)
	at java.util.concurrent.locks.LockSupport.park(LockSupport.java:175)
	at java.util.concurrent.locks.AbstractQueuedSynchronizer$ConditionObject.await(AbstractQueuedSynchronizer.java:2039)
	at java.util.concurrent.ArrayBlockingQueue.take(ArrayBlockingQueue.java:403)
	at java.util.concurrent.ThreadPoolExecutor.getTask(ThreadPoolExecutor.java:1067)
	at java.util.concurrent.ThreadPoolExecutor.runWorker(ThreadPoolExecutor.java:1127)
	at java.util.concurrent.ThreadPoolExecutor$Worker.run(ThreadPoolExecutor.java:617)
	at java.lang.Thread.run(Thread.java:744)

"Readahead Thread #0" #36 daemon prio=5 os_prio=0 tid=0x00007f47083db800 nid=0x40a0 waiting on condition [0x00007f46fe081000]
   java.lang.Thread.State: WAITING (parking)
	at sun.misc.Unsafe.park(Native Method)
	- parking to wait for  <0x00000006c0d0ddc8> (a java.util.concurrent.locks.AbstractQueuedSynchronizer$ConditionObject)
	at java.util.concurrent.locks.LockSupport.park(LockSupport.java:175)
	at java.util.concurrent.locks.AbstractQueuedSynchronizer$ConditionObject.await(AbstractQueuedSynchronizer.java:2039)
	at java.util.concurrent.ArrayBlockingQueue.take(ArrayBlockingQueue.java:403)
	at java.util.concurrent.ThreadPoolExecutor.getTask(ThreadPoolExecutor.java:1067)
	at java.util.concurrent.ThreadPoolExecutor.runWorker(ThreadPoolExecutor.java:1127)
	at java.util.concurrent.ThreadPoolExecutor$Worker.run(ThreadPoolExecutor.java:617)
	at java.lang.Thread.run(Thread.java:744)

"org.apache.hadoop.fs.FileSystem$Statistics$StatisticsDataReferenceCleaner" #21 daemon prio=5 os_prio=0 tid=0x00007f4728a87000 nid=0x3ffa in Object.wait() [0x00007f46fffc5000]
   java.lang.Thread.State: WAITING (on object monitor)
	at java.lang.Object.wait(Native Method)
	at java.lang.ref.ReferenceQueue.remove(ReferenceQueue.java:142)
	- locked <0x00000006c033daf0> (a java.lang.ref.ReferenceQueue$Lock)
	at java.lang.ref.ReferenceQueue.remove(ReferenceQueue.java:158)
	at org.apache.hadoop.fs.FileSystem$Statistics$StatisticsDataReferenceCleaner.run(FileSystem.java:3117)
	at java.lang.Thread.run(Thread.java:744)

"process reaper" #19 daemon prio=10 os_prio=0 tid=0x00007f47289c2000 nid=0x3ff4 waiting on condition [0x00007f46ffffe000]
   java.lang.Thread.State: TIMED_WAITING (parking)
	at sun.misc.Unsafe.park(Native Method)
	- parking to wait for  <0x00000006c024e428> (a java.util.concurrent.SynchronousQueue$TransferStack)
	at java.util.concurrent.locks.LockSupport.parkNanos(LockSupport.java:215)
	at java.util.concurrent.SynchronousQueue$TransferStack.awaitFulfill(SynchronousQueue.java:460)
	at java.util.concurrent.SynchronousQueue$TransferStack.transfer(SynchronousQueue.java:362)
	at java.util.concurrent.SynchronousQueue.poll(SynchronousQueue.java:941)
	at java.util.concurrent.ThreadPoolExecutor.getTask(ThreadPoolExecutor.java:1066)
	at java.util.concurrent.ThreadPoolExecutor.runWorker(ThreadPoolExecutor.java:1127)
	at java.util.concurrent.ThreadPoolExecutor$Worker.run(ThreadPoolExecutor.java:617)
	at java.lang.Thread.run(Thread.java:744)

"Service Thread" #17 daemon prio=9 os_prio=0 tid=0x00007f47282eb000 nid=0x3f61 runnable [0x0000000000000000]
   java.lang.Thread.State: RUNNABLE

"C1 CompilerThread11" #16 daemon prio=9 os_prio=0 tid=0x00007f47282e6000 nid=0x3f60 waiting on condition [0x0000000000000000]
   java.lang.Thread.State: RUNNABLE

"C1 CompilerThread10" #15 daemon prio=9 os_prio=0 tid=0x00007f47282db800 nid=0x3f5f waiting on condition [0x0000000000000000]
   java.lang.Thread.State: RUNNABLE

"C1 CompilerThread9" #14 daemon prio=9 os_prio=0 tid=0x00007f47282d9800 nid=0x3f5e waiting on condition [0x0000000000000000]
   java.lang.Thread.State: RUNNABLE

"C1 CompilerThread8" #13 daemon prio=9 os_prio=0 tid=0x00007f47282d7000 nid=0x3f5c waiting on condition [0x0000000000000000]
   java.lang.Thread.State: RUNNABLE

"C2 CompilerThread7" #12 daemon prio=9 os_prio=0 tid=0x00007f47282d5000 nid=0x3f5b waiting on condition [0x0000000000000000]
   java.lang.Thread.State: RUNNABLE

"C2 CompilerThread6" #11 daemon prio=9 os_prio=0 tid=0x00007f47282ca800 nid=0x3f5a waiting on condition [0x0000000000000000]
   java.lang.Thread.State: RUNNABLE

"C2 CompilerThread5" #10 daemon prio=9 os_prio=0 tid=0x00007f47282c8800 nid=0x3f59 waiting on condition [0x0000000000000000]
   java.lang.Thread.State: RUNNABLE

"C2 CompilerThread4" #9 daemon prio=9 os_prio=0 tid=0x00007f47282b6000 nid=0x3f58 waiting on condition [0x0000000000000000]
   java.lang.Thread.State: RUNNABLE

"C2 CompilerThread3" #8 daemon prio=9 os_prio=0 tid=0x00007f47282b4000 nid=0x3f57 waiting on condition [0x0000000000000000]
   java.lang.Thread.State: RUNNABLE

"C2 CompilerThread2" #7 daemon prio=9 os_prio=0 tid=0x00007f47282af800 nid=0x3f56 waiting on condition [0x0000000000000000]
   java.lang.Thread.State: RUNNABLE

"C2 CompilerThread1" #6 daemon prio=9 os_prio=0 tid=0x00007f47282ad800 nid=0x3f55 waiting on condition [0x0000000000000000]
   java.lang.Thread.State: RUNNABLE

"C2 CompilerThread0" #5 daemon prio=9 os_prio=0 tid=0x00007f47282ab000 nid=0x3f54 waiting on condition [0x0000000000000000]
   java.lang.Thread.State: RUNNABLE

"Signal Dispatcher" #4 daemon prio=9 os_prio=0 tid=0x00007f47282a8800 nid=0x3f53 runnable [0x0000000000000000]
   java.lang.Thread.State: RUNNABLE

"Finalizer" #3 daemon prio=8 os_prio=0 tid=0x00007f472827b800 nid=0x3f52 in Object.wait() [0x00007f470e3e2000]
   java.lang.Thread.State: WAITING (on object monitor)
	at java.lang.Object.wait(Native Method)
	at java.lang.ref.ReferenceQueue.remove(ReferenceQueue.java:142)
	- locked <0x00000006c0101d70> (a java.lang.ref.ReferenceQueue$Lock)
	at java.lang.ref.ReferenceQueue.remove(ReferenceQueue.java:158)
	at java.lang.ref.Finalizer$FinalizerThread.run(Finalizer.java:209)

"Reference Handler" #2 daemon prio=10 os_prio=0 tid=0x00007f4728272000 nid=0x3f51 in Object.wait() [0x00007f470e4e3000]
   java.lang.Thread.State: WAITING (on object monitor)
	at java.lang.Object.wait(Native Method)
	at java.lang.Object.wait(Object.java:502)
	at java.lang.ref.Reference$ReferenceHandler.run(Reference.java:157)
	- locked <0x00000006c010f530> (a java.lang.ref.Reference$Lock)

"main" #1 prio=5 os_prio=0 tid=0x00007f472800a800 nid=0x3f42 runnable [0x00007f472e093000]
   java.lang.Thread.State: RUNNABLE
	at org.apache.hadoop.io.compress.zlib.ZlibCompressor.deflateBytesDirect(Native Method)
	at org.apache.hadoop.io.compress.zlib.ZlibCompressor.compress(ZlibCompressor.java:365)
	at org.apache.hadoop.io.compress.CompressorStream.compress(CompressorStream.java:81)
	at org.apache.hadoop.io.compress.CompressorStream.write(CompressorStream.java:76)
	at java.io.BufferedOutputStream.write(BufferedOutputStream.java:122)
	- locked <0x0000000775a8c298> (a java.io.BufferedOutputStream)
	at java.io.DataOutputStream.write(DataOutputStream.java:107)
	- locked <0x0000000775a8c278> (a java.io.DataOutputStream)
	at org.apache.hadoop.io.Text.write(Text.java:331)
	at org.apache.hadoop.io.serializer.WritableSerialization$WritableSerializer.serialize(WritableSerialization.java:98)
	at org.apache.hadoop.io.serializer.WritableSerialization$WritableSerializer.serialize(WritableSerialization.java:82)
	at org.apache.hadoop.io.SequenceFile$RecordCompressWriter.append(SequenceFile.java:1466)
	- locked <0x0000000775f500a0> (a org.apache.hadoop.io.SequenceFile$RecordCompressWriter)
	at org.apache.hadoop.io.SequenceFile$Writer.append(SequenceFile.java:1367)
	at org.apache.hadoop.mapred.nativetask.kvtest.TestInputFile.flushBuf(TestInputFile.java:218)
	at org.apache.hadoop.mapred.nativetask.kvtest.TestInputFile.createSequenceTestFile(TestInputFile.java:156)
	at org.apache.hadoop.mapred.nativetask.kvtest.TestInputFile.createSequenceTestFile(TestInputFile.java:124)
	at org.apache.hadoop.mapred.nativetask.kvtest.TestInputFile.createSequenceTestFile(TestInputFile.java:120)
	at org.apache.hadoop.mapred.nativetask.kvtest.KVJob.<init>(KVJob.java:98)
	at org.apache.hadoop.mapred.nativetask.kvtest.LargeKVTest.runKVSizeTests(LargeKVTest.java:107)
	at org.apache.hadoop.mapred.nativetask.kvtest.LargeKVTest.testValueSize(LargeKVTest.java:67)
	at sun.reflect.NativeMethodAccessorImpl.invoke0(Native Method)
	at sun.reflect.NativeMethodAccessorImpl.invoke(NativeMethodAccessorImpl.java:62)
	at sun.reflect.DelegatingMethodAccessorImpl.invoke(DelegatingMethodAccessorImpl.java:43)
	at java.lang.reflect.Method.invoke(Method.java:483)
	at org.junit.runners.model.FrameworkMethod$1.runReflectiveCall(FrameworkMethod.java:47)
	at org.junit.internal.runners.model.ReflectiveCallable.run(ReflectiveCallable.java:12)
	at org.junit.runners.model.FrameworkMethod.invokeExplosively(FrameworkMethod.java:44)
	at org.junit.internal.runners.statements.InvokeMethod.evaluate(InvokeMethod.java:17)
	at org.junit.internal.runners.statements.RunBefores.evaluate(RunBefores.java:26)
	at org.junit.runners.ParentRunner.runLeaf(ParentRunner.java:271)
	at org.junit.runners.BlockJUnit4ClassRunner.runChild(BlockJUnit4ClassRunner.java:70)
	at org.junit.runners.BlockJUnit4ClassRunner.runChild(BlockJUnit4ClassRunner.java:50)
	at org.junit.runners.ParentRunner$3.run(ParentRunner.java:238)
	at org.junit.runners.ParentRunner$1.schedule(ParentRunner.java:63)
	at org.junit.runners.ParentRunner.runChildren(ParentRunner.java:236)
	at org.junit.runners.ParentRunner.access$000(ParentRunner.java:53)
	at org.junit.runners.ParentRunner$2.evaluate(ParentRunner.java:229)
	at org.junit.internal.runners.statements.RunAfters.evaluate(RunAfters.java:27)
	at org.junit.runners.ParentRunner.run(ParentRunner.java:309)
	at org.apache.maven.surefire.junit4.JUnit4Provider.execute(JUnit4Provider.java:264)
	at org.apache.maven.surefire.junit4.JUnit4Provider.executeTestSet(JUnit4Provider.java:153)
	at org.apache.maven.surefire.junit4.JUnit4Provider.invoke(JUnit4Provider.java:124)
	at org.apache.maven.surefire.booter.ForkedBooter.invokeProviderInSameClassLoader(ForkedBooter.java:200)
	at org.apache.maven.surefire.booter.ForkedBooter.runSuitesInProcess(ForkedBooter.java:153)
	at org.apache.maven.surefire.booter.ForkedBooter.main(ForkedBooter.java:103)

"VM Thread" os_prio=0 tid=0x00007f472826d000 nid=0x3f50 runnable 

"GC task thread#0 (ParallelGC)" os_prio=0 tid=0x00007f472801f800 nid=0x3f43 runnable 

"GC task thread#1 (ParallelGC)" os_prio=0 tid=0x00007f4728021800 nid=0x3f44 runnable 

"GC task thread#2 (ParallelGC)" os_prio=0 tid=0x00007f4728023000 nid=0x3f45 runnable 

"GC task thread#3 (ParallelGC)" os_prio=0 tid=0x00007f4728025000 nid=0x3f46 runnable 

"GC task thread#4 (ParallelGC)" os_prio=0 tid=0x00007f4728026800 nid=0x3f47 runnable 

"GC task thread#5 (ParallelGC)" os_prio=0 tid=0x00007f4728028800 nid=0x3f48 runnable 

"GC task thread#6 (ParallelGC)" os_prio=0 tid=0x00007f472802a000 nid=0x3f49 runnable 

"GC task thread#7 (ParallelGC)" os_prio=0 tid=0x00007f472802c000 nid=0x3f4a runnable 

"GC task thread#8 (ParallelGC)" os_prio=0 tid=0x00007f472802d800 nid=0x3f4b runnable 

"GC task thread#9 (ParallelGC)" os_prio=0 tid=0x00007f472802f800 nid=0x3f4c runnable 

"GC task thread#10 (ParallelGC)" os_prio=0 tid=0x00007f4728031000 nid=0x3f4d runnable 

"GC task thread#11 (ParallelGC)" os_prio=0 tid=0x00007f4728033000 nid=0x3f4e runnable 

"GC task thread#12 (ParallelGC)" os_prio=0 tid=0x00007f4728034800 nid=0x3f4f runnable 

"VM Periodic Task Thread" os_prio=0 tid=0x00007f47282ed800 nid=0x3f62 waiting on condition 

JNI global references: 127

+ echo '************ END  zombies jstack extract'
************ END  zombies jstack extract
+ JIRA_COMMENT='

     {color:red}-1 core zombie tests{color}.  There are 3 zombie test(s): 	at org.apache.hadoop.mapred.nativetask.kvtest.HashSumReducer.reduce(HashSumReducer.java:42)
	at org.apache.hadoop.mapred.nativetask.kvtest.KVJob.runJob(KVJob.java:108)
	at org.apache.hadoop.mapred.nativetask.kvtest.LargeKVTest.runKVSizeTests(LargeKVTest.java:117)
	at org.apache.hadoop.mapred.nativetask.kvtest.LargeKVTest.testValueSize(LargeKVTest.java:67)'
+ BAD=1
+ jps
+ grep surefirebooter
+ cut -d ' ' -f 1
+ xargs kill -9
POST BUILD TASK : SUCCESS
END OF POST BUILD TASK : 0
Archiving artifacts
Sending artifact delta relative to HBase-1.3 » latest1.7,Hadoop #108
Archived 2134 artifacts
Archive block size is 32768
Received 27 blocks and 663210740 bytes
Compression is 0.1%
Took 2 min 39 sec

Build failed in Jenkins: HBase-1.3 » latest1.7,Hadoop #137

Posted by Apache Jenkins Server <je...@builds.apache.org>.
See <https://builds.apache.org/job/HBase-1.3/jdk=latest1.7,label=Hadoop/137/changes>

Changes:

[tedyu] HBASE-14269 FuzzyRowFilter omits certain rows when multiple fuzzy keys exist (hongbin ma)

------------------------------------------
[...truncated 46173 lines...]
Tests run: 6, Failures: 0, Errors: 0, Skipped: 0, Time elapsed: 0.544 sec - in org.apache.hadoop.hbase.client.TestPutDeleteEtcCellIteration
Running org.apache.hadoop.hbase.client.TestHBaseAdminNoCluster
Tests run: 2, Failures: 0, Errors: 0, Skipped: 1, Time elapsed: 6.667 sec - in org.apache.hadoop.hbase.client.TestHBaseAdminNoCluster
Running org.apache.hadoop.hbase.client.TestConnectionUtils
Tests run: 1, Failures: 0, Errors: 0, Skipped: 0, Time elapsed: 0.372 sec - in org.apache.hadoop.hbase.client.TestConnectionUtils
Running org.apache.hadoop.hbase.client.TestIntraRowPagination
Tests run: 1, Failures: 0, Errors: 0, Skipped: 0, Time elapsed: 1.753 sec - in org.apache.hadoop.hbase.client.TestIntraRowPagination
Running org.apache.hadoop.hbase.client.TestResult
Tests run: 9, Failures: 0, Errors: 0, Skipped: 0, Time elapsed: 0.664 sec - in org.apache.hadoop.hbase.client.TestResult
Running org.apache.hadoop.hbase.TestHDFSBlocksDistribution
Tests run: 2, Failures: 0, Errors: 0, Skipped: 0, Time elapsed: 0.361 sec - in org.apache.hadoop.hbase.TestHDFSBlocksDistribution
Running org.apache.hadoop.hbase.TestSerialization
Tests run: 9, Failures: 0, Errors: 0, Skipped: 0, Time elapsed: 1.483 sec - in org.apache.hadoop.hbase.TestSerialization
Running org.apache.hadoop.hbase.conf.TestConfigurationManager
Tests run: 2, Failures: 0, Errors: 0, Skipped: 0, Time elapsed: 0.404 sec - in org.apache.hadoop.hbase.conf.TestConfigurationManager
Running org.apache.hadoop.hbase.TestTagRewriteCell
Tests run: 1, Failures: 0, Errors: 0, Skipped: 0, Time elapsed: 0.364 sec - in org.apache.hadoop.hbase.TestTagRewriteCell
Running org.apache.hadoop.hbase.zookeeper.TestZooKeeperMainServer
Tests run: 2, Failures: 0, Errors: 0, Skipped: 0, Time elapsed: 1.125 sec - in org.apache.hadoop.hbase.zookeeper.TestZooKeeperMainServer
Running org.apache.hadoop.hbase.zookeeper.TestZKConfig
Tests run: 1, Failures: 0, Errors: 0, Skipped: 0, Time elapsed: 0.462 sec - in org.apache.hadoop.hbase.zookeeper.TestZKConfig
Running org.apache.hadoop.hbase.mapreduce.TestGroupingTableMapper
Tests run: 1, Failures: 0, Errors: 0, Skipped: 0, Time elapsed: 0.671 sec - in org.apache.hadoop.hbase.mapreduce.TestGroupingTableMapper
Running org.apache.hadoop.hbase.mapreduce.TestSimpleTotalOrderPartitioner
Tests run: 1, Failures: 0, Errors: 0, Skipped: 0, Time elapsed: 0.112 sec - in org.apache.hadoop.hbase.mapreduce.TestSimpleTotalOrderPartitioner
Running org.apache.hadoop.hbase.mapreduce.TestTableMapReduceUtil
Tests run: 4, Failures: 0, Errors: 0, Skipped: 0, Time elapsed: 3.523 sec - in org.apache.hadoop.hbase.mapreduce.TestTableMapReduceUtil
Running org.apache.hadoop.hbase.mapreduce.TestImportTsvParser
Tests run: 12, Failures: 0, Errors: 0, Skipped: 0, Time elapsed: 0.747 sec - in org.apache.hadoop.hbase.mapreduce.TestImportTsvParser
Running org.apache.hadoop.hbase.mapreduce.TestTableInputFormatBase
Tests run: 1, Failures: 0, Errors: 0, Skipped: 0, Time elapsed: 0.368 sec - in org.apache.hadoop.hbase.mapreduce.TestTableInputFormatBase
Running org.apache.hadoop.hbase.mapreduce.TestMultiTableSnapshotInputFormatImpl
Tests run: 4, Failures: 0, Errors: 0, Skipped: 0, Time elapsed: 1.496 sec - in org.apache.hadoop.hbase.mapreduce.TestMultiTableSnapshotInputFormatImpl
Running org.apache.hadoop.hbase.mapreduce.TestSerialization
Tests run: 2, Failures: 0, Errors: 0, Skipped: 0, Time elapsed: 2.103 sec - in org.apache.hadoop.hbase.mapreduce.TestSerialization
Running org.apache.hadoop.hbase.mapreduce.TestTableSplit
Tests run: 4, Failures: 0, Errors: 0, Skipped: 0, Time elapsed: 0.554 sec - in org.apache.hadoop.hbase.mapreduce.TestTableSplit
Running org.apache.hadoop.hbase.mapreduce.TestJarFinder
Tests run: 4, Failures: 0, Errors: 0, Skipped: 0, Time elapsed: 1.778 sec - in org.apache.hadoop.hbase.mapreduce.TestJarFinder
Running org.apache.hadoop.hbase.TestHRegionLocation
Tests run: 3, Failures: 0, Errors: 0, Skipped: 0, Time elapsed: 0.44 sec - in org.apache.hadoop.hbase.TestHRegionLocation
Running org.apache.hadoop.hbase.io.TestImmutableBytesWritable
Tests run: 3, Failures: 0, Errors: 0, Skipped: 0, Time elapsed: 0.418 sec - in org.apache.hadoop.hbase.io.TestImmutableBytesWritable
Running org.apache.hadoop.hbase.io.TestHFileLink
Tests run: 2, Failures: 0, Errors: 0, Skipped: 0, Time elapsed: 0.451 sec - in org.apache.hadoop.hbase.io.TestHFileLink
Running org.apache.hadoop.hbase.io.TestReference
Tests run: 1, Failures: 0, Errors: 0, Skipped: 0, Time elapsed: 0.693 sec - in org.apache.hadoop.hbase.io.TestReference
Running org.apache.hadoop.hbase.io.TestByteBufferOutputStream
Tests run: 1, Failures: 0, Errors: 0, Skipped: 0, Time elapsed: 0.355 sec - in org.apache.hadoop.hbase.io.TestByteBufferOutputStream
Running org.apache.hadoop.hbase.io.hfile.TestChecksum
Tests run: 4, Failures: 0, Errors: 0, Skipped: 0, Time elapsed: 1.397 sec - in org.apache.hadoop.hbase.io.hfile.TestChecksum
Running org.apache.hadoop.hbase.io.hfile.TestScannerSelectionUsingKeyRange
Tests run: 3, Failures: 0, Errors: 0, Skipped: 0, Time elapsed: 1.929 sec - in org.apache.hadoop.hbase.io.hfile.TestScannerSelectionUsingKeyRange
Running org.apache.hadoop.hbase.io.hfile.TestFixedFileTrailer
Tests run: 4, Failures: 0, Errors: 0, Skipped: 0, Time elapsed: 0.91 sec - in org.apache.hadoop.hbase.io.hfile.TestFixedFileTrailer
Running org.apache.hadoop.hbase.io.hfile.TestLruCachedBlock
Tests run: 1, Failures: 0, Errors: 0, Skipped: 0, Time elapsed: 0.513 sec - in org.apache.hadoop.hbase.io.hfile.TestLruCachedBlock
Running org.apache.hadoop.hbase.io.hfile.TestHFileDataBlockEncoder
Tests run: 30, Failures: 0, Errors: 0, Skipped: 0, Time elapsed: 1.797 sec - in org.apache.hadoop.hbase.io.hfile.TestHFileDataBlockEncoder
Running org.apache.hadoop.hbase.io.hfile.TestPrefetch
Tests run: 1, Failures: 0, Errors: 0, Skipped: 0, Time elapsed: 3.077 sec - in org.apache.hadoop.hbase.io.hfile.TestPrefetch
Running org.apache.hadoop.hbase.io.hfile.TestHFileEncryption
Tests run: 3, Failures: 0, Errors: 0, Skipped: 0, Time elapsed: 4.227 sec - in org.apache.hadoop.hbase.io.hfile.TestHFileEncryption
Running org.apache.hadoop.hbase.io.hfile.TestHFile
Tests run: 7, Failures: 0, Errors: 0, Skipped: 0, Time elapsed: 0.911 sec - in org.apache.hadoop.hbase.io.hfile.TestHFile
Running org.apache.hadoop.hbase.io.hfile.TestReseekTo
Tests run: 1, Failures: 0, Errors: 0, Skipped: 0, Time elapsed: 1.33 sec - in org.apache.hadoop.hbase.io.hfile.TestReseekTo
Running org.apache.hadoop.hbase.io.hfile.TestHFileInlineToRootChunkConversion
Tests run: 1, Failures: 0, Errors: 0, Skipped: 0, Time elapsed: 0.946 sec - in org.apache.hadoop.hbase.io.hfile.TestHFileInlineToRootChunkConversion
Running org.apache.hadoop.hbase.io.hfile.bucket.TestByteBufferIOEngine
Tests run: 1, Failures: 0, Errors: 0, Skipped: 0, Time elapsed: 0.384 sec - in org.apache.hadoop.hbase.io.hfile.bucket.TestByteBufferIOEngine
Running org.apache.hadoop.hbase.io.hfile.bucket.TestFileIOEngine
Tests run: 1, Failures: 0, Errors: 0, Skipped: 0, Time elapsed: 0.361 sec - in org.apache.hadoop.hbase.io.hfile.bucket.TestFileIOEngine
Running org.apache.hadoop.hbase.io.hfile.bucket.TestBucketWriterThread
Tests run: 4, Failures: 0, Errors: 0, Skipped: 0, Time elapsed: 0.831 sec - in org.apache.hadoop.hbase.io.hfile.bucket.TestBucketWriterThread
Running org.apache.hadoop.hbase.io.hfile.bucket.TestBucketCache
Tests run: 10, Failures: 0, Errors: 0, Skipped: 0, Time elapsed: 9.289 sec - in org.apache.hadoop.hbase.io.hfile.bucket.TestBucketCache
Running org.apache.hadoop.hbase.io.hfile.TestHFileWriterV3
Tests run: 4, Failures: 0, Errors: 0, Skipped: 0, Time elapsed: 3.17 sec - in org.apache.hadoop.hbase.io.hfile.TestHFileWriterV3
Running org.apache.hadoop.hbase.io.hfile.TestCachedBlockQueue
Tests run: 2, Failures: 0, Errors: 0, Skipped: 0, Time elapsed: 0.377 sec - in org.apache.hadoop.hbase.io.hfile.TestCachedBlockQueue
Running org.apache.hadoop.hbase.io.hfile.TestHFileBlockCompatibility
Tests run: 16, Failures: 0, Errors: 0, Skipped: 0, Time elapsed: 2.711 sec - in org.apache.hadoop.hbase.io.hfile.TestHFileBlockCompatibility
Running org.apache.hadoop.hbase.io.hfile.TestLazyDataBlockDecompression
Tests run: 2, Failures: 0, Errors: 0, Skipped: 0, Time elapsed: 1.464 sec - in org.apache.hadoop.hbase.io.hfile.TestLazyDataBlockDecompression
Running org.apache.hadoop.hbase.io.hfile.TestBlockCacheReporting
Tests run: 2, Failures: 0, Errors: 0, Skipped: 0, Time elapsed: 0.867 sec - in org.apache.hadoop.hbase.io.hfile.TestBlockCacheReporting
Running org.apache.hadoop.hbase.io.hfile.TestLruBlockCache
Tests run: 9, Failures: 0, Errors: 0, Skipped: 0, Time elapsed: 1.115 sec - in org.apache.hadoop.hbase.io.hfile.TestLruBlockCache
Running org.apache.hadoop.hbase.io.hfile.TestSeekTo
Tests run: 20, Failures: 0, Errors: 0, Skipped: 0, Time elapsed: 2.417 sec - in org.apache.hadoop.hbase.io.hfile.TestSeekTo
Running org.apache.hadoop.hbase.io.hfile.TestHFileWriterV2
Tests run: 2, Failures: 0, Errors: 0, Skipped: 0, Time elapsed: 2.146 sec - in org.apache.hadoop.hbase.io.hfile.TestHFileWriterV2
Running org.apache.hadoop.hbase.io.TestHalfStoreFileReader
Tests run: 2, Failures: 0, Errors: 0, Skipped: 0, Time elapsed: 1.31 sec - in org.apache.hadoop.hbase.io.TestHalfStoreFileReader
Running org.apache.hadoop.hbase.io.encoding.TestPrefixTree
Tests run: 2, Failures: 0, Errors: 0, Skipped: 0, Time elapsed: 1.88 sec - in org.apache.hadoop.hbase.io.encoding.TestPrefixTree
Running org.apache.hadoop.hbase.io.encoding.TestSeekBeforeWithReverseScan
Tests run: 2, Failures: 0, Errors: 0, Skipped: 0, Time elapsed: 1.823 sec - in org.apache.hadoop.hbase.io.encoding.TestSeekBeforeWithReverseScan
Running org.apache.hadoop.hbase.io.encoding.TestPrefixTreeEncoding
Tests run: 8, Failures: 0, Errors: 0, Skipped: 0, Time elapsed: 1.391 sec - in org.apache.hadoop.hbase.io.encoding.TestPrefixTreeEncoding
Running org.apache.hadoop.hbase.io.encoding.TestSeekToBlockWithEncoders
Tests run: 9, Failures: 0, Errors: 0, Skipped: 0, Time elapsed: 0.87 sec - in org.apache.hadoop.hbase.io.encoding.TestSeekToBlockWithEncoders
Running org.apache.hadoop.hbase.io.TestHeapSize
Tests run: 3, Failures: 0, Errors: 0, Skipped: 0, Time elapsed: 0.411 sec - in org.apache.hadoop.hbase.io.TestHeapSize
Running org.apache.hadoop.hbase.TestIPv6NIOServerSocketChannel
Tests run: 2, Failures: 0, Errors: 0, Skipped: 0, Time elapsed: 0.596 sec - in org.apache.hadoop.hbase.TestIPv6NIOServerSocketChannel
Running org.apache.hadoop.hbase.protobuf.TestProtobufUtil
Tests run: 7, Failures: 0, Errors: 0, Skipped: 0, Time elapsed: 1.245 sec - in org.apache.hadoop.hbase.protobuf.TestProtobufUtil
Running org.apache.hadoop.hbase.protobuf.TestReplicationProtobuf
Tests run: 1, Failures: 0, Errors: 0, Skipped: 0, Time elapsed: 0.369 sec - in org.apache.hadoop.hbase.protobuf.TestReplicationProtobuf
Running org.apache.hadoop.hbase.filter.TestRegexComparator
Tests run: 3, Failures: 0, Errors: 0, Skipped: 0, Time elapsed: 0.596 sec - in org.apache.hadoop.hbase.filter.TestRegexComparator
Running org.apache.hadoop.hbase.filter.TestFilter
Tests run: 21, Failures: 0, Errors: 0, Skipped: 0, Time elapsed: 5.559 sec - in org.apache.hadoop.hbase.filter.TestFilter
Running org.apache.hadoop.hbase.filter.TestBitComparator
Tests run: 6, Failures: 0, Errors: 0, Skipped: 0, Time elapsed: 0.483 sec - in org.apache.hadoop.hbase.filter.TestBitComparator
Running org.apache.hadoop.hbase.filter.TestColumnPrefixFilter
Tests run: 2, Failures: 0, Errors: 0, Skipped: 0, Time elapsed: 4.396 sec - in org.apache.hadoop.hbase.filter.TestColumnPrefixFilter
Running org.apache.hadoop.hbase.filter.TestSingleColumnValueExcludeFilter
Tests run: 1, Failures: 0, Errors: 0, Skipped: 0, Time elapsed: 0.276 sec - in org.apache.hadoop.hbase.filter.TestSingleColumnValueExcludeFilter
Running org.apache.hadoop.hbase.filter.TestSingleColumnValueFilter
Tests run: 3, Failures: 0, Errors: 0, Skipped: 0, Time elapsed: 0.989 sec - in org.apache.hadoop.hbase.filter.TestSingleColumnValueFilter
Running org.apache.hadoop.hbase.filter.TestRandomRowFilter
Tests run: 2, Failures: 0, Errors: 0, Skipped: 0, Time elapsed: 0.629 sec - in org.apache.hadoop.hbase.filter.TestRandomRowFilter
Running org.apache.hadoop.hbase.filter.TestFirstKeyValueMatchingQualifiersFilter
Tests run: 1, Failures: 0, Errors: 0, Skipped: 0, Time elapsed: 0.277 sec - in org.apache.hadoop.hbase.filter.TestFirstKeyValueMatchingQualifiersFilter
Running org.apache.hadoop.hbase.filter.TestFilterList
Tests run: 7, Failures: 0, Errors: 0, Skipped: 0, Time elapsed: 1.117 sec - in org.apache.hadoop.hbase.filter.TestFilterList
Running org.apache.hadoop.hbase.filter.TestFuzzyRowFilter
Tests run: 6, Failures: 0, Errors: 0, Skipped: 0, Time elapsed: 0.551 sec - in org.apache.hadoop.hbase.filter.TestFuzzyRowFilter
Running org.apache.hadoop.hbase.filter.TestParseFilter
Tests run: 34, Failures: 0, Errors: 0, Skipped: 0, Time elapsed: 1.483 sec - in org.apache.hadoop.hbase.filter.TestParseFilter
Running org.apache.hadoop.hbase.filter.TestPageFilter
Tests run: 2, Failures: 0, Errors: 0, Skipped: 0, Time elapsed: 0.389 sec - in org.apache.hadoop.hbase.filter.TestPageFilter
Running org.apache.hadoop.hbase.filter.TestDependentColumnFilter
Tests run: 4, Failures: 0, Errors: 0, Skipped: 0, Time elapsed: 2.018 sec - in org.apache.hadoop.hbase.filter.TestDependentColumnFilter
Running org.apache.hadoop.hbase.filter.TestInclusiveStopFilter
Tests run: 2, Failures: 0, Errors: 0, Skipped: 0, Time elapsed: 0.314 sec - in org.apache.hadoop.hbase.filter.TestInclusiveStopFilter
Running org.apache.hadoop.hbase.filter.TestMultipleColumnPrefixFilter
Tests run: 3, Failures: 0, Errors: 0, Skipped: 0, Time elapsed: 5.247 sec - in org.apache.hadoop.hbase.filter.TestMultipleColumnPrefixFilter
Running org.apache.hadoop.hbase.filter.TestFilterSerialization
Tests run: 26, Failures: 0, Errors: 0, Skipped: 0, Time elapsed: 1.953 sec - in org.apache.hadoop.hbase.filter.TestFilterSerialization
Running org.apache.hadoop.hbase.filter.TestPrefixFilter
Tests run: 3, Failures: 0, Errors: 0, Skipped: 0, Time elapsed: 0.342 sec - in org.apache.hadoop.hbase.filter.TestPrefixFilter
Running org.apache.hadoop.hbase.filter.TestNullComparator
Tests run: 3, Failures: 0, Errors: 0, Skipped: 0, Time elapsed: 0.404 sec - in org.apache.hadoop.hbase.filter.TestNullComparator
Running org.apache.hadoop.hbase.filter.TestComparatorSerialization
Tests run: 6, Failures: 0, Errors: 0, Skipped: 0, Time elapsed: 1.168 sec - in org.apache.hadoop.hbase.filter.TestComparatorSerialization
Running org.apache.hadoop.hbase.filter.TestColumnPaginationFilter
Tests run: 1, Failures: 0, Errors: 0, Skipped: 0, Time elapsed: 0.897 sec - in org.apache.hadoop.hbase.filter.TestColumnPaginationFilter
Running org.apache.hadoop.hbase.filter.TestInvocationRecordFilter
Tests run: 1, Failures: 0, Errors: 0, Skipped: 0, Time elapsed: 1.655 sec - in org.apache.hadoop.hbase.filter.TestInvocationRecordFilter

Results :




Tests run: 960, Failures: 0, Errors: 0, Skipped: 6

[INFO] ------------------------------------------------------------------------
[INFO] Reactor Summary:
[INFO] 
[INFO] Apache HBase ...................................... SUCCESS [52.545s]
[INFO] Apache HBase - Checkstyle ......................... SUCCESS [4.404s]
[INFO] Apache HBase - Resource Bundle .................... SUCCESS [0.169s]
[INFO] Apache HBase - Annotations ........................ SUCCESS [0.958s]
[INFO] Apache HBase - Protocol ........................... SUCCESS [14.646s]
[INFO] Apache HBase - Common ............................. SUCCESS [1:49.797s]
[INFO] Apache HBase - Procedure .......................... SUCCESS [1:51.832s]
[INFO] Apache HBase - Client ............................. SUCCESS [1:29.617s]
[INFO] Apache HBase - Hadoop Compatibility ............... SUCCESS [7.856s]
[INFO] Apache HBase - Hadoop Two Compatibility ........... SUCCESS [8.245s]
[INFO] Apache HBase - Prefix Tree ........................ SUCCESS [9.575s]
[INFO] Apache HBase - Server ............................. FAILURE [14:51.493s]
[INFO] Apache HBase - Testing Util ....................... SKIPPED
[INFO] Apache HBase - Thrift ............................. SKIPPED
[INFO] Apache HBase - Rest ............................... SKIPPED
[INFO] Apache HBase - Shell .............................. SKIPPED
[INFO] Apache HBase - Integration Tests .................. SKIPPED
[INFO] Apache HBase - Examples ........................... SKIPPED
[INFO] Apache HBase - Assembly ........................... SKIPPED
[INFO] Apache HBase - Shaded ............................. SKIPPED
[INFO] Apache HBase - Shaded - Client .................... SKIPPED
[INFO] Apache HBase - Shaded - Server .................... SKIPPED
[INFO] ------------------------------------------------------------------------
[INFO] BUILD FAILURE
[INFO] ------------------------------------------------------------------------
[INFO] Total time: 21:58.406s
[INFO] Finished at: Thu Aug 27 04:44:28 UTC 2015
[INFO] Final Memory: 95M/507M
[INFO] ------------------------------------------------------------------------
[ERROR] Failed to execute goal org.apache.maven.plugins:maven-surefire-plugin:2.18:test (default-test) on project hbase-server: ExecutionException: java.lang.RuntimeException: The forked VM terminated without properly saying goodbye. VM crash or System.exit called?
[ERROR] Command was /bin/sh -c cd <https://builds.apache.org/job/HBase-1.3/jdk=latest1.7,label=Hadoop/ws/hbase-server> && /home/jenkins/jenkins-slave/tools/hudson.model.JDK/latest1.7/jre/bin/java -enableassertions -XX:MaxDirectMemorySize=1G -Xmx2800m -XX:MaxPermSize=256m -Djava.security.egd=file:/dev/./urandom -Djava.net.preferIPv4Stack=true -Djava.awt.headless=true -jar <https://builds.apache.org/job/HBase-1.3/jdk=latest1.7,label=Hadoop/ws/hbase-server/target/surefire/surefirebooter8569576823257069635.jar> <https://builds.apache.org/job/HBase-1.3/jdk=latest1.7,label=Hadoop/ws/hbase-server/target/surefire/surefire4768463700501546288tmp> <https://builds.apache.org/job/HBase-1.3/jdk=latest1.7,label=Hadoop/ws/hbase-server/target/surefire/surefire_433456994702797890429tmp>
[ERROR] -> [Help 1]
[ERROR] 
[ERROR] To see the full stack trace of the errors, re-run Maven with the -e switch.
[ERROR] Re-run Maven using the -X switch to enable full debug logging.
[ERROR] 
[ERROR] For more information about the errors and possible solutions, please read the following articles:
[ERROR] [Help 1] http://cwiki.apache.org/confluence/display/MAVEN/MojoFailureException
[ERROR] 
[ERROR] After correcting the problems, you can resume the build with the command
[ERROR]   mvn <goals> -rf :hbase-server
Build step 'Invoke top-level Maven targets' marked build as failure
Performing Post build task...
Match found for :.* : True
Logical operation result is TRUE
Running script  :   ZOMBIE_TESTS_COUNT=`jps | grep surefirebooter | wc -l`
  if [[ $ZOMBIE_TESTS_COUNT != 0 ]] ; then
    #It seems sometimes the tests are not dying immediately. Let's give them 10s
    echo "Suspicious java process found - waiting 10s to see if there are just slow to stop"
    sleep 10   
    ZOMBIE_TESTS_COUNT=`jps | grep surefirebooter | wc -l`
    if [[ $ZOMBIE_TESTS_COUNT != 0 ]] ; then
      echo "There are $ZOMBIE_TESTS_COUNT zombie tests, they should have been killed by surefire but survived"
      echo "************ BEGIN zombies jstack extract"
      ZB_STACK=`jps | grep surefirebooter | cut -d ' ' -f 1 | xargs -n 1 jstack | grep ".test" | grep "\.java"`
      jps | grep surefirebooter | cut -d ' ' -f 1 | xargs -n 1 jstack
      echo "************ END  zombies jstack extract"
      JIRA_COMMENT="$JIRA_COMMENT

     {color:red}-1 core zombie tests{color}.  There are ${ZOMBIE_TESTS_COUNT} zombie test(s): ${ZB_STACK}"
      BAD=1
      jps | grep surefirebooter | cut -d ' ' -f 1 | xargs kill -9
    else
      echo "We're ok: there is no zombie test, but some tests took some time to stop"
    fi
  else
    echo "We're ok: there is no zombie test"
  fi
[Hadoop] $ /bin/bash -xe /tmp/hudson7650896246333751603.sh
++ jps
++ grep surefirebooter
++ wc -l
+ ZOMBIE_TESTS_COUNT=0
+ [[ 0 != 0 ]]
+ echo 'We'\''re ok: there is no zombie test'
We're ok: there is no zombie test
POST BUILD TASK : SUCCESS
END OF POST BUILD TASK : 0
Archiving artifacts
Sending artifact delta relative to HBase-1.3 » latest1.7,Hadoop #108
Archived 990 artifacts
Archive block size is 32768
Received 3 blocks and 38967197 bytes
Compression is 0.3%
Took 21 sec

Build failed in Jenkins: HBase-1.3 » latest1.7,Hadoop #136

Posted by Apache Jenkins Server <je...@builds.apache.org>.
See <https://builds.apache.org/job/HBase-1.3/jdk=latest1.7,label=Hadoop/136/changes>

Changes:

[syuanjiangdev] HBASE-13212 Procedure V2 - master Create/Modify/Delete namespace (Stephen Yuan Jiang)

------------------------------------------
[...truncated 109666 lines...]
"GC task thread#0 (ParallelGC)" os_prio=0 tid=0x00007f58bc01f800 nid=0x43d runnable 

"GC task thread#1 (ParallelGC)" os_prio=0 tid=0x00007f58bc021800 nid=0x43e runnable 

"GC task thread#2 (ParallelGC)" os_prio=0 tid=0x00007f58bc023000 nid=0x43f runnable 

"GC task thread#3 (ParallelGC)" os_prio=0 tid=0x00007f58bc025000 nid=0x440 runnable 

"GC task thread#4 (ParallelGC)" os_prio=0 tid=0x00007f58bc026800 nid=0x441 runnable 

"GC task thread#5 (ParallelGC)" os_prio=0 tid=0x00007f58bc028800 nid=0x442 runnable 

"GC task thread#6 (ParallelGC)" os_prio=0 tid=0x00007f58bc02a000 nid=0x443 runnable 

"GC task thread#7 (ParallelGC)" os_prio=0 tid=0x00007f58bc02c000 nid=0x444 runnable 

"GC task thread#8 (ParallelGC)" os_prio=0 tid=0x00007f58bc02d800 nid=0x446 runnable 

"GC task thread#9 (ParallelGC)" os_prio=0 tid=0x00007f58bc02f800 nid=0x447 runnable 

"GC task thread#10 (ParallelGC)" os_prio=0 tid=0x00007f58bc031000 nid=0x448 runnable 

"GC task thread#11 (ParallelGC)" os_prio=0 tid=0x00007f58bc033000 nid=0x449 runnable 

"GC task thread#12 (ParallelGC)" os_prio=0 tid=0x00007f58bc034800 nid=0x44a runnable 

"VM Periodic Task Thread" os_prio=0 tid=0x00007f58bc2d9800 nid=0x461 waiting on condition 

JNI global references: 376

2015-08-26 23:43:51
Full thread dump Java HotSpot(TM) 64-Bit Server VM (25.45-b02 mixed mode):

"Attach Listener" #29 daemon prio=9 os_prio=0 tid=0x00007fb64c001000 nid=0x6308 waiting on condition [0x0000000000000000]
   java.lang.Thread.State: RUNNABLE

"Time-limited test" #28 daemon prio=5 os_prio=0 tid=0x00007fb6b8ac3000 nid=0x5ffa runnable [0x00007fb67cc53000]
   java.lang.Thread.State: RUNNABLE
	at org.apache.hadoop.hbase.master.balancer.StochasticLoadBalancer.computeCost(StochasticLoadBalancer.java:520)
	at org.apache.hadoop.hbase.master.balancer.StochasticLoadBalancer.balanceCluster(StochasticLoadBalancer.java:334)
	- locked <0x000000071101e900> (a org.apache.hadoop.hbase.master.balancer.StochasticLoadBalancer)
	at org.apache.hadoop.hbase.master.balancer.BalancerTestBase.testWithCluster(BalancerTestBase.java:432)
	at org.apache.hadoop.hbase.master.balancer.BalancerTestBase.testWithCluster(BalancerTestBase.java:422)
	at org.apache.hadoop.hbase.master.balancer.TestStochasticLoadBalancer.testRegionReplicasOnSmallCluster(TestStochasticLoadBalancer.java:425)
	at sun.reflect.NativeMethodAccessorImpl.invoke0(Native Method)
	at sun.reflect.NativeMethodAccessorImpl.invoke(NativeMethodAccessorImpl.java:62)
	at sun.reflect.DelegatingMethodAccessorImpl.invoke(DelegatingMethodAccessorImpl.java:43)
	at java.lang.reflect.Method.invoke(Method.java:497)
	at org.junit.runners.model.FrameworkMethod$1.runReflectiveCall(FrameworkMethod.java:50)
	at org.junit.internal.runners.model.ReflectiveCallable.run(ReflectiveCallable.java:12)
	at org.junit.runners.model.FrameworkMethod.invokeExplosively(FrameworkMethod.java:47)
	at org.junit.internal.runners.statements.InvokeMethod.evaluate(InvokeMethod.java:17)
	at org.junit.internal.runners.statements.FailOnTimeout$CallableStatement.call(FailOnTimeout.java:298)
	at org.junit.internal.runners.statements.FailOnTimeout$CallableStatement.call(FailOnTimeout.java:292)
	at java.util.concurrent.FutureTask.run(FutureTask.java:266)
	at java.lang.Thread.run(Thread.java:745)

"process reaper" #20 daemon prio=10 os_prio=0 tid=0x00007fb6b8ceb000 nid=0x173 waiting on condition [0x00007fb67cc92000]
   java.lang.Thread.State: TIMED_WAITING (parking)
	at sun.misc.Unsafe.park(Native Method)
	- parking to wait for  <0x0000000711026198> (a java.util.concurrent.SynchronousQueue$TransferStack)
	at java.util.concurrent.locks.LockSupport.parkNanos(LockSupport.java:215)
	at java.util.concurrent.SynchronousQueue$TransferStack.awaitFulfill(SynchronousQueue.java:460)
	at java.util.concurrent.SynchronousQueue$TransferStack.transfer(SynchronousQueue.java:362)
	at java.util.concurrent.SynchronousQueue.poll(SynchronousQueue.java:941)
	at java.util.concurrent.ThreadPoolExecutor.getTask(ThreadPoolExecutor.java:1066)
	at java.util.concurrent.ThreadPoolExecutor.runWorker(ThreadPoolExecutor.java:1127)
	at java.util.concurrent.ThreadPoolExecutor$Worker.run(ThreadPoolExecutor.java:617)
	at java.lang.Thread.run(Thread.java:745)

"Timer for 'HBase' metrics system" #19 daemon prio=5 os_prio=0 tid=0x00007fb6b8c8c000 nid=0x147 in Object.wait() [0x00007fb67cf93000]
   java.lang.Thread.State: TIMED_WAITING (on object monitor)
	at java.lang.Object.wait(Native Method)
	- waiting on <0x00000007110246c8> (a java.util.TaskQueue)
	at java.util.TimerThread.mainLoop(Timer.java:552)
	- locked <0x00000007110246c8> (a java.util.TaskQueue)
	at java.util.TimerThread.run(Timer.java:505)

"Service Thread" #17 daemon prio=9 os_prio=0 tid=0x00007fb6b82d7000 nid=0x7de8 runnable [0x0000000000000000]
   java.lang.Thread.State: RUNNABLE

"C1 CompilerThread11" #16 daemon prio=9 os_prio=0 tid=0x00007fb6b82ca000 nid=0x7de7 waiting on condition [0x0000000000000000]
   java.lang.Thread.State: RUNNABLE

"C1 CompilerThread10" #15 daemon prio=9 os_prio=0 tid=0x00007fb6b82c8000 nid=0x7de6 waiting on condition [0x0000000000000000]
   java.lang.Thread.State: RUNNABLE

"C1 CompilerThread9" #14 daemon prio=9 os_prio=0 tid=0x00007fb6b82c5800 nid=0x7de5 waiting on condition [0x0000000000000000]
   java.lang.Thread.State: RUNNABLE

"C1 CompilerThread8" #13 daemon prio=9 os_prio=0 tid=0x00007fb6b82c3800 nid=0x7de4 waiting on condition [0x0000000000000000]
   java.lang.Thread.State: RUNNABLE

"C2 CompilerThread7" #12 daemon prio=9 os_prio=0 tid=0x00007fb6b82c1800 nid=0x7de3 waiting on condition [0x0000000000000000]
   java.lang.Thread.State: RUNNABLE

"C2 CompilerThread6" #11 daemon prio=9 os_prio=0 tid=0x00007fb6b82bf800 nid=0x7dde waiting on condition [0x0000000000000000]
   java.lang.Thread.State: RUNNABLE

"C2 CompilerThread5" #10 daemon prio=9 os_prio=0 tid=0x00007fb6b82bd000 nid=0x7ddd waiting on condition [0x0000000000000000]
   java.lang.Thread.State: RUNNABLE

"C2 CompilerThread4" #9 daemon prio=9 os_prio=0 tid=0x00007fb6b82bb000 nid=0x7ddc waiting on condition [0x0000000000000000]
   java.lang.Thread.State: RUNNABLE

"C2 CompilerThread3" #8 daemon prio=9 os_prio=0 tid=0x00007fb6b82b9000 nid=0x7ddb waiting on condition [0x0000000000000000]
   java.lang.Thread.State: RUNNABLE

"C2 CompilerThread2" #7 daemon prio=9 os_prio=0 tid=0x00007fb6b82b6800 nid=0x7dda waiting on condition [0x0000000000000000]
   java.lang.Thread.State: RUNNABLE

"C2 CompilerThread1" #6 daemon prio=9 os_prio=0 tid=0x00007fb6b82b5000 nid=0x7dd9 waiting on condition [0x0000000000000000]
   java.lang.Thread.State: RUNNABLE

"C2 CompilerThread0" #5 daemon prio=9 os_prio=0 tid=0x00007fb6b82b2000 nid=0x7dd8 waiting on condition [0x0000000000000000]
   java.lang.Thread.State: RUNNABLE

"Signal Dispatcher" #4 daemon prio=9 os_prio=0 tid=0x00007fb6b82b0800 nid=0x7dd7 runnable [0x0000000000000000]
   java.lang.Thread.State: RUNNABLE

"Finalizer" #3 daemon prio=8 os_prio=0 tid=0x00007fb6b8279000 nid=0x7dd0 in Object.wait() [0x00007fb67f2f1000]
   java.lang.Thread.State: WAITING (on object monitor)
	at java.lang.Object.wait(Native Method)
	- waiting on <0x0000000711026860> (a java.lang.ref.ReferenceQueue$Lock)
	at java.lang.ref.ReferenceQueue.remove(ReferenceQueue.java:143)
	- locked <0x0000000711026860> (a java.lang.ref.ReferenceQueue$Lock)
	at java.lang.ref.ReferenceQueue.remove(ReferenceQueue.java:164)
	at java.lang.ref.Finalizer$FinalizerThread.run(Finalizer.java:209)

"Reference Handler" #2 daemon prio=10 os_prio=0 tid=0x00007fb6b8276800 nid=0x7dcf in Object.wait() [0x00007fb67f3f2000]
   java.lang.Thread.State: WAITING (on object monitor)
	at java.lang.Object.wait(Native Method)
	- waiting on <0x0000000711025a40> (a java.lang.ref.Reference$Lock)
	at java.lang.Object.wait(Object.java:502)
	at java.lang.ref.Reference$ReferenceHandler.run(Reference.java:157)
	- locked <0x0000000711025a40> (a java.lang.ref.Reference$Lock)

"main" #1 prio=5 os_prio=0 tid=0x00007fb6b800a800 nid=0x7dbc waiting on condition [0x00007fb6be8ca000]
   java.lang.Thread.State: TIMED_WAITING (parking)
	at sun.misc.Unsafe.park(Native Method)
	- parking to wait for  <0x0000000717e999c0> (a java.util.concurrent.FutureTask)
	at java.util.concurrent.locks.LockSupport.parkNanos(LockSupport.java:215)
	at java.util.concurrent.FutureTask.awaitDone(FutureTask.java:426)
	at java.util.concurrent.FutureTask.get(FutureTask.java:204)
	at org.junit.internal.runners.statements.FailOnTimeout.getResult(FailOnTimeout.java:141)
	at org.junit.internal.runners.statements.FailOnTimeout.evaluate(FailOnTimeout.java:127)
	at org.junit.runners.ParentRunner.runLeaf(ParentRunner.java:325)
	at org.junit.runners.BlockJUnit4ClassRunner.runChild(BlockJUnit4ClassRunner.java:78)
	at org.junit.runners.BlockJUnit4ClassRunner.runChild(BlockJUnit4ClassRunner.java:57)
	at org.junit.runners.ParentRunner$3.run(ParentRunner.java:290)
	at org.junit.runners.ParentRunner$1.schedule(ParentRunner.java:71)
	at org.junit.runners.ParentRunner.runChildren(ParentRunner.java:288)
	at org.junit.runners.ParentRunner.access$000(ParentRunner.java:58)
	at org.junit.runners.ParentRunner$2.evaluate(ParentRunner.java:268)
	at org.junit.internal.runners.statements.RunBefores.evaluate(RunBefores.java:26)
	at org.junit.runners.ParentRunner.run(ParentRunner.java:363)
	at org.junit.runners.Suite.runChild(Suite.java:128)
	at org.junit.runners.Suite.runChild(Suite.java:27)
	at org.junit.runners.ParentRunner$3.run(ParentRunner.java:290)
	at org.junit.runners.ParentRunner$1.schedule(ParentRunner.java:71)
	at org.junit.runners.ParentRunner.runChildren(ParentRunner.java:288)
	at org.junit.runners.ParentRunner.access$000(ParentRunner.java:58)
	at org.junit.runners.ParentRunner$2.evaluate(ParentRunner.java:268)
	at org.junit.runners.ParentRunner.run(ParentRunner.java:363)
	at org.junit.runner.JUnitCore.run(JUnitCore.java:137)
	at org.junit.runner.JUnitCore.run(JUnitCore.java:115)
	at org.apache.maven.surefire.junitcore.JUnitCoreWrapper.createRequestAndRun(JUnitCoreWrapper.java:107)
	at org.apache.maven.surefire.junitcore.JUnitCoreWrapper.executeEager(JUnitCoreWrapper.java:77)
	at org.apache.maven.surefire.junitcore.JUnitCoreWrapper.execute(JUnitCoreWrapper.java:53)
	at org.apache.maven.surefire.junitcore.JUnitCoreProvider.invoke(JUnitCoreProvider.java:144)
	at org.apache.maven.surefire.booter.ForkedBooter.invokeProviderInSameClassLoader(ForkedBooter.java:203)
	at org.apache.maven.surefire.booter.ForkedBooter.runSuitesInProcess(ForkedBooter.java:155)
	at org.apache.maven.surefire.booter.ForkedBooter.main(ForkedBooter.java:103)

"VM Thread" os_prio=0 tid=0x00007fb6b8271800 nid=0x7dce runnable 

"GC task thread#0 (ParallelGC)" os_prio=0 tid=0x00007fb6b801f800 nid=0x7dbe runnable 

"GC task thread#1 (ParallelGC)" os_prio=0 tid=0x00007fb6b8021800 nid=0x7dbf runnable 

"GC task thread#2 (ParallelGC)" os_prio=0 tid=0x00007fb6b8023000 nid=0x7dc0 runnable 

"GC task thread#3 (ParallelGC)" os_prio=0 tid=0x00007fb6b8025000 nid=0x7dc1 runnable 

"GC task thread#4 (ParallelGC)" os_prio=0 tid=0x00007fb6b8026800 nid=0x7dc2 runnable 

"GC task thread#5 (ParallelGC)" os_prio=0 tid=0x00007fb6b8028800 nid=0x7dc3 runnable 

"GC task thread#6 (ParallelGC)" os_prio=0 tid=0x00007fb6b802a000 nid=0x7dc4 runnable 

"GC task thread#7 (ParallelGC)" os_prio=0 tid=0x00007fb6b802c000 nid=0x7dc5 runnable 

"GC task thread#8 (ParallelGC)" os_prio=0 tid=0x00007fb6b802d800 nid=0x7dc6 runnable 

"GC task thread#9 (ParallelGC)" os_prio=0 tid=0x00007fb6b802f800 nid=0x7dc8 runnable 

"GC task thread#10 (ParallelGC)" os_prio=0 tid=0x00007fb6b8031000 nid=0x7dc9 runnable 

"GC task thread#11 (ParallelGC)" os_prio=0 tid=0x00007fb6b8033000 nid=0x7dca runnable 

"GC task thread#12 (ParallelGC)" os_prio=0 tid=0x00007fb6b8034800 nid=0x7dcb runnable 

"VM Periodic Task Thread" os_prio=0 tid=0x00007fb6b82d9800 nid=0x7de9 waiting on condition 

JNI global references: 248

+ echo '************ END  zombies jstack extract'
************ END  zombies jstack extract
+ JIRA_COMMENT='

     {color:red}-1 core zombie tests{color}.  There are 19 zombie test(s): 	at org.apache.hadoop.hbase.snapshot.TestExportSnapshot.testExportFileSystemState(TestExportSnapshot.java:286)
	at org.apache.hadoop.hbase.snapshot.TestExportSnapshot.testExportFileSystemState(TestExportSnapshot.java:260)
	at org.apache.hadoop.hbase.snapshot.TestExportSnapshot.testSnapshotWithRefsExportFileSystemState(TestExportSnapshot.java:254)
	at org.apache.hadoop.hbase.snapshot.TestExportSnapshot.testSnapshotWithRefsExportFileSystemState(TestExportSnapshot.java:234)
	at org.apache.hadoop.hbase.master.TestAssignmentManagerOnCluster.testAssignRegion(TestAssignmentManagerOnCluster.java:218)
	at org.apache.hadoop.hbase.mapreduce.TestTableMapReduceBase.testMultiRegionTable(TestTableMapReduceBase.java:98)
	at org.apache.hadoop.hbase.client.TestHCM.testConnectionClose(TestHCM.java:398)
	at org.apache.hadoop.hbase.client.TestHCM.testConnectionCloseAllowsInterrupt(TestHCM.java:281)
	at org.apache.hadoop.hbase.mapreduce.TestTableInputFormatScanBase.testScan(TestTableInputFormatScanBase.java:244)
	at org.apache.hadoop.hbase.mapreduce.TestTableInputFormatScan1.testScanEmptyToOPP(TestTableInputFormatScan1.java:99)
	at org.apache.hadoop.hbase.master.TestMasterOperationsForRegionReplicas.testCreateTableWithMultipleReplicas(TestMasterOperationsForRegionReplicas.java:175)
	at org.apache.hadoop.hbase.master.balancer.BalancerTestBase.testWithCluster(BalancerTestBase.java:432)
	at org.apache.hadoop.hbase.master.balancer.BalancerTestBase.testWithCluster(BalancerTestBase.java:422)
	at org.apache.hadoop.hbase.master.balancer.TestStochasticLoadBalancer2.testRegionReplicasOnMidClusterHighReplication(TestStochasticLoadBalancer2.java:72)
	at org.apache.hadoop.hbase.master.TestAssignmentManagerOnCluster.testAssignRacingWithSSH(TestAssignmentManagerOnCluster.java:878)
	at org.apache.hadoop.hbase.master.TestAssignmentManagerOnCluster.testCloseHang(TestAssignmentManagerOnCluster.java:790)
	at org.apache.hadoop.hbase.master.TestAssignmentManagerOnCluster.testAssignDisabledRegionBySSH(TestAssignmentManagerOnCluster.java:1174)
	at org.apache.hadoop.hbase.master.TestAssignmentManagerOnCluster.testOpenFailed(TestAssignmentManagerOnCluster.java:637)
	at org.apache.hadoop.hbase.master.TestAssignmentManagerOnCluster.testOpenFailedUnrecoverable(TestAssignmentManagerOnCluster.java:686)
	at org.apache.hadoop.hbase.master.TestAssignmentManagerOnCluster.testCloseFailed(TestAssignmentManagerOnCluster.java:596)
	at org.apache.hadoop.hbase.master.TestAssignmentManagerOnCluster.testAssignRegion(TestAssignmentManagerOnCluster.java:218)
	at org.apache.hadoop.hbase.master.TestAssignmentManagerOnCluster.testAssignRegionOnRestartedServer(TestAssignmentManagerOnCluster.java:341)
	at org.apache.hadoop.hbase.master.balancer.BalancerTestBase.testWithCluster(BalancerTestBase.java:432)
	at org.apache.hadoop.hbase.master.balancer.BalancerTestBase.testWithCluster(BalancerTestBase.java:422)
	at org.apache.hadoop.hbase.master.balancer.TestStochasticLoadBalancer.testRegionReplicasOnSmallCluster(TestStochasticLoadBalancer.java:425)'
+ BAD=1
+ jps
+ grep surefirebooter
+ cut -d ' ' -f 1
+ xargs kill -9
POST BUILD TASK : SUCCESS
END OF POST BUILD TASK : 0
Archiving artifacts
Sending artifact delta relative to HBase-1.3 » latest1.7,Hadoop #108
Archived 1876 artifacts
Archive block size is 32768
Received 3 blocks and 1048516091 bytes
Compression is 0.0%
Took 5 min 8 sec