You are viewing a plain text version of this content. The canonical link for it is here.
Posted to dev@geode.apache.org by Apache Jenkins Server <je...@builds.apache.org> on 2016/07/26 16:57:41 UTC
Build failed in Jenkins: Geode-release #16
See <https://builds.apache.org/job/Geode-release/16/changes>
Changes:
[boglesby] GEODE-1641: The Gateway Conflict Resolver is supported again in
[wmarkito] M3 release branch done. Bumping the release version to 1.0.0
[huynhja] GEODE-1614: CI failure:
[eshu] GOEDE-1621: Do not throw IllegalArgumentException in TXState cleanup()
[jiliao] GEODE-1571: security code tidy up.
[huynhja] GEODE-1588: AckReader and Dispatching thread are shut down before
[klund] GEODE-1452: annotate disabled tests with @Ignore and rename
[gzhou] GEODE-11: GFSH commands for Lucene
[jiliao] GEODE-1571: documentation and code cleanup
[sbawaskar] fixing the version from 1.0.0-incubating.1.0.0-SNAPSHOT to
[eshu] GEODE-1649: Fixes IllegalStateException in mock junit test.
[jiliao] GEODE-1571: fix nightly failure
[klund] GEODE-1598: fix auto-completion problems by telling jopt that all
[bschuchardt] GEODE-1642 Add conveniance method isCancelInProgress to CancelCriterion
[klund] GEODE-1646: repackage new Security classes in org.apache.geode.security
[jiliao] GEODE-1571: use constructor instead of static method to create
[jiliao] GEODE-1571: fix compiling error after the merge
[nnag] GEODE-1587: Replaced AtomicInteger with AtomicIntegerFieldUpdater
[nnag] GEODE-1639: Receivers selects a different port if the selected port is
[upthewaterspout] GEODE-11 Adding tests of closing a cache during index updates
[jiliao] GEODE-1571: fix permission needed for remove data command
[klund] GEODE-1656: fix compilation warnings with @SuppressWarnings annotations
[klund] GEODE-1654: Fix Javadoc warnings
[klund] GEODE-1660: fix compilation warnings
[nnag] GEODE-1600: startLocatorAndDS takes 0 as port number parameter
[gzhou] This closes #205
[huynhja] GEODE-1644: ClassCastException is thrown with in queries against a map
[gzhou] GEODE-11:Dunit test to verify stats in list lucene gfsh command
[klund] GEODE-1667: update CacheTestCase to JUnit 4 by default
[jiliao] GEODE-1571: have auth-init accept either a constructor or a static
[jiliao] GEODE-1571: simplify security check
[dschneider] GEODE-1590: add defragmentationsInProgress stat
[jiliao] GEODE-1571: revert previous two changes
[nnag] GEODE-1612: Gets a list of random ports at once
[jiliao] GEODE-1571: more revert.
[jiliao] GEODE-746: When starting a locator using --bind-address, gfsh prints
[gzhou] GEODE-11: GFSH command fixes
[jiliao] GEODE-1571: Allow AuthInit to take either a constructor or a static
[bschuchardt] Removing unreferenced ParentLocalizedStrings. All remaining
[bschuchardt] Performance enhancements ported from GemFire 8.2.0.x
[gzhou] GEODE-11:Gfsh command for lucene query
[bschuchardt] GEODE-1655: CI Failure in
[jiliao] GEODE-1647: Add Integrated Security to Peer Authentication
[jiliao] GEODE-1647: add more unit test
[jiliao] GEODE-1680: Change "list regions" to DATA:READ permissions
[bschuchardt] GEODE-1685 Upgrade to JGroups 3.6.10.Final
[dschneider] GEODE-1420: fix 100ms delay in stopping tombstone sweeper
[boglesby] GEODE-1677: Events are now added to tmpQueuedEvents while shadow pr is
[agingade] GEODE-1669: Made changes to add/remove list of interested keys using
[jiliao] GEODE-17: update selenium-firefox driver to run uiTest
[jiliao] GEODE-17: fix javadoc warnings
[bschuchardt] javadoc clean-up for commmunications/membership classes
[jiliao] GEODE-1617: Regions can be created with a variety of characters that
[klund] GEODE-1673: fail start if security.json cannot be found
[bschuchardt] Marking test as flaky - see GEODE-1594
[huynhja] GEODE-1617: CreateRegionFunction was not attaching a cache listener
------------------------------------------
[...truncated 652 lines...]
at java.util.concurrent.Executors$RunnableAdapter.call(Executors.java:511)
at java.util.concurrent.FutureTask.run(FutureTask.java:266)
at java.util.concurrent.ThreadPoolExecutor.runWorker(ThreadPoolExecutor.java:1142)
at java.util.concurrent.ThreadPoolExecutor$Worker.run(ThreadPoolExecutor.java:617)
at com.gemstone.gemfire.distributed.internal.DistributionManager.runUntilShutdown(DistributionManager.java:611)
at com.gemstone.gemfire.distributed.internal.DistributionManager$4$1.run(DistributionManager.java:885)
at java.lang.Thread.run(Thread.java:745)
Caused by: com.gemstone.gemfire.cache.DiskAccessException: For DiskStore: cluster_config: Could not lock "/x1/jenkins/jenkins-slave/workspace/Geode-release/geode-core/build/distributedTest/dunit/vm1/ConfigDiskDir_/DRLK_IFcluster_config.lk". Other JVMs might have created diskstore with same name using the same directory., caused by java.nio.channels.OverlappingFileLockException
at com.gemstone.gemfire.internal.cache.DiskStoreImpl.createLockFile(DiskStoreImpl.java:1832)
at com.gemstone.gemfire.internal.cache.DiskStoreImpl.loadFiles(DiskStoreImpl.java:1921)
at com.gemstone.gemfire.internal.cache.DiskStoreImpl.<init>(DiskStoreImpl.java:438)
at com.gemstone.gemfire.internal.cache.DiskStoreImpl.<init>(DiskStoreImpl.java:351)
at com.gemstone.gemfire.internal.cache.DiskStoreImpl.<init>(DiskStoreImpl.java:346)
at com.gemstone.gemfire.internal.cache.DiskStoreFactoryImpl.create(DiskStoreFactoryImpl.java:139)
at com.gemstone.gemfire.distributed.internal.SharedConfiguration.getConfigurationRegion(SharedConfiguration.java:708)
... 9 more
Caused by: java.nio.channels.OverlappingFileLockException
at sun.nio.ch.SharedFileLockTable.checkList(FileLockTable.java:255)
at sun.nio.ch.SharedFileLockTable.add(FileLockTable.java:152)
at sun.nio.ch.FileChannelImpl.tryLock(FileChannelImpl.java:1108)
at java.nio.channels.FileChannel.tryLock(FileChannel.java:1155)
at com.gemstone.gemfire.internal.cache.DiskStoreImpl.createLockFile(DiskStoreImpl.java:1800)
... 15 more
com.gemstone.gemfire.management.LocatorManagementDUnitTest > testWillingManagersWithPortZero FAILED
java.lang.AssertionError: Suspicious strings were written to the log during this run.
Fix the strings or use IgnoredException.addIgnoredException to ignore.
-----------------------------------------------------------------------
Found suspect string in log4j at line 896
[error 2016/07/26 08:26:44.322 UTC <Pooled Message Processor 1> tid=0x4e9] Error occurred while initializing cluster configuration
java.lang.Exception: Error occurred while initializing cluster configuration
at com.gemstone.gemfire.distributed.internal.SharedConfiguration.getConfigurationRegion(SharedConfiguration.java:732)
at com.gemstone.gemfire.distributed.internal.SharedConfiguration.initSharedConfiguration(SharedConfiguration.java:234)
at com.gemstone.gemfire.distributed.internal.InternalLocator$SharedConfigurationRunnable.run(InternalLocator.java:687)
at java.util.concurrent.Executors$RunnableAdapter.call(Executors.java:511)
at java.util.concurrent.FutureTask.run(FutureTask.java:266)
at java.util.concurrent.ThreadPoolExecutor.runWorker(ThreadPoolExecutor.java:1142)
at java.util.concurrent.ThreadPoolExecutor$Worker.run(ThreadPoolExecutor.java:617)
at com.gemstone.gemfire.distributed.internal.DistributionManager.runUntilShutdown(DistributionManager.java:611)
at com.gemstone.gemfire.distributed.internal.DistributionManager$4$1.run(DistributionManager.java:885)
at java.lang.Thread.run(Thread.java:745)
Caused by: com.gemstone.gemfire.cache.DiskAccessException: For DiskStore: cluster_config: Could not lock "/x1/jenkins/jenkins-slave/workspace/Geode-release/geode-core/build/distributedTest/dunit/vm1/ConfigDiskDir_/DRLK_IFcluster_config.lk". Other JVMs might have created diskstore with same name using the same directory., caused by java.nio.channels.OverlappingFileLockException
at com.gemstone.gemfire.internal.cache.DiskStoreImpl.createLockFile(DiskStoreImpl.java:1832)
at com.gemstone.gemfire.internal.cache.DiskStoreImpl.loadFiles(DiskStoreImpl.java:1921)
at com.gemstone.gemfire.internal.cache.DiskStoreImpl.<init>(DiskStoreImpl.java:438)
at com.gemstone.gemfire.internal.cache.DiskStoreImpl.<init>(DiskStoreImpl.java:351)
at com.gemstone.gemfire.internal.cache.DiskStoreImpl.<init>(DiskStoreImpl.java:346)
at com.gemstone.gemfire.internal.cache.DiskStoreFactoryImpl.create(DiskStoreFactoryImpl.java:139)
at com.gemstone.gemfire.distributed.internal.SharedConfiguration.getConfigurationRegion(SharedConfiguration.java:708)
... 9 more
Caused by: java.nio.channels.OverlappingFileLockException
at sun.nio.ch.SharedFileLockTable.checkList(FileLockTable.java:255)
at sun.nio.ch.SharedFileLockTable.add(FileLockTable.java:152)
at sun.nio.ch.FileChannelImpl.tryLock(FileChannelImpl.java:1108)
at java.nio.channels.FileChannel.tryLock(FileChannel.java:1155)
at com.gemstone.gemfire.internal.cache.DiskStoreImpl.createLockFile(DiskStoreImpl.java:1800)
... 15 more
7433 tests completed, 2 failed, 587 skipped
:geode-core:distributedTest FAILED
:geode-core:flakyTest
:geode-core:integrationTest
:geode-cq:assemble
:geode-cq:compileTestJavaNote: Some input files use or override a deprecated API.
Note: Recompile with -Xlint:deprecation for details.
Note: Some input files use unchecked or unsafe operations.
Note: Recompile with -Xlint:unchecked for details.
:geode-cq:processTestResources
:geode-cq:testClasses
:geode-cq:checkMissedTests
:geode-cq:test
:geode-cq:check
:geode-cq:build
:geode-cq:distributedTest
:geode-cq:flakyTest
:geode-cq:integrationTest
:geode-json:assemble
:geode-json:compileTestJava UP-TO-DATE
:geode-json:processTestResources UP-TO-DATE
:geode-json:testClasses UP-TO-DATE
:geode-json:checkMissedTests UP-TO-DATE
:geode-json:test UP-TO-DATE
:geode-json:check
:geode-json:build
:geode-json:distributedTest UP-TO-DATE
:geode-json:flakyTest UP-TO-DATE
:geode-json:integrationTest UP-TO-DATE
:geode-junit:javadoc
:geode-junit:javadocJar
:geode-junit:sourcesJar
:geode-junit:signArchives SKIPPED
:geode-junit:assemble
:geode-junit:compileTestJava
:geode-junit:processTestResources UP-TO-DATE
:geode-junit:testClasses
:geode-junit:checkMissedTests
:geode-junit:test
:geode-junit:check
:geode-junit:build
:geode-junit:distributedTest
:geode-junit:flakyTest
:geode-junit:integrationTest
:geode-lucene:assemble
:geode-lucene:compileTestJavaNote: Some input files use or override a deprecated API.
Note: Recompile with -Xlint:deprecation for details.
Note: Some input files use unchecked or unsafe operations.
Note: Recompile with -Xlint:unchecked for details.
:geode-lucene:processTestResources
:geode-lucene:testClasses
:geode-lucene:checkMissedTests
:geode-lucene:test
:geode-lucene:check
:geode-lucene:build
:geode-lucene:distributedTest
:geode-lucene:flakyTest
:geode-lucene:integrationTest
:geode-pulse:assemble
:geode-pulse:compileTestJava
Download https://repo1.maven.org/maven2/org/seleniumhq/selenium/selenium-firefox-driver/2.53.1/selenium-firefox-driver-2.53.1.pom
Download https://repo1.maven.org/maven2/org/seleniumhq/selenium/selenium-parent/2.53.1/selenium-parent-2.53.1.pom
Download https://repo1.maven.org/maven2/org/seleniumhq/selenium/selenium-api/2.53.1/selenium-api-2.53.1.pom
Download https://repo1.maven.org/maven2/org/seleniumhq/selenium/selenium-remote-driver/2.53.1/selenium-remote-driver-2.53.1.pom
Download https://repo1.maven.org/maven2/org/seleniumhq/selenium/selenium-support/2.53.1/selenium-support-2.53.1.pom
Download https://repo1.maven.org/maven2/org/seleniumhq/selenium/selenium-firefox-driver/2.53.1/selenium-firefox-driver-2.53.1.jar
Download https://repo1.maven.org/maven2/org/seleniumhq/selenium/selenium-api/2.53.1/selenium-api-2.53.1.jar
Download https://repo1.maven.org/maven2/org/seleniumhq/selenium/selenium-remote-driver/2.53.1/selenium-remote-driver-2.53.1.jar
Download https://repo1.maven.org/maven2/org/seleniumhq/selenium/selenium-support/2.53.1/selenium-support-2.53.1.jar
Note: /x1/jenkins/jenkins-slave/workspace/Geode-release/geode-pulse/src/test/java/com/vmware/gemfire/tools/pulse/tests/PulseAbstractTest.java uses or overrides a deprecated API.
Note: Recompile with -Xlint:deprecation for details.
Note: Some input files use unchecked or unsafe operations.
Note: Recompile with -Xlint:unchecked for details.
:geode-pulse:processTestResources
:geode-pulse:testClasses
:geode-pulse:checkMissedTests
:geode-pulse:test
:geode-pulse:check
:geode-pulse:build
:geode-pulse:distributedTest
:geode-pulse:flakyTest
:geode-pulse:integrationTest
:geode-rebalancer:jar
:geode-rebalancer:javadoc
:geode-rebalancer:javadocJar
:geode-rebalancer:sourcesJar
:geode-rebalancer:signArchives SKIPPED
:geode-rebalancer:assemble
:geode-rebalancer:compileTestJava
:geode-rebalancer:processTestResources UP-TO-DATE
:geode-rebalancer:testClasses
:geode-rebalancer:checkMissedTests
:geode-rebalancer:test
:geode-rebalancer:check
:geode-rebalancer:build
:geode-rebalancer:distributedTest
:geode-rebalancer:flakyTest
:geode-rebalancer:integrationTest
:geode-wan:assemble
:geode-wan:compileTestJavaNote: Some input files use or override a deprecated API.
Note: Recompile with -Xlint:deprecation for details.
Note: Some input files use unchecked or unsafe operations.
Note: Recompile with -Xlint:unchecked for details.
:geode-wan:processTestResources
:geode-wan:testClasses
:geode-wan:checkMissedTests
:geode-wan:test
:geode-wan:check
:geode-wan:build
:geode-wan:distributedTest
:geode-wan:flakyTest
:geode-wan:integrationTest
:geode-web:assemble
:geode-web:compileTestJavaNote: /x1/jenkins/jenkins-slave/workspace/Geode-release/geode-web/src/test/java/com/gemstone/gemfire/management/internal/cli/commands/DataCommandsOverHttpDistributedTest.java uses or overrides a deprecated API.
Note: Recompile with -Xlint:deprecation for details.
Note: Some input files use unchecked or unsafe operations.
Note: Recompile with -Xlint:unchecked for details.
:geode-web:processTestResources UP-TO-DATE
:geode-web:testClasses
:geode-web:checkMissedTests
:geode-web:test
:geode-web:check
:geode-web:build
:geode-web:distributedTest
:geode-web:flakyTest
:geode-web:integrationTest
:geode-web-api:assemble
:geode-web-api:compileTestJava UP-TO-DATE
:geode-web-api:processTestResources UP-TO-DATE
:geode-web-api:testClasses UP-TO-DATE
:geode-web-api:checkMissedTests UP-TO-DATE
:geode-web-api:test UP-TO-DATE
:geode-web-api:check
:geode-web-api:build
:geode-web-api:distributedTest UP-TO-DATE
:geode-web-api:flakyTest UP-TO-DATE
:geode-web-api:integrationTest UP-TO-DATE
:combineReports
All test reports at /x1/jenkins/jenkins-slave/workspace/Geode-release/build/reports/combined
:extensions/geode-modules:precheckin
:extensions/geode-modules-assembly:precheckin
:extensions/geode-modules-hibernate:precheckin
:extensions/geode-modules-session:precheckin
:extensions/geode-modules-session-internal:precheckin
:extensions/geode-modules-tomcat7:precheckin
:geode-common:precheckin
:geode-cq:precheckin
:geode-json:precheckin
:geode-junit:precheckin
:geode-lucene:precheckin
:geode-pulse:precheckin
:geode-rebalancer:precheckin
:geode-wan:precheckin
:geode-web:precheckin
:geode-web-api:precheckin
FAILURE: Build completed with 2 failures.
1: Task failed with an exception.
-----------
* What went wrong:
Execution failed for task ':geode-assembly:flakyTest'.
> There were failing tests. See the report at: file:///x1/jenkins/jenkins-slave/workspace/Geode-release/geode-assembly/build/reports/flakyTest/index.html
* Try:
Run with --stacktrace option to get the stack trace. Run with --info or --debug option to get more log output.
==============================================================================
2: Task failed with an exception.
-----------
* What went wrong:
Execution failed for task ':geode-core:distributedTest'.
> There were failing tests. See the report at: file:///x1/jenkins/jenkins-slave/workspace/Geode-release/geode-core/build/reports/distributedTest/index.html
* Try:
Run with --stacktrace option to get the stack trace. Run with --info or --debug option to get more log output.
==============================================================================
BUILD FAILED
Total time: 11 hrs 46 mins 47.833 secs
Build step 'Invoke Gradle script' changed build result to FAILURE
Build step 'Invoke Gradle script' marked build as failure
Archiving artifacts
Compressed 250.94 MB of artifacts by 12.4% relative to #7
Recording test results
Build failed in Jenkins: Geode-release #19
Posted by Apache Jenkins Server <je...@builds.apache.org>.
See <https://builds.apache.org/job/Geode-release/19/>
------------------------------------------
[...truncated 916 lines...]
:geode-assembly:distTar
:geode-assembly:distZip
:geode-assembly:writeBuildInfo
:geode-assembly:srcDistTar
:geode-assembly:srcDistZip
:geode-assembly:signArchives SKIPPED
:geode-assembly:assemble
:geode-assembly:compileTestJava
Download https://repo1.maven.org/maven2/org/apache/httpcomponents/httpclient/4.5.1/httpclient-4.5.1.pom
Download https://repo1.maven.org/maven2/org/apache/httpcomponents/httpcomponents-client/4.5.1/httpcomponents-client-4.5.1.pom
Download https://repo1.maven.org/maven2/org/apache/httpcomponents/httpcore/4.4.3/httpcore-4.4.3.pom
Download https://repo1.maven.org/maven2/org/apache/httpcomponents/httpcomponents-core/4.4.3/httpcomponents-core-4.4.3.pom
Download https://repo1.maven.org/maven2/org/apache/httpcomponents/httpclient/4.5.1/httpclient-4.5.1.jar
Download https://repo1.maven.org/maven2/org/apache/httpcomponents/httpcore/4.4.3/httpcore-4.4.3.jar
Note: Some input files use or override a deprecated API.
Note: Recompile with -Xlint:deprecation for details.
Note: Some input files use unchecked or unsafe operations.
Note: Recompile with -Xlint:unchecked for details.
:geode-assembly:processTestResources
:geode-assembly:testClasses
:geode-assembly:checkMissedTests
:geode-assembly:installDist
:geode-assembly:test
:geode-assembly:check
:geode-assembly:build
:geode-assembly:distributedTest
:geode-assembly:flakyTest
com.gemstone.gemfire.rest.internal.web.controllers.RestAPIsOnMembersFunctionExecutionDUnitTest > testFunctionExecutionOnAllMembers FAILED
java.lang.AssertionError: unable to locate geode-web-api WAR file
java.lang.NullPointerException
1 test completed, 1 failed
:geode-assembly:flakyTest FAILED
:geode-assembly:integrationTest
:geode-common:assemble
:geode-common:compileTestJava
:geode-common:processTestResources UP-TO-DATE
:geode-common:testClasses
:geode-common:checkMissedTests
:geode-common:test
:geode-common:check
:geode-common:build
:geode-common:distributedTest
:geode-common:flakyTest
:geode-common:integrationTest
:geode-core:assemble
:geode-core:checkMissedTests
Download https://repo1.maven.org/maven2/org/apache/derby/derby/10.2.2.0/derby-10.2.2.0.pom
Download https://repo1.maven.org/maven2/org/apache/derby/derby/10.2.2.0/derby-10.2.2.0.jar
:geode-core:test
:geode-core:check
:geode-core:build
:geode-core:distributedTest
:geode-core:flakyTest
:geode-core:integrationTest
:geode-cq:assemble
:geode-cq:compileTestJavaNote: Some input files use or override a deprecated API.
Note: Recompile with -Xlint:deprecation for details.
Note: Some input files use unchecked or unsafe operations.
Note: Recompile with -Xlint:unchecked for details.
:geode-cq:processTestResources
:geode-cq:testClasses
:geode-cq:checkMissedTests
:geode-cq:test
:geode-cq:check
:geode-cq:build
:geode-cq:distributedTest
:geode-cq:flakyTest
:geode-cq:integrationTest
:geode-json:assemble
:geode-json:compileTestJava UP-TO-DATE
:geode-json:processTestResources UP-TO-DATE
:geode-json:testClasses UP-TO-DATE
:geode-json:checkMissedTests UP-TO-DATE
:geode-json:test UP-TO-DATE
:geode-json:check
:geode-json:build
:geode-json:distributedTest UP-TO-DATE
:geode-json:flakyTest UP-TO-DATE
:geode-json:integrationTest UP-TO-DATE
:geode-junit:javadoc
:geode-junit:javadocJar
:geode-junit:sourcesJar
:geode-junit:signArchives SKIPPED
:geode-junit:assemble
:geode-junit:compileTestJava
:geode-junit:processTestResources UP-TO-DATE
:geode-junit:testClasses
:geode-junit:checkMissedTests
:geode-junit:test
:geode-junit:check
:geode-junit:build
:geode-junit:distributedTest
:geode-junit:flakyTest
:geode-junit:integrationTest
:geode-lucene:assemble
:geode-lucene:compileTestJava
Download https://repo1.maven.org/maven2/org/apache/lucene/lucene-test-framework/6.0.0/lucene-test-framework-6.0.0.pom
Download https://repo1.maven.org/maven2/org/apache/lucene/lucene-codecs/6.0.0/lucene-codecs-6.0.0.pom
Download https://repo1.maven.org/maven2/com/carrotsearch/randomizedtesting/randomizedtesting-runner/2.3.2/randomizedtesting-runner-2.3.2.pom
Download https://repo1.maven.org/maven2/com/carrotsearch/randomizedtesting/randomizedtesting-parent/2.3.2/randomizedtesting-parent-2.3.2.pom
Download https://repo1.maven.org/maven2/org/apache/lucene/lucene-test-framework/6.0.0/lucene-test-framework-6.0.0.jar
Download https://repo1.maven.org/maven2/org/apache/lucene/lucene-codecs/6.0.0/lucene-codecs-6.0.0.jar
Download https://repo1.maven.org/maven2/com/carrotsearch/randomizedtesting/randomizedtesting-runner/2.3.2/randomizedtesting-runner-2.3.2.jar
Note: Some input files use or override a deprecated API.
Note: Recompile with -Xlint:deprecation for details.
Note: Some input files use unchecked or unsafe operations.
Note: Recompile with -Xlint:unchecked for details.
:geode-lucene:processTestResources
:geode-lucene:testClasses
:geode-lucene:checkMissedTests
:geode-lucene:test
:geode-lucene:check
:geode-lucene:build
:geode-lucene:distributedTest
:geode-lucene:flakyTest
:geode-lucene:integrationTest
:geode-pulse:assemble
:geode-pulse:compileTestJava
Download https://repo1.maven.org/maven2/org/seleniumhq/selenium/selenium-firefox-driver/2.53.1/selenium-firefox-driver-2.53.1.pom
Download https://repo1.maven.org/maven2/org/seleniumhq/selenium/selenium-parent/2.53.1/selenium-parent-2.53.1.pom
Download https://repo1.maven.org/maven2/org/seleniumhq/selenium/selenium-api/2.53.1/selenium-api-2.53.1.pom
Download https://repo1.maven.org/maven2/org/seleniumhq/selenium/selenium-remote-driver/2.53.1/selenium-remote-driver-2.53.1.pom
Download https://repo1.maven.org/maven2/org/seleniumhq/selenium/selenium-support/2.53.1/selenium-support-2.53.1.pom
Download https://repo1.maven.org/maven2/org/springframework/spring-test/4.2.4.RELEASE/spring-test-4.2.4.RELEASE.pom
Download https://repo1.maven.org/maven2/com/google/code/gson/gson/2.3.1/gson-2.3.1.pom
Download https://repo1.maven.org/maven2/org/seleniumhq/selenium/selenium-firefox-driver/2.53.1/selenium-firefox-driver-2.53.1.jar
Download https://repo1.maven.org/maven2/org/seleniumhq/selenium/selenium-api/2.53.1/selenium-api-2.53.1.jar
Download https://repo1.maven.org/maven2/org/seleniumhq/selenium/selenium-remote-driver/2.53.1/selenium-remote-driver-2.53.1.jar
Download https://repo1.maven.org/maven2/org/seleniumhq/selenium/selenium-support/2.53.1/selenium-support-2.53.1.jar
Download https://repo1.maven.org/maven2/org/springframework/spring-test/4.2.4.RELEASE/spring-test-4.2.4.RELEASE.jar
Download https://repo1.maven.org/maven2/com/google/code/gson/gson/2.3.1/gson-2.3.1.jar
Note: <https://builds.apache.org/job/Geode-release/ws/geode-pulse/src/test/java/com/vmware/gemfire/tools/pulse/tests/PulseAbstractTest.java> uses or overrides a deprecated API.
Note: Recompile with -Xlint:deprecation for details.
Note: Some input files use unchecked or unsafe operations.
Note: Recompile with -Xlint:unchecked for details.
:geode-pulse:processTestResources
:geode-pulse:testClasses
:geode-pulse:checkMissedTests
Download https://repo1.maven.org/maven2/com/jayway/jsonpath/json-path/1.2.0/json-path-1.2.0.pom
Download https://repo1.maven.org/maven2/net/minidev/json-smart/2.1.0/json-smart-2.1.0.pom
Download https://repo1.maven.org/maven2/net/minidev/parent/2.1.0/parent-2.1.0.pom
Download https://repo1.maven.org/maven2/net/minidev/asm/1.0.2/asm-1.0.2.pom
Download https://repo1.maven.org/maven2/com/jayway/jsonpath/json-path/1.2.0/json-path-1.2.0.jar
Download https://repo1.maven.org/maven2/net/minidev/json-smart/2.1.0/json-smart-2.1.0.jar
Download https://repo1.maven.org/maven2/net/minidev/asm/1.0.2/asm-1.0.2.jar
:geode-pulse:test
:geode-pulse:check
:geode-pulse:build
:geode-pulse:distributedTest
:geode-pulse:flakyTest
:geode-pulse:integrationTest
:geode-rebalancer:jar
:geode-rebalancer:javadoc
:geode-rebalancer:javadocJar
:geode-rebalancer:sourcesJar
:geode-rebalancer:signArchives SKIPPED
:geode-rebalancer:assemble
:geode-rebalancer:compileTestJava
:geode-rebalancer:processTestResources UP-TO-DATE
:geode-rebalancer:testClasses
:geode-rebalancer:checkMissedTests
:geode-rebalancer:test
:geode-rebalancer:check
:geode-rebalancer:build
:geode-rebalancer:distributedTest
:geode-rebalancer:flakyTest
:geode-rebalancer:integrationTest
:geode-wan:assemble
:geode-wan:compileTestJavaNote: Some input files use or override a deprecated API.
Note: Recompile with -Xlint:deprecation for details.
Note: Some input files use unchecked or unsafe operations.
Note: Recompile with -Xlint:unchecked for details.
:geode-wan:processTestResources
:geode-wan:testClasses
:geode-wan:checkMissedTests
:geode-wan:test
:geode-wan:check
:geode-wan:build
:geode-wan:distributedTest
:geode-wan:flakyTest
:geode-wan:integrationTest
:geode-web:assemble
:geode-web:compileTestJavaNote: <https://builds.apache.org/job/Geode-release/ws/geode-web/src/test/java/com/gemstone/gemfire/management/internal/cli/commands/DataCommandsOverHttpDistributedTest.java> uses or overrides a deprecated API.
Note: Recompile with -Xlint:deprecation for details.
Note: Some input files use unchecked or unsafe operations.
Note: Recompile with -Xlint:unchecked for details.
:geode-web:processTestResources UP-TO-DATE
:geode-web:testClasses
:geode-web:checkMissedTests
:geode-web:test
:geode-web:check
:geode-web:build
:geode-web:distributedTest
:geode-web:flakyTest
:geode-web:integrationTest
:geode-web-api:assemble
:geode-web-api:compileTestJava UP-TO-DATE
:geode-web-api:processTestResources UP-TO-DATE
:geode-web-api:testClasses UP-TO-DATE
:geode-web-api:checkMissedTests UP-TO-DATE
:geode-web-api:test UP-TO-DATE
:geode-web-api:check
:geode-web-api:build
:geode-web-api:distributedTest UP-TO-DATE
:geode-web-api:flakyTest UP-TO-DATE
:geode-web-api:integrationTest UP-TO-DATE
:combineReports
All test reports at <https://builds.apache.org/job/Geode-release/ws/build/reports/combined>
:extensions/geode-modules:precheckin
:extensions/geode-modules-assembly:precheckin
:extensions/geode-modules-hibernate:precheckin
:extensions/geode-modules-session:precheckin
:extensions/geode-modules-session-internal:precheckin
:extensions/geode-modules-tomcat7:precheckin
:geode-common:precheckin
:geode-core:precheckin
:geode-cq:precheckin
:geode-json:precheckin
:geode-junit:precheckin
:geode-lucene:precheckin
:geode-pulse:precheckin
:geode-rebalancer:precheckin
:geode-wan:precheckin
:geode-web:precheckin
:geode-web-api:precheckin
FAILURE: Build failed with an exception.
* What went wrong:
Execution failed for task ':geode-assembly:flakyTest'.
> There were failing tests. See the report at: file://<https://builds.apache.org/job/Geode-release/ws/geode-assembly/build/reports/flakyTest/index.html>
* Try:
Run with --stacktrace option to get the stack trace. Run with --info or --debug option to get more log output.
BUILD FAILED
Total time: 10 hrs 54 mins 23.877 secs
Build step 'Invoke Gradle script' changed build result to FAILURE
Build step 'Invoke Gradle script' marked build as failure
Archiving artifacts
Compressed 250.79 MB of artifacts by 12.1% relative to #7
Recording test results
Re: Build failed in Jenkins: Geode-release #18
Posted by Mark Bretl <as...@gmail.com>.
So the report publisher has '**/build/test-results/*.xml,
**/build/test-results-flaky/*.xml' which should work. I am not sure why it
is not picking up the flaky test failures, however, I did update to remove
the space between the two patterns,
'**/build/test-results/*.xml,**/build/test-results-flaky/*.xml'. I hope
that will fix it, as maybe it was trimming the space at the beginning of
the second pattern and using it as is.
I should note I updated both the release and nightly builds, as they have
the same patterns.
--Mark
On Thu, Jul 28, 2016 at 11:56 AM, Dan Smith <ds...@pivotal.io> wrote:
> Also, the release branch jenkins job needs to pick up failures from this
> flakyTest target because they are not showing up in the test results. Can
> someone with access to jenkins fix that?
>
> -Dan
>
> On Thu, Jul 28, 2016 at 10:57 AM, Bruce Schuchardt <bschuchardt@pivotal.io
> >
> wrote:
>
> > This is a problem in the geode-assembly build.gradle configuration. The
> > flakyTest task needs to depend on the installed product, like
> > distributedTest does. I've fixed that on the develop branch.
> >
> >
> > Le 7/28/2016 à 10:45 AM, Apache Jenkins Server a écrit :
> >
> >> l.web.controllers.RestAPIsOnMembersFunctionExecutionDUnitTest >
> >> testFunctionExecutionOnAllMembers FAILED
> >> java.lang.AssertionError: unable to locate geode-web-api WAR file
> >>
> >> java.lang.NullPointerException
> >>
> >
> >
>
Re: Build failed in Jenkins: Geode-release #18
Posted by Dan Smith <ds...@pivotal.io>.
Also, the release branch jenkins job needs to pick up failures from this
flakyTest target because they are not showing up in the test results. Can
someone with access to jenkins fix that?
-Dan
On Thu, Jul 28, 2016 at 10:57 AM, Bruce Schuchardt <bs...@pivotal.io>
wrote:
> This is a problem in the geode-assembly build.gradle configuration. The
> flakyTest task needs to depend on the installed product, like
> distributedTest does. I've fixed that on the develop branch.
>
>
> Le 7/28/2016 à 10:45 AM, Apache Jenkins Server a écrit :
>
>> l.web.controllers.RestAPIsOnMembersFunctionExecutionDUnitTest >
>> testFunctionExecutionOnAllMembers FAILED
>> java.lang.AssertionError: unable to locate geode-web-api WAR file
>>
>> java.lang.NullPointerException
>>
>
>
Re: Build failed in Jenkins: Geode-release #18
Posted by Bruce Schuchardt <bs...@pivotal.io>.
This is a problem in the geode-assembly build.gradle configuration. The
flakyTest task needs to depend on the installed product, like
distributedTest does. I've fixed that on the develop branch.
Le 7/28/2016 � 10:45 AM, Apache Jenkins Server a �crit :
> l.web.controllers.RestAPIsOnMembersFunctionExecutionDUnitTest > testFunctionExecutionOnAllMembers FAILED
> java.lang.AssertionError: unable to locate geode-web-api WAR file
>
> java.lang.NullPointerException
Build failed in Jenkins: Geode-release #18
Posted by Apache Jenkins Server <je...@builds.apache.org>.
See <https://builds.apache.org/job/Geode-release/18/>
------------------------------------------
[...truncated 558 lines...]
:geode-core:webJar
:geode-cq:jar
:geode-cq:javadoc
:geode-cq:javadocJar
:geode-cq:sourcesJar
:geode-cq:signArchives SKIPPED
:geode-json:javadocJar
:geode-json:sourcesJar
:geode-json:signArchives SKIPPED
:geode-lucene:jar
:geode-lucene:javadoc
:geode-lucene:javadocJar
:geode-lucene:sourcesJar
:geode-lucene:signArchives SKIPPED
:geode-pulse:javadoc
:geode-pulse:javadocJar
:geode-pulse:sourcesJar
:geode-pulse:war
:geode-pulse:signArchives SKIPPED
:geode-wan:jar
:geode-wan:javadoc
:geode-wan:javadocJar
:geode-wan:sourcesJar
:geode-wan:signArchives SKIPPED
:geode-web:javadoc UP-TO-DATE
:geode-web:javadocJar
:geode-web:sourcesJar
:geode-web:war
:geode-web:signArchives SKIPPED
:geode-web-api:jar
:geode-web-api:javadoc
:geode-web-api:javadocJar
:geode-web-api:sourcesJar
:geode-web-api:war
:geode-web-api:signArchives SKIPPED
:geode-assembly:distTar
:geode-assembly:distZip
:geode-assembly:writeBuildInfo
:geode-assembly:srcDistTar
:geode-assembly:srcDistZip
:geode-assembly:signArchives SKIPPED
:geode-assembly:assemble
:geode-assembly:compileTestJavaNote: Some input files use or override a deprecated API.
Note: Recompile with -Xlint:deprecation for details.
Note: Some input files use unchecked or unsafe operations.
Note: Recompile with -Xlint:unchecked for details.
:geode-assembly:processTestResources
:geode-assembly:testClasses
:geode-assembly:checkMissedTests
:geode-assembly:installDist
:geode-assembly:test
:geode-assembly:check
:geode-assembly:build
:geode-assembly:distributedTest
:geode-assembly:flakyTest
com.gemstone.gemfire.rest.internal.web.controllers.RestAPIsOnMembersFunctionExecutionDUnitTest > testFunctionExecutionOnAllMembers FAILED
java.lang.AssertionError: unable to locate geode-web-api WAR file
java.lang.NullPointerException
1 test completed, 1 failed
:geode-assembly:flakyTest FAILED
:geode-assembly:integrationTest
:geode-common:assemble
:geode-common:compileTestJava
:geode-common:processTestResources UP-TO-DATE
:geode-common:testClasses
:geode-common:checkMissedTests
:geode-common:test
:geode-common:check
:geode-common:build
:geode-common:distributedTest
:geode-common:flakyTest
:geode-common:integrationTest
:geode-core:assemble
:geode-core:checkMissedTests
:geode-core:test
:geode-core:check
:geode-core:build
:geode-core:distributedTest
:geode-core:flakyTest
:geode-core:integrationTest
:geode-cq:assemble
:geode-cq:compileTestJavaNote: Some input files use or override a deprecated API.
Note: Recompile with -Xlint:deprecation for details.
Note: Some input files use unchecked or unsafe operations.
Note: Recompile with -Xlint:unchecked for details.
:geode-cq:processTestResources
:geode-cq:testClasses
:geode-cq:checkMissedTests
:geode-cq:test
:geode-cq:check
:geode-cq:build
:geode-cq:distributedTest
:geode-cq:flakyTest
:geode-cq:integrationTest
:geode-json:assemble
:geode-json:compileTestJava UP-TO-DATE
:geode-json:processTestResources UP-TO-DATE
:geode-json:testClasses UP-TO-DATE
:geode-json:checkMissedTests UP-TO-DATE
:geode-json:test UP-TO-DATE
:geode-json:check
:geode-json:build
:geode-json:distributedTest UP-TO-DATE
:geode-json:flakyTest UP-TO-DATE
:geode-json:integrationTest UP-TO-DATE
:geode-junit:javadoc
:geode-junit:javadocJar
:geode-junit:sourcesJar
:geode-junit:signArchives SKIPPED
:geode-junit:assemble
:geode-junit:compileTestJava
:geode-junit:processTestResources UP-TO-DATE
:geode-junit:testClasses
:geode-junit:checkMissedTests
:geode-junit:test
:geode-junit:check
:geode-junit:build
:geode-junit:distributedTest
:geode-junit:flakyTest
:geode-junit:integrationTest
:geode-lucene:assemble
:geode-lucene:compileTestJavaNote: Some input files use or override a deprecated API.
Note: Recompile with -Xlint:deprecation for details.
Note: Some input files use unchecked or unsafe operations.
Note: Recompile with -Xlint:unchecked for details.
:geode-lucene:processTestResources
:geode-lucene:testClasses
:geode-lucene:checkMissedTests
:geode-lucene:test
:geode-lucene:check
:geode-lucene:build
:geode-lucene:distributedTest
:geode-lucene:flakyTest
:geode-lucene:integrationTest
:geode-pulse:assemble
:geode-pulse:compileTestJavaNote: /x1/jenkins/jenkins-slave/workspace/Geode-release/geode-pulse/src/test/java/com/vmware/gemfire/tools/pulse/tests/PulseAbstractTest.java uses or overrides a deprecated API.
Note: Recompile with -Xlint:deprecation for details.
Note: Some input files use unchecked or unsafe operations.
Note: Recompile with -Xlint:unchecked for details.
:geode-pulse:processTestResources
:geode-pulse:testClasses
:geode-pulse:checkMissedTests
:geode-pulse:test
:geode-pulse:check
:geode-pulse:build
:geode-pulse:distributedTest
:geode-pulse:flakyTest
:geode-pulse:integrationTest
:geode-rebalancer:jar
:geode-rebalancer:javadoc
:geode-rebalancer:javadocJar
:geode-rebalancer:sourcesJar
:geode-rebalancer:signArchives SKIPPED
:geode-rebalancer:assemble
:geode-rebalancer:compileTestJava
:geode-rebalancer:processTestResources UP-TO-DATE
:geode-rebalancer:testClasses
:geode-rebalancer:checkMissedTests
:geode-rebalancer:test
:geode-rebalancer:check
:geode-rebalancer:build
:geode-rebalancer:distributedTest
:geode-rebalancer:flakyTest
:geode-rebalancer:integrationTest
:geode-wan:assemble
:geode-wan:compileTestJavaNote: Some input files use or override a deprecated API.
Note: Recompile with -Xlint:deprecation for details.
Note: Some input files use unchecked or unsafe operations.
Note: Recompile with -Xlint:unchecked for details.
:geode-wan:processTestResources
:geode-wan:testClasses
:geode-wan:checkMissedTests
:geode-wan:test
:geode-wan:check
:geode-wan:build
:geode-wan:distributedTest
:geode-wan:flakyTest
:geode-wan:integrationTest
:geode-web:assemble
:geode-web:compileTestJavaNote: /x1/jenkins/jenkins-slave/workspace/Geode-release/geode-web/src/test/java/com/gemstone/gemfire/management/internal/cli/commands/DataCommandsOverHttpDistributedTest.java uses or overrides a deprecated API.
Note: Recompile with -Xlint:deprecation for details.
Note: Some input files use unchecked or unsafe operations.
Note: Recompile with -Xlint:unchecked for details.
:geode-web:processTestResources UP-TO-DATE
:geode-web:testClasses
:geode-web:checkMissedTests
:geode-web:test
:geode-web:check
:geode-web:build
:geode-web:distributedTest
:geode-web:flakyTest
:geode-web:integrationTest
:geode-web-api:assemble
:geode-web-api:compileTestJava UP-TO-DATE
:geode-web-api:processTestResources UP-TO-DATE
:geode-web-api:testClasses UP-TO-DATE
:geode-web-api:checkMissedTests UP-TO-DATE
:geode-web-api:test UP-TO-DATE
:geode-web-api:check
:geode-web-api:build
:geode-web-api:distributedTest UP-TO-DATE
:geode-web-api:flakyTest UP-TO-DATE
:geode-web-api:integrationTest UP-TO-DATE
:combineReports
All test reports at /x1/jenkins/jenkins-slave/workspace/Geode-release/build/reports/combined
:extensions/geode-modules:precheckin
:extensions/geode-modules-assembly:precheckin
:extensions/geode-modules-hibernate:precheckin
:extensions/geode-modules-session:precheckin
:extensions/geode-modules-session-internal:precheckin
:extensions/geode-modules-tomcat7:precheckin
:geode-common:precheckin
:geode-core:precheckin
:geode-cq:precheckin
:geode-json:precheckin
:geode-junit:precheckin
:geode-lucene:precheckin
:geode-pulse:precheckin
:geode-rebalancer:precheckin
:geode-wan:precheckin
:geode-web:precheckin
:geode-web-api:precheckin
FAILURE: Build failed with an exception.
* What went wrong:
Execution failed for task ':geode-assembly:flakyTest'.
> There were failing tests. See the report at: file:///x1/jenkins/jenkins-slave/workspace/Geode-release/geode-assembly/build/reports/flakyTest/index.html
* Try:
Run with --stacktrace option to get the stack trace. Run with --info or --debug option to get more log output.
BUILD FAILED
Total time: 11 hrs 10 mins 32.997 secs
Build step 'Invoke Gradle script' changed build result to FAILURE
Build step 'Invoke Gradle script' marked build as failure
Archiving artifacts
Compressed 250.83 MB of artifacts by 16.5% relative to #7
Recording test results
Re: Build failed in Jenkins: Geode-release #17
Posted by Bruce Schuchardt <bs...@pivotal.io>.
A "ulimit -a" would be sufficient
Le 7/28/2016 � 9:56 AM, Mark Bretl a �crit :
> We don't have any information, however, we could add a few shell commands
> at the beginning of the build to help debug possible issues that could come
> up?
>
> If we need anything specific, we would have to create an INFRA ticket.
>
> --Mark
>
> On Thu, Jul 28, 2016 at 8:58 AM, Bruce Schuchardt <bs...@pivotal.io>
> wrote:
>
>> Do we have any information on the ulimit settings in the account running
>> the tests? This may just be an issue with how the account is configured.
>>
>>
>> Le 7/27/2016 � 9:21 AM, Kirk Lund a �crit :
>>
>>> Looks like OutOfMemory is the cause of this failure. Do we need to
>>> increase
>>> heap size for Jenkins or is there a way to get debug info?
>>>
>>> -Kirk
>>>
>>>
>>> On Wed, Jul 27, 2016 at 12:37 AM, Apache Jenkins Server <
>>> jenkins@builds.apache.org> wrote:
>>>
>>> See <https://builds.apache.org/job/Geode-release/17/changes>
>>>> Changes:
>>>>
>>>> [wmarkito] GEODE-1696 - Updating release version
>>>>
>>>> ------------------------------------------
>>>> [...truncated 1019 lines...]
>>>> at
>>>>
>>>> com.gemstone.gemfire.internal.admin.remote.AdminRegion.destroyRegion(AdminRegion.java:128)
>>>> at
>>>>
>>>> com.gemstone.gemfire.distributed.internal.ConsoleDistributionManagerDUnitTest.testApplications(ConsoleDistributionManagerDUnitTest.java:308)
>>>>
>>>> 7433 tests completed, 1 failed, 587 skipped
>>>> :geode-core:distributedTest FAILED
>>>> :geode-core:flakyTest
>>>>
>>>> com.gemstone.gemfire.security.ClientAuthenticationDUnitTest >
>>>> testCredentialsForNotifications FAILED
>>>> com.gemstone.gemfire.test.dunit.RMIException: While invoking
>>>>
>>>> com.gemstone.gemfire.security.ClientAuthenticationTestCase$$Lambda$16/180944566.run
>>>> in VM 2 running on Host asf900.gq1.ygridcore.net with 4 VMs
>>>> at com.gemstone.gemfire.test.dunit.VM.invoke(VM.java:389)
>>>> at com.gemstone.gemfire.test.dunit.VM.invoke(VM.java:355)
>>>> at com.gemstone.gemfire.test.dunit.VM.invoke(VM.java:293)
>>>> at
>>>>
>>>> com.gemstone.gemfire.security.ClientAuthenticationTestCase.createClient1NoException(ClientAuthenticationTestCase.java:540)
>>>> at
>>>>
>>>> com.gemstone.gemfire.security.ClientAuthenticationTestCase.doTestCredentialsForNotifications(ClientAuthenticationTestCase.java:427)
>>>> at
>>>>
>>>> com.gemstone.gemfire.security.ClientAuthenticationDUnitTest.testCredentialsForNotifications(ClientAuthenticationDUnitTest.java:82)
>>>>
>>>> Caused by:
>>>> java.lang.OutOfMemoryError: unable to create new native thread
>>>>
>>>> java.lang.AssertionError: Suspicious strings were written to the log
>>>> during this run.
>>>> Fix the strings or use IgnoredException.addIgnoredException to
>>>> ignore.
>>>>
>>>> -----------------------------------------------------------------------
>>>> Found suspect string in log4j at line 1157
>>>>
>>>> [error 2016/07/27 02:00:23.987 UTC <RMI TCP
>>>> Connection(1)-67.195.81.144> tid=0x1b] java.lang.OutOfMemoryError: unable
>>>> to create new native thread
>>>>
>>>>
>>>> com.gemstone.gemfire.distributed.internal.deadlock.GemFireDeadlockDetectorDUnitTest
>>>>
>>>>> classMethod FAILED
>>>>>
>>>> java.lang.RuntimeException: Unable to launch dunit VMS
>>>>
>>>> Caused by:
>>>> java.lang.RuntimeException: VMs did not start up with 30 seconds
>>>>
>>>> 189 tests completed, 2 failed, 6 skipped
>>>> :geode-core:flakyTest FAILED
>>>> :geode-core:integrationTest
>>>> :geode-cq:assemble
>>>> :geode-cq:compileTestJavaNote: Some input files use or override a
>>>> deprecated API.
>>>> Note: Recompile with -Xlint:deprecation for details.
>>>> Note: Some input files use unchecked or unsafe operations.
>>>> Note: Recompile with -Xlint:unchecked for details.
>>>>
>>>> :geode-cq:processTestResources
>>>> :geode-cq:testClasses
>>>> :geode-cq:checkMissedTests
>>>> :geode-cq:test
>>>> :geode-cq:check
>>>> :geode-cq:build
>>>> :geode-cq:distributedTest
>>>> :geode-cq:flakyTest
>>>> :geode-cq:integrationTest
>>>> :geode-json:assemble
>>>> :geode-json:compileTestJava UP-TO-DATE
>>>> :geode-json:processTestResources UP-TO-DATE
>>>> :geode-json:testClasses UP-TO-DATE
>>>> :geode-json:checkMissedTests UP-TO-DATE
>>>> :geode-json:test UP-TO-DATE
>>>> :geode-json:check
>>>> :geode-json:build
>>>> :geode-json:distributedTest UP-TO-DATE
>>>> :geode-json:flakyTest UP-TO-DATE
>>>> :geode-json:integrationTest UP-TO-DATE
>>>> :geode-junit:javadoc
>>>> :geode-junit:javadocJar
>>>> :geode-junit:sourcesJar
>>>> :geode-junit:signArchives SKIPPED
>>>> :geode-junit:assemble
>>>> :geode-junit:compileTestJava
>>>> :geode-junit:processTestResources UP-TO-DATE
>>>> :geode-junit:testClasses
>>>> :geode-junit:checkMissedTests
>>>> :geode-junit:test
>>>> :geode-junit:check
>>>> :geode-junit:build
>>>> :geode-junit:distributedTest
>>>> :geode-junit:flakyTest
>>>> :geode-junit:integrationTest
>>>> :geode-lucene:assemble
>>>> :geode-lucene:compileTestJava
>>>> Download
>>>>
>>>> https://repo1.maven.org/maven2/org/apache/lucene/lucene-test-framework/6.0.0/lucene-test-framework-6.0.0.pom
>>>> Download
>>>>
>>>> https://repo1.maven.org/maven2/org/apache/lucene/lucene-codecs/6.0.0/lucene-codecs-6.0.0.pom
>>>> Download
>>>>
>>>> https://repo1.maven.org/maven2/com/carrotsearch/randomizedtesting/randomizedtesting-runner/2.3.2/randomizedtesting-runner-2.3.2.pom
>>>> Download
>>>>
>>>> https://repo1.maven.org/maven2/com/carrotsearch/randomizedtesting/randomizedtesting-parent/2.3.2/randomizedtesting-parent-2.3.2.pom
>>>> Download
>>>>
>>>> https://repo1.maven.org/maven2/org/apache/lucene/lucene-test-framework/6.0.0/lucene-test-framework-6.0.0.jar
>>>> Download
>>>>
>>>> https://repo1.maven.org/maven2/org/apache/lucene/lucene-codecs/6.0.0/lucene-codecs-6.0.0.jar
>>>> Download
>>>>
>>>> https://repo1.maven.org/maven2/com/carrotsearch/randomizedtesting/randomizedtesting-runner/2.3.2/randomizedtesting-runner-2.3.2.jar
>>>> Note: Some input files use or override a deprecated API.
>>>> Note: Recompile with -Xlint:deprecation for details.
>>>> Note: Some input files use unchecked or unsafe operations.
>>>> Note: Recompile with -Xlint:unchecked for details.
>>>> :geode-lucene:processTestResources
>>>> :geode-lucene:testClasses
>>>> :geode-lucene:checkMissedTests
>>>> :geode-lucene:test
>>>> :geode-lucene:check
>>>> :geode-lucene:build
>>>> :geode-lucene:distributedTest
>>>> :geode-lucene:flakyTest
>>>> :geode-lucene:integrationTest
>>>> :geode-pulse:assemble
>>>> :geode-pulse:compileTestJava
>>>> Download
>>>>
>>>> https://repo1.maven.org/maven2/org/seleniumhq/selenium/selenium-firefox-driver/2.53.1/selenium-firefox-driver-2.53.1.pom
>>>> Download
>>>>
>>>> https://repo1.maven.org/maven2/org/seleniumhq/selenium/selenium-parent/2.53.1/selenium-parent-2.53.1.pom
>>>> Download
>>>>
>>>> https://repo1.maven.org/maven2/org/seleniumhq/selenium/selenium-api/2.53.1/selenium-api-2.53.1.pom
>>>> Download
>>>>
>>>> https://repo1.maven.org/maven2/org/seleniumhq/selenium/selenium-remote-driver/2.53.1/selenium-remote-driver-2.53.1.pom
>>>> Download
>>>>
>>>> https://repo1.maven.org/maven2/org/seleniumhq/selenium/selenium-support/2.53.1/selenium-support-2.53.1.pom
>>>> Download
>>>>
>>>> https://repo1.maven.org/maven2/org/springframework/spring-test/4.2.4.RELEASE/spring-test-4.2.4.RELEASE.pom
>>>> Download
>>>>
>>>> https://repo1.maven.org/maven2/com/google/code/gson/gson/2.3.1/gson-2.3.1.pom
>>>> Download
>>>>
>>>> https://repo1.maven.org/maven2/org/seleniumhq/selenium/selenium-firefox-driver/2.53.1/selenium-firefox-driver-2.53.1.jar
>>>> Download
>>>>
>>>> https://repo1.maven.org/maven2/org/seleniumhq/selenium/selenium-api/2.53.1/selenium-api-2.53.1.jar
>>>> Download
>>>>
>>>> https://repo1.maven.org/maven2/org/seleniumhq/selenium/selenium-remote-driver/2.53.1/selenium-remote-driver-2.53.1.jar
>>>> Download
>>>>
>>>> https://repo1.maven.org/maven2/org/seleniumhq/selenium/selenium-support/2.53.1/selenium-support-2.53.1.jar
>>>> Download
>>>>
>>>> https://repo1.maven.org/maven2/org/springframework/spring-test/4.2.4.RELEASE/spring-test-4.2.4.RELEASE.jar
>>>> Download
>>>>
>>>> https://repo1.maven.org/maven2/com/google/code/gson/gson/2.3.1/gson-2.3.1.jar
>>>> Note: <
>>>>
>>>> https://builds.apache.org/job/Geode-release/ws/geode-pulse/src/test/java/com/vmware/gemfire/tools/pulse/tests/PulseAbstractTest.java
>>>> uses or overrides a deprecated API.
>>>> Note: Recompile with -Xlint:deprecation for details.
>>>> Note: Some input files use unchecked or unsafe operations.
>>>> Note: Recompile with -Xlint:unchecked for details.
>>>> :geode-pulse:processTestResources
>>>> :geode-pulse:testClasses
>>>> :geode-pulse:checkMissedTests
>>>> Download
>>>>
>>>> https://repo1.maven.org/maven2/com/jayway/jsonpath/json-path/1.2.0/json-path-1.2.0.pom
>>>> Download
>>>>
>>>> https://repo1.maven.org/maven2/net/minidev/json-smart/2.1.0/json-smart-2.1.0.pom
>>>> Download
>>>> https://repo1.maven.org/maven2/net/minidev/parent/2.1.0/parent-2.1.0.pom
>>>> Download
>>>> https://repo1.maven.org/maven2/net/minidev/asm/1.0.2/asm-1.0.2.pom
>>>> Download
>>>>
>>>> https://repo1.maven.org/maven2/com/jayway/jsonpath/json-path/1.2.0/json-path-1.2.0.jar
>>>> Download
>>>>
>>>> https://repo1.maven.org/maven2/net/minidev/json-smart/2.1.0/json-smart-2.1.0.jar
>>>> Download
>>>> https://repo1.maven.org/maven2/net/minidev/asm/1.0.2/asm-1.0.2.jar
>>>> :geode-pulse:test
>>>> :geode-pulse:check
>>>> :geode-pulse:build
>>>> :geode-pulse:distributedTest
>>>> :geode-pulse:flakyTest
>>>> :geode-pulse:integrationTest
>>>> :geode-rebalancer:jar
>>>> :geode-rebalancer:javadoc
>>>> :geode-rebalancer:javadocJar
>>>> :geode-rebalancer:sourcesJar
>>>> :geode-rebalancer:signArchives SKIPPED
>>>> :geode-rebalancer:assemble
>>>> :geode-rebalancer:compileTestJava
>>>> :geode-rebalancer:processTestResources UP-TO-DATE
>>>> :geode-rebalancer:testClasses
>>>> :geode-rebalancer:checkMissedTests
>>>> :geode-rebalancer:test
>>>> :geode-rebalancer:check
>>>> :geode-rebalancer:build
>>>> :geode-rebalancer:distributedTest
>>>> :geode-rebalancer:flakyTest
>>>> :geode-rebalancer:integrationTest
>>>> :geode-wan:assemble
>>>> :geode-wan:compileTestJavaNote: Some input files use or override a
>>>> deprecated API.
>>>> Note: Recompile with -Xlint:deprecation for details.
>>>> Note: Some input files use unchecked or unsafe operations.
>>>> Note: Recompile with -Xlint:unchecked for details.
>>>>
>>>> :geode-wan:processTestResources
>>>> :geode-wan:testClasses
>>>> :geode-wan:checkMissedTests
>>>> :geode-wan:test
>>>> :geode-wan:check
>>>> :geode-wan:build
>>>> :geode-wan:distributedTest
>>>> :geode-wan:flakyTest
>>>> :geode-wan:integrationTest
>>>> :geode-web:assemble
>>>> :geode-web:compileTestJavaNote: <
>>>>
>>>> https://builds.apache.org/job/Geode-release/ws/geode-web/src/test/java/com/gemstone/gemfire/management/internal/cli/commands/DataCommandsOverHttpDistributedTest.java
>>>> uses or overrides a deprecated API.
>>>> Note: Recompile with -Xlint:deprecation for details.
>>>> Note: Some input files use unchecked or unsafe operations.
>>>> Note: Recompile with -Xlint:unchecked for details.
>>>>
>>>> :geode-web:processTestResources UP-TO-DATE
>>>> :geode-web:testClasses
>>>> :geode-web:checkMissedTests
>>>> :geode-web:test
>>>> :geode-web:check
>>>> :geode-web:build
>>>> :geode-web:distributedTest
>>>> :geode-web:flakyTest
>>>> :geode-web:integrationTest
>>>> :geode-web-api:assemble
>>>> :geode-web-api:compileTestJava UP-TO-DATE
>>>> :geode-web-api:processTestResources UP-TO-DATE
>>>> :geode-web-api:testClasses UP-TO-DATE
>>>> :geode-web-api:checkMissedTests UP-TO-DATE
>>>> :geode-web-api:test UP-TO-DATE
>>>> :geode-web-api:check
>>>> :geode-web-api:build
>>>> :geode-web-api:distributedTest UP-TO-DATE
>>>> :geode-web-api:flakyTest UP-TO-DATE
>>>> :geode-web-api:integrationTest UP-TO-DATE
>>>> :combineReports
>>>> All test reports at <
>>>> https://builds.apache.org/job/Geode-release/ws/build/reports/combined>
>>>> :extensions/geode-modules:precheckin
>>>> :extensions/geode-modules-assembly:precheckin
>>>> :extensions/geode-modules-hibernate:precheckin
>>>> :extensions/geode-modules-session:precheckin
>>>> :extensions/geode-modules-session-internal:precheckin
>>>> :extensions/geode-modules-tomcat7:precheckin
>>>> :geode-common:precheckin
>>>> :geode-cq:precheckin
>>>> :geode-json:precheckin
>>>> :geode-junit:precheckin
>>>> :geode-lucene:precheckin
>>>> :geode-pulse:precheckin
>>>> :geode-rebalancer:precheckin
>>>> :geode-wan:precheckin
>>>> :geode-web:precheckin
>>>> :geode-web-api:precheckin
>>>>
>>>> FAILURE: Build completed with 3 failures.
>>>>
>>>> 1: Task failed with an exception.
>>>> -----------
>>>> * What went wrong:
>>>> Execution failed for task ':geode-assembly:flakyTest'.
>>>>
>>>>> There were failing tests. See the report at: file://<
>>>>>
>>>> https://builds.apache.org/job/Geode-release/ws/geode-assembly/build/reports/flakyTest/index.html
>>>> * Try:
>>>> Run with --stacktrace option to get the stack trace. Run with --info or
>>>> --debug option to get more log output.
>>>>
>>>>
>>>> ==============================================================================
>>>>
>>>> 2: Task failed with an exception.
>>>> -----------
>>>> * What went wrong:
>>>> Execution failed for task ':geode-core:distributedTest'.
>>>>
>>>>> There were failing tests. See the report at: file://<
>>>>>
>>>> https://builds.apache.org/job/Geode-release/ws/geode-core/build/reports/distributedTest/index.html
>>>> * Try:
>>>> Run with --stacktrace option to get the stack trace. Run with --info or
>>>> --debug option to get more log output.
>>>>
>>>>
>>>> ==============================================================================
>>>>
>>>> 3: Task failed with an exception.
>>>> -----------
>>>> * What went wrong:
>>>> Execution failed for task ':geode-core:flakyTest'.
>>>>
>>>>> There were failing tests. See the report at: file://<
>>>>>
>>>> https://builds.apache.org/job/Geode-release/ws/geode-core/build/reports/flakyTest/index.html
>>>> * Try:
>>>> Run with --stacktrace option to get the stack trace. Run with --info or
>>>> --debug option to get more log output.
>>>>
>>>>
>>>> ==============================================================================
>>>>
>>>> BUILD FAILED
>>>>
>>>> Total time: 11 hrs 26 mins 30.535 secs
>>>> Build step 'Invoke Gradle script' changed build result to FAILURE
>>>> Build step 'Invoke Gradle script' marked build as failure
>>>> Archiving artifacts
>>>> Compressed 250.79 MB of artifacts by 12.1% relative to #7
>>>> Recording test results
>>>>
>>>>
Re: Build failed in Jenkins: Geode-release #17
Posted by Mark Bretl <as...@gmail.com>.
We don't have any information, however, we could add a few shell commands
at the beginning of the build to help debug possible issues that could come
up?
If we need anything specific, we would have to create an INFRA ticket.
--Mark
On Thu, Jul 28, 2016 at 8:58 AM, Bruce Schuchardt <bs...@pivotal.io>
wrote:
> Do we have any information on the ulimit settings in the account running
> the tests? This may just be an issue with how the account is configured.
>
>
> Le 7/27/2016 à 9:21 AM, Kirk Lund a écrit :
>
>> Looks like OutOfMemory is the cause of this failure. Do we need to
>> increase
>> heap size for Jenkins or is there a way to get debug info?
>>
>> -Kirk
>>
>>
>> On Wed, Jul 27, 2016 at 12:37 AM, Apache Jenkins Server <
>> jenkins@builds.apache.org> wrote:
>>
>> See <https://builds.apache.org/job/Geode-release/17/changes>
>>>
>>> Changes:
>>>
>>> [wmarkito] GEODE-1696 - Updating release version
>>>
>>> ------------------------------------------
>>> [...truncated 1019 lines...]
>>> at
>>>
>>> com.gemstone.gemfire.internal.admin.remote.AdminRegion.destroyRegion(AdminRegion.java:128)
>>> at
>>>
>>> com.gemstone.gemfire.distributed.internal.ConsoleDistributionManagerDUnitTest.testApplications(ConsoleDistributionManagerDUnitTest.java:308)
>>>
>>> 7433 tests completed, 1 failed, 587 skipped
>>> :geode-core:distributedTest FAILED
>>> :geode-core:flakyTest
>>>
>>> com.gemstone.gemfire.security.ClientAuthenticationDUnitTest >
>>> testCredentialsForNotifications FAILED
>>> com.gemstone.gemfire.test.dunit.RMIException: While invoking
>>>
>>> com.gemstone.gemfire.security.ClientAuthenticationTestCase$$Lambda$16/180944566.run
>>> in VM 2 running on Host asf900.gq1.ygridcore.net with 4 VMs
>>> at com.gemstone.gemfire.test.dunit.VM.invoke(VM.java:389)
>>> at com.gemstone.gemfire.test.dunit.VM.invoke(VM.java:355)
>>> at com.gemstone.gemfire.test.dunit.VM.invoke(VM.java:293)
>>> at
>>>
>>> com.gemstone.gemfire.security.ClientAuthenticationTestCase.createClient1NoException(ClientAuthenticationTestCase.java:540)
>>> at
>>>
>>> com.gemstone.gemfire.security.ClientAuthenticationTestCase.doTestCredentialsForNotifications(ClientAuthenticationTestCase.java:427)
>>> at
>>>
>>> com.gemstone.gemfire.security.ClientAuthenticationDUnitTest.testCredentialsForNotifications(ClientAuthenticationDUnitTest.java:82)
>>>
>>> Caused by:
>>> java.lang.OutOfMemoryError: unable to create new native thread
>>>
>>> java.lang.AssertionError: Suspicious strings were written to the log
>>> during this run.
>>> Fix the strings or use IgnoredException.addIgnoredException to
>>> ignore.
>>>
>>> -----------------------------------------------------------------------
>>> Found suspect string in log4j at line 1157
>>>
>>> [error 2016/07/27 02:00:23.987 UTC <RMI TCP
>>> Connection(1)-67.195.81.144> tid=0x1b] java.lang.OutOfMemoryError: unable
>>> to create new native thread
>>>
>>>
>>> com.gemstone.gemfire.distributed.internal.deadlock.GemFireDeadlockDetectorDUnitTest
>>>
>>>> classMethod FAILED
>>>>
>>> java.lang.RuntimeException: Unable to launch dunit VMS
>>>
>>> Caused by:
>>> java.lang.RuntimeException: VMs did not start up with 30 seconds
>>>
>>> 189 tests completed, 2 failed, 6 skipped
>>> :geode-core:flakyTest FAILED
>>> :geode-core:integrationTest
>>> :geode-cq:assemble
>>> :geode-cq:compileTestJavaNote: Some input files use or override a
>>> deprecated API.
>>> Note: Recompile with -Xlint:deprecation for details.
>>> Note: Some input files use unchecked or unsafe operations.
>>> Note: Recompile with -Xlint:unchecked for details.
>>>
>>> :geode-cq:processTestResources
>>> :geode-cq:testClasses
>>> :geode-cq:checkMissedTests
>>> :geode-cq:test
>>> :geode-cq:check
>>> :geode-cq:build
>>> :geode-cq:distributedTest
>>> :geode-cq:flakyTest
>>> :geode-cq:integrationTest
>>> :geode-json:assemble
>>> :geode-json:compileTestJava UP-TO-DATE
>>> :geode-json:processTestResources UP-TO-DATE
>>> :geode-json:testClasses UP-TO-DATE
>>> :geode-json:checkMissedTests UP-TO-DATE
>>> :geode-json:test UP-TO-DATE
>>> :geode-json:check
>>> :geode-json:build
>>> :geode-json:distributedTest UP-TO-DATE
>>> :geode-json:flakyTest UP-TO-DATE
>>> :geode-json:integrationTest UP-TO-DATE
>>> :geode-junit:javadoc
>>> :geode-junit:javadocJar
>>> :geode-junit:sourcesJar
>>> :geode-junit:signArchives SKIPPED
>>> :geode-junit:assemble
>>> :geode-junit:compileTestJava
>>> :geode-junit:processTestResources UP-TO-DATE
>>> :geode-junit:testClasses
>>> :geode-junit:checkMissedTests
>>> :geode-junit:test
>>> :geode-junit:check
>>> :geode-junit:build
>>> :geode-junit:distributedTest
>>> :geode-junit:flakyTest
>>> :geode-junit:integrationTest
>>> :geode-lucene:assemble
>>> :geode-lucene:compileTestJava
>>> Download
>>>
>>> https://repo1.maven.org/maven2/org/apache/lucene/lucene-test-framework/6.0.0/lucene-test-framework-6.0.0.pom
>>> Download
>>>
>>> https://repo1.maven.org/maven2/org/apache/lucene/lucene-codecs/6.0.0/lucene-codecs-6.0.0.pom
>>> Download
>>>
>>> https://repo1.maven.org/maven2/com/carrotsearch/randomizedtesting/randomizedtesting-runner/2.3.2/randomizedtesting-runner-2.3.2.pom
>>> Download
>>>
>>> https://repo1.maven.org/maven2/com/carrotsearch/randomizedtesting/randomizedtesting-parent/2.3.2/randomizedtesting-parent-2.3.2.pom
>>> Download
>>>
>>> https://repo1.maven.org/maven2/org/apache/lucene/lucene-test-framework/6.0.0/lucene-test-framework-6.0.0.jar
>>> Download
>>>
>>> https://repo1.maven.org/maven2/org/apache/lucene/lucene-codecs/6.0.0/lucene-codecs-6.0.0.jar
>>> Download
>>>
>>> https://repo1.maven.org/maven2/com/carrotsearch/randomizedtesting/randomizedtesting-runner/2.3.2/randomizedtesting-runner-2.3.2.jar
>>> Note: Some input files use or override a deprecated API.
>>> Note: Recompile with -Xlint:deprecation for details.
>>> Note: Some input files use unchecked or unsafe operations.
>>> Note: Recompile with -Xlint:unchecked for details.
>>> :geode-lucene:processTestResources
>>> :geode-lucene:testClasses
>>> :geode-lucene:checkMissedTests
>>> :geode-lucene:test
>>> :geode-lucene:check
>>> :geode-lucene:build
>>> :geode-lucene:distributedTest
>>> :geode-lucene:flakyTest
>>> :geode-lucene:integrationTest
>>> :geode-pulse:assemble
>>> :geode-pulse:compileTestJava
>>> Download
>>>
>>> https://repo1.maven.org/maven2/org/seleniumhq/selenium/selenium-firefox-driver/2.53.1/selenium-firefox-driver-2.53.1.pom
>>> Download
>>>
>>> https://repo1.maven.org/maven2/org/seleniumhq/selenium/selenium-parent/2.53.1/selenium-parent-2.53.1.pom
>>> Download
>>>
>>> https://repo1.maven.org/maven2/org/seleniumhq/selenium/selenium-api/2.53.1/selenium-api-2.53.1.pom
>>> Download
>>>
>>> https://repo1.maven.org/maven2/org/seleniumhq/selenium/selenium-remote-driver/2.53.1/selenium-remote-driver-2.53.1.pom
>>> Download
>>>
>>> https://repo1.maven.org/maven2/org/seleniumhq/selenium/selenium-support/2.53.1/selenium-support-2.53.1.pom
>>> Download
>>>
>>> https://repo1.maven.org/maven2/org/springframework/spring-test/4.2.4.RELEASE/spring-test-4.2.4.RELEASE.pom
>>> Download
>>>
>>> https://repo1.maven.org/maven2/com/google/code/gson/gson/2.3.1/gson-2.3.1.pom
>>> Download
>>>
>>> https://repo1.maven.org/maven2/org/seleniumhq/selenium/selenium-firefox-driver/2.53.1/selenium-firefox-driver-2.53.1.jar
>>> Download
>>>
>>> https://repo1.maven.org/maven2/org/seleniumhq/selenium/selenium-api/2.53.1/selenium-api-2.53.1.jar
>>> Download
>>>
>>> https://repo1.maven.org/maven2/org/seleniumhq/selenium/selenium-remote-driver/2.53.1/selenium-remote-driver-2.53.1.jar
>>> Download
>>>
>>> https://repo1.maven.org/maven2/org/seleniumhq/selenium/selenium-support/2.53.1/selenium-support-2.53.1.jar
>>> Download
>>>
>>> https://repo1.maven.org/maven2/org/springframework/spring-test/4.2.4.RELEASE/spring-test-4.2.4.RELEASE.jar
>>> Download
>>>
>>> https://repo1.maven.org/maven2/com/google/code/gson/gson/2.3.1/gson-2.3.1.jar
>>> Note: <
>>>
>>> https://builds.apache.org/job/Geode-release/ws/geode-pulse/src/test/java/com/vmware/gemfire/tools/pulse/tests/PulseAbstractTest.java
>>> >
>>> uses or overrides a deprecated API.
>>> Note: Recompile with -Xlint:deprecation for details.
>>> Note: Some input files use unchecked or unsafe operations.
>>> Note: Recompile with -Xlint:unchecked for details.
>>> :geode-pulse:processTestResources
>>> :geode-pulse:testClasses
>>> :geode-pulse:checkMissedTests
>>> Download
>>>
>>> https://repo1.maven.org/maven2/com/jayway/jsonpath/json-path/1.2.0/json-path-1.2.0.pom
>>> Download
>>>
>>> https://repo1.maven.org/maven2/net/minidev/json-smart/2.1.0/json-smart-2.1.0.pom
>>> Download
>>> https://repo1.maven.org/maven2/net/minidev/parent/2.1.0/parent-2.1.0.pom
>>> Download
>>> https://repo1.maven.org/maven2/net/minidev/asm/1.0.2/asm-1.0.2.pom
>>> Download
>>>
>>> https://repo1.maven.org/maven2/com/jayway/jsonpath/json-path/1.2.0/json-path-1.2.0.jar
>>> Download
>>>
>>> https://repo1.maven.org/maven2/net/minidev/json-smart/2.1.0/json-smart-2.1.0.jar
>>> Download
>>> https://repo1.maven.org/maven2/net/minidev/asm/1.0.2/asm-1.0.2.jar
>>> :geode-pulse:test
>>> :geode-pulse:check
>>> :geode-pulse:build
>>> :geode-pulse:distributedTest
>>> :geode-pulse:flakyTest
>>> :geode-pulse:integrationTest
>>> :geode-rebalancer:jar
>>> :geode-rebalancer:javadoc
>>> :geode-rebalancer:javadocJar
>>> :geode-rebalancer:sourcesJar
>>> :geode-rebalancer:signArchives SKIPPED
>>> :geode-rebalancer:assemble
>>> :geode-rebalancer:compileTestJava
>>> :geode-rebalancer:processTestResources UP-TO-DATE
>>> :geode-rebalancer:testClasses
>>> :geode-rebalancer:checkMissedTests
>>> :geode-rebalancer:test
>>> :geode-rebalancer:check
>>> :geode-rebalancer:build
>>> :geode-rebalancer:distributedTest
>>> :geode-rebalancer:flakyTest
>>> :geode-rebalancer:integrationTest
>>> :geode-wan:assemble
>>> :geode-wan:compileTestJavaNote: Some input files use or override a
>>> deprecated API.
>>> Note: Recompile with -Xlint:deprecation for details.
>>> Note: Some input files use unchecked or unsafe operations.
>>> Note: Recompile with -Xlint:unchecked for details.
>>>
>>> :geode-wan:processTestResources
>>> :geode-wan:testClasses
>>> :geode-wan:checkMissedTests
>>> :geode-wan:test
>>> :geode-wan:check
>>> :geode-wan:build
>>> :geode-wan:distributedTest
>>> :geode-wan:flakyTest
>>> :geode-wan:integrationTest
>>> :geode-web:assemble
>>> :geode-web:compileTestJavaNote: <
>>>
>>> https://builds.apache.org/job/Geode-release/ws/geode-web/src/test/java/com/gemstone/gemfire/management/internal/cli/commands/DataCommandsOverHttpDistributedTest.java
>>> >
>>> uses or overrides a deprecated API.
>>> Note: Recompile with -Xlint:deprecation for details.
>>> Note: Some input files use unchecked or unsafe operations.
>>> Note: Recompile with -Xlint:unchecked for details.
>>>
>>> :geode-web:processTestResources UP-TO-DATE
>>> :geode-web:testClasses
>>> :geode-web:checkMissedTests
>>> :geode-web:test
>>> :geode-web:check
>>> :geode-web:build
>>> :geode-web:distributedTest
>>> :geode-web:flakyTest
>>> :geode-web:integrationTest
>>> :geode-web-api:assemble
>>> :geode-web-api:compileTestJava UP-TO-DATE
>>> :geode-web-api:processTestResources UP-TO-DATE
>>> :geode-web-api:testClasses UP-TO-DATE
>>> :geode-web-api:checkMissedTests UP-TO-DATE
>>> :geode-web-api:test UP-TO-DATE
>>> :geode-web-api:check
>>> :geode-web-api:build
>>> :geode-web-api:distributedTest UP-TO-DATE
>>> :geode-web-api:flakyTest UP-TO-DATE
>>> :geode-web-api:integrationTest UP-TO-DATE
>>> :combineReports
>>> All test reports at <
>>> https://builds.apache.org/job/Geode-release/ws/build/reports/combined>
>>> :extensions/geode-modules:precheckin
>>> :extensions/geode-modules-assembly:precheckin
>>> :extensions/geode-modules-hibernate:precheckin
>>> :extensions/geode-modules-session:precheckin
>>> :extensions/geode-modules-session-internal:precheckin
>>> :extensions/geode-modules-tomcat7:precheckin
>>> :geode-common:precheckin
>>> :geode-cq:precheckin
>>> :geode-json:precheckin
>>> :geode-junit:precheckin
>>> :geode-lucene:precheckin
>>> :geode-pulse:precheckin
>>> :geode-rebalancer:precheckin
>>> :geode-wan:precheckin
>>> :geode-web:precheckin
>>> :geode-web-api:precheckin
>>>
>>> FAILURE: Build completed with 3 failures.
>>>
>>> 1: Task failed with an exception.
>>> -----------
>>> * What went wrong:
>>> Execution failed for task ':geode-assembly:flakyTest'.
>>>
>>>> There were failing tests. See the report at: file://<
>>>>
>>>
>>> https://builds.apache.org/job/Geode-release/ws/geode-assembly/build/reports/flakyTest/index.html
>>> * Try:
>>> Run with --stacktrace option to get the stack trace. Run with --info or
>>> --debug option to get more log output.
>>>
>>>
>>> ==============================================================================
>>>
>>> 2: Task failed with an exception.
>>> -----------
>>> * What went wrong:
>>> Execution failed for task ':geode-core:distributedTest'.
>>>
>>>> There were failing tests. See the report at: file://<
>>>>
>>>
>>> https://builds.apache.org/job/Geode-release/ws/geode-core/build/reports/distributedTest/index.html
>>> * Try:
>>> Run with --stacktrace option to get the stack trace. Run with --info or
>>> --debug option to get more log output.
>>>
>>>
>>> ==============================================================================
>>>
>>> 3: Task failed with an exception.
>>> -----------
>>> * What went wrong:
>>> Execution failed for task ':geode-core:flakyTest'.
>>>
>>>> There were failing tests. See the report at: file://<
>>>>
>>>
>>> https://builds.apache.org/job/Geode-release/ws/geode-core/build/reports/flakyTest/index.html
>>> * Try:
>>> Run with --stacktrace option to get the stack trace. Run with --info or
>>> --debug option to get more log output.
>>>
>>>
>>> ==============================================================================
>>>
>>> BUILD FAILED
>>>
>>> Total time: 11 hrs 26 mins 30.535 secs
>>> Build step 'Invoke Gradle script' changed build result to FAILURE
>>> Build step 'Invoke Gradle script' marked build as failure
>>> Archiving artifacts
>>> Compressed 250.79 MB of artifacts by 12.1% relative to #7
>>> Recording test results
>>>
>>>
>
Re: Build failed in Jenkins: Geode-release #17
Posted by Bruce Schuchardt <bs...@pivotal.io>.
Do we have any information on the ulimit settings in the account running
the tests? This may just be an issue with how the account is configured.
Le 7/27/2016 � 9:21 AM, Kirk Lund a �crit :
> Looks like OutOfMemory is the cause of this failure. Do we need to increase
> heap size for Jenkins or is there a way to get debug info?
>
> -Kirk
>
>
> On Wed, Jul 27, 2016 at 12:37 AM, Apache Jenkins Server <
> jenkins@builds.apache.org> wrote:
>
>> See <https://builds.apache.org/job/Geode-release/17/changes>
>>
>> Changes:
>>
>> [wmarkito] GEODE-1696 - Updating release version
>>
>> ------------------------------------------
>> [...truncated 1019 lines...]
>> at
>> com.gemstone.gemfire.internal.admin.remote.AdminRegion.destroyRegion(AdminRegion.java:128)
>> at
>> com.gemstone.gemfire.distributed.internal.ConsoleDistributionManagerDUnitTest.testApplications(ConsoleDistributionManagerDUnitTest.java:308)
>>
>> 7433 tests completed, 1 failed, 587 skipped
>> :geode-core:distributedTest FAILED
>> :geode-core:flakyTest
>>
>> com.gemstone.gemfire.security.ClientAuthenticationDUnitTest >
>> testCredentialsForNotifications FAILED
>> com.gemstone.gemfire.test.dunit.RMIException: While invoking
>> com.gemstone.gemfire.security.ClientAuthenticationTestCase$$Lambda$16/180944566.run
>> in VM 2 running on Host asf900.gq1.ygridcore.net with 4 VMs
>> at com.gemstone.gemfire.test.dunit.VM.invoke(VM.java:389)
>> at com.gemstone.gemfire.test.dunit.VM.invoke(VM.java:355)
>> at com.gemstone.gemfire.test.dunit.VM.invoke(VM.java:293)
>> at
>> com.gemstone.gemfire.security.ClientAuthenticationTestCase.createClient1NoException(ClientAuthenticationTestCase.java:540)
>> at
>> com.gemstone.gemfire.security.ClientAuthenticationTestCase.doTestCredentialsForNotifications(ClientAuthenticationTestCase.java:427)
>> at
>> com.gemstone.gemfire.security.ClientAuthenticationDUnitTest.testCredentialsForNotifications(ClientAuthenticationDUnitTest.java:82)
>>
>> Caused by:
>> java.lang.OutOfMemoryError: unable to create new native thread
>>
>> java.lang.AssertionError: Suspicious strings were written to the log
>> during this run.
>> Fix the strings or use IgnoredException.addIgnoredException to ignore.
>> -----------------------------------------------------------------------
>> Found suspect string in log4j at line 1157
>>
>> [error 2016/07/27 02:00:23.987 UTC <RMI TCP
>> Connection(1)-67.195.81.144> tid=0x1b] java.lang.OutOfMemoryError: unable
>> to create new native thread
>>
>> com.gemstone.gemfire.distributed.internal.deadlock.GemFireDeadlockDetectorDUnitTest
>>> classMethod FAILED
>> java.lang.RuntimeException: Unable to launch dunit VMS
>>
>> Caused by:
>> java.lang.RuntimeException: VMs did not start up with 30 seconds
>>
>> 189 tests completed, 2 failed, 6 skipped
>> :geode-core:flakyTest FAILED
>> :geode-core:integrationTest
>> :geode-cq:assemble
>> :geode-cq:compileTestJavaNote: Some input files use or override a
>> deprecated API.
>> Note: Recompile with -Xlint:deprecation for details.
>> Note: Some input files use unchecked or unsafe operations.
>> Note: Recompile with -Xlint:unchecked for details.
>>
>> :geode-cq:processTestResources
>> :geode-cq:testClasses
>> :geode-cq:checkMissedTests
>> :geode-cq:test
>> :geode-cq:check
>> :geode-cq:build
>> :geode-cq:distributedTest
>> :geode-cq:flakyTest
>> :geode-cq:integrationTest
>> :geode-json:assemble
>> :geode-json:compileTestJava UP-TO-DATE
>> :geode-json:processTestResources UP-TO-DATE
>> :geode-json:testClasses UP-TO-DATE
>> :geode-json:checkMissedTests UP-TO-DATE
>> :geode-json:test UP-TO-DATE
>> :geode-json:check
>> :geode-json:build
>> :geode-json:distributedTest UP-TO-DATE
>> :geode-json:flakyTest UP-TO-DATE
>> :geode-json:integrationTest UP-TO-DATE
>> :geode-junit:javadoc
>> :geode-junit:javadocJar
>> :geode-junit:sourcesJar
>> :geode-junit:signArchives SKIPPED
>> :geode-junit:assemble
>> :geode-junit:compileTestJava
>> :geode-junit:processTestResources UP-TO-DATE
>> :geode-junit:testClasses
>> :geode-junit:checkMissedTests
>> :geode-junit:test
>> :geode-junit:check
>> :geode-junit:build
>> :geode-junit:distributedTest
>> :geode-junit:flakyTest
>> :geode-junit:integrationTest
>> :geode-lucene:assemble
>> :geode-lucene:compileTestJava
>> Download
>> https://repo1.maven.org/maven2/org/apache/lucene/lucene-test-framework/6.0.0/lucene-test-framework-6.0.0.pom
>> Download
>> https://repo1.maven.org/maven2/org/apache/lucene/lucene-codecs/6.0.0/lucene-codecs-6.0.0.pom
>> Download
>> https://repo1.maven.org/maven2/com/carrotsearch/randomizedtesting/randomizedtesting-runner/2.3.2/randomizedtesting-runner-2.3.2.pom
>> Download
>> https://repo1.maven.org/maven2/com/carrotsearch/randomizedtesting/randomizedtesting-parent/2.3.2/randomizedtesting-parent-2.3.2.pom
>> Download
>> https://repo1.maven.org/maven2/org/apache/lucene/lucene-test-framework/6.0.0/lucene-test-framework-6.0.0.jar
>> Download
>> https://repo1.maven.org/maven2/org/apache/lucene/lucene-codecs/6.0.0/lucene-codecs-6.0.0.jar
>> Download
>> https://repo1.maven.org/maven2/com/carrotsearch/randomizedtesting/randomizedtesting-runner/2.3.2/randomizedtesting-runner-2.3.2.jar
>> Note: Some input files use or override a deprecated API.
>> Note: Recompile with -Xlint:deprecation for details.
>> Note: Some input files use unchecked or unsafe operations.
>> Note: Recompile with -Xlint:unchecked for details.
>> :geode-lucene:processTestResources
>> :geode-lucene:testClasses
>> :geode-lucene:checkMissedTests
>> :geode-lucene:test
>> :geode-lucene:check
>> :geode-lucene:build
>> :geode-lucene:distributedTest
>> :geode-lucene:flakyTest
>> :geode-lucene:integrationTest
>> :geode-pulse:assemble
>> :geode-pulse:compileTestJava
>> Download
>> https://repo1.maven.org/maven2/org/seleniumhq/selenium/selenium-firefox-driver/2.53.1/selenium-firefox-driver-2.53.1.pom
>> Download
>> https://repo1.maven.org/maven2/org/seleniumhq/selenium/selenium-parent/2.53.1/selenium-parent-2.53.1.pom
>> Download
>> https://repo1.maven.org/maven2/org/seleniumhq/selenium/selenium-api/2.53.1/selenium-api-2.53.1.pom
>> Download
>> https://repo1.maven.org/maven2/org/seleniumhq/selenium/selenium-remote-driver/2.53.1/selenium-remote-driver-2.53.1.pom
>> Download
>> https://repo1.maven.org/maven2/org/seleniumhq/selenium/selenium-support/2.53.1/selenium-support-2.53.1.pom
>> Download
>> https://repo1.maven.org/maven2/org/springframework/spring-test/4.2.4.RELEASE/spring-test-4.2.4.RELEASE.pom
>> Download
>> https://repo1.maven.org/maven2/com/google/code/gson/gson/2.3.1/gson-2.3.1.pom
>> Download
>> https://repo1.maven.org/maven2/org/seleniumhq/selenium/selenium-firefox-driver/2.53.1/selenium-firefox-driver-2.53.1.jar
>> Download
>> https://repo1.maven.org/maven2/org/seleniumhq/selenium/selenium-api/2.53.1/selenium-api-2.53.1.jar
>> Download
>> https://repo1.maven.org/maven2/org/seleniumhq/selenium/selenium-remote-driver/2.53.1/selenium-remote-driver-2.53.1.jar
>> Download
>> https://repo1.maven.org/maven2/org/seleniumhq/selenium/selenium-support/2.53.1/selenium-support-2.53.1.jar
>> Download
>> https://repo1.maven.org/maven2/org/springframework/spring-test/4.2.4.RELEASE/spring-test-4.2.4.RELEASE.jar
>> Download
>> https://repo1.maven.org/maven2/com/google/code/gson/gson/2.3.1/gson-2.3.1.jar
>> Note: <
>> https://builds.apache.org/job/Geode-release/ws/geode-pulse/src/test/java/com/vmware/gemfire/tools/pulse/tests/PulseAbstractTest.java>
>> uses or overrides a deprecated API.
>> Note: Recompile with -Xlint:deprecation for details.
>> Note: Some input files use unchecked or unsafe operations.
>> Note: Recompile with -Xlint:unchecked for details.
>> :geode-pulse:processTestResources
>> :geode-pulse:testClasses
>> :geode-pulse:checkMissedTests
>> Download
>> https://repo1.maven.org/maven2/com/jayway/jsonpath/json-path/1.2.0/json-path-1.2.0.pom
>> Download
>> https://repo1.maven.org/maven2/net/minidev/json-smart/2.1.0/json-smart-2.1.0.pom
>> Download
>> https://repo1.maven.org/maven2/net/minidev/parent/2.1.0/parent-2.1.0.pom
>> Download
>> https://repo1.maven.org/maven2/net/minidev/asm/1.0.2/asm-1.0.2.pom
>> Download
>> https://repo1.maven.org/maven2/com/jayway/jsonpath/json-path/1.2.0/json-path-1.2.0.jar
>> Download
>> https://repo1.maven.org/maven2/net/minidev/json-smart/2.1.0/json-smart-2.1.0.jar
>> Download
>> https://repo1.maven.org/maven2/net/minidev/asm/1.0.2/asm-1.0.2.jar
>> :geode-pulse:test
>> :geode-pulse:check
>> :geode-pulse:build
>> :geode-pulse:distributedTest
>> :geode-pulse:flakyTest
>> :geode-pulse:integrationTest
>> :geode-rebalancer:jar
>> :geode-rebalancer:javadoc
>> :geode-rebalancer:javadocJar
>> :geode-rebalancer:sourcesJar
>> :geode-rebalancer:signArchives SKIPPED
>> :geode-rebalancer:assemble
>> :geode-rebalancer:compileTestJava
>> :geode-rebalancer:processTestResources UP-TO-DATE
>> :geode-rebalancer:testClasses
>> :geode-rebalancer:checkMissedTests
>> :geode-rebalancer:test
>> :geode-rebalancer:check
>> :geode-rebalancer:build
>> :geode-rebalancer:distributedTest
>> :geode-rebalancer:flakyTest
>> :geode-rebalancer:integrationTest
>> :geode-wan:assemble
>> :geode-wan:compileTestJavaNote: Some input files use or override a
>> deprecated API.
>> Note: Recompile with -Xlint:deprecation for details.
>> Note: Some input files use unchecked or unsafe operations.
>> Note: Recompile with -Xlint:unchecked for details.
>>
>> :geode-wan:processTestResources
>> :geode-wan:testClasses
>> :geode-wan:checkMissedTests
>> :geode-wan:test
>> :geode-wan:check
>> :geode-wan:build
>> :geode-wan:distributedTest
>> :geode-wan:flakyTest
>> :geode-wan:integrationTest
>> :geode-web:assemble
>> :geode-web:compileTestJavaNote: <
>> https://builds.apache.org/job/Geode-release/ws/geode-web/src/test/java/com/gemstone/gemfire/management/internal/cli/commands/DataCommandsOverHttpDistributedTest.java>
>> uses or overrides a deprecated API.
>> Note: Recompile with -Xlint:deprecation for details.
>> Note: Some input files use unchecked or unsafe operations.
>> Note: Recompile with -Xlint:unchecked for details.
>>
>> :geode-web:processTestResources UP-TO-DATE
>> :geode-web:testClasses
>> :geode-web:checkMissedTests
>> :geode-web:test
>> :geode-web:check
>> :geode-web:build
>> :geode-web:distributedTest
>> :geode-web:flakyTest
>> :geode-web:integrationTest
>> :geode-web-api:assemble
>> :geode-web-api:compileTestJava UP-TO-DATE
>> :geode-web-api:processTestResources UP-TO-DATE
>> :geode-web-api:testClasses UP-TO-DATE
>> :geode-web-api:checkMissedTests UP-TO-DATE
>> :geode-web-api:test UP-TO-DATE
>> :geode-web-api:check
>> :geode-web-api:build
>> :geode-web-api:distributedTest UP-TO-DATE
>> :geode-web-api:flakyTest UP-TO-DATE
>> :geode-web-api:integrationTest UP-TO-DATE
>> :combineReports
>> All test reports at <
>> https://builds.apache.org/job/Geode-release/ws/build/reports/combined>
>> :extensions/geode-modules:precheckin
>> :extensions/geode-modules-assembly:precheckin
>> :extensions/geode-modules-hibernate:precheckin
>> :extensions/geode-modules-session:precheckin
>> :extensions/geode-modules-session-internal:precheckin
>> :extensions/geode-modules-tomcat7:precheckin
>> :geode-common:precheckin
>> :geode-cq:precheckin
>> :geode-json:precheckin
>> :geode-junit:precheckin
>> :geode-lucene:precheckin
>> :geode-pulse:precheckin
>> :geode-rebalancer:precheckin
>> :geode-wan:precheckin
>> :geode-web:precheckin
>> :geode-web-api:precheckin
>>
>> FAILURE: Build completed with 3 failures.
>>
>> 1: Task failed with an exception.
>> -----------
>> * What went wrong:
>> Execution failed for task ':geode-assembly:flakyTest'.
>>> There were failing tests. See the report at: file://<
>> https://builds.apache.org/job/Geode-release/ws/geode-assembly/build/reports/flakyTest/index.html
>> * Try:
>> Run with --stacktrace option to get the stack trace. Run with --info or
>> --debug option to get more log output.
>>
>> ==============================================================================
>>
>> 2: Task failed with an exception.
>> -----------
>> * What went wrong:
>> Execution failed for task ':geode-core:distributedTest'.
>>> There were failing tests. See the report at: file://<
>> https://builds.apache.org/job/Geode-release/ws/geode-core/build/reports/distributedTest/index.html
>> * Try:
>> Run with --stacktrace option to get the stack trace. Run with --info or
>> --debug option to get more log output.
>>
>> ==============================================================================
>>
>> 3: Task failed with an exception.
>> -----------
>> * What went wrong:
>> Execution failed for task ':geode-core:flakyTest'.
>>> There were failing tests. See the report at: file://<
>> https://builds.apache.org/job/Geode-release/ws/geode-core/build/reports/flakyTest/index.html
>> * Try:
>> Run with --stacktrace option to get the stack trace. Run with --info or
>> --debug option to get more log output.
>>
>> ==============================================================================
>>
>> BUILD FAILED
>>
>> Total time: 11 hrs 26 mins 30.535 secs
>> Build step 'Invoke Gradle script' changed build result to FAILURE
>> Build step 'Invoke Gradle script' marked build as failure
>> Archiving artifacts
>> Compressed 250.79 MB of artifacts by 12.1% relative to #7
>> Recording test results
>>
Re: Build failed in Jenkins: Geode-release #17
Posted by Kirk Lund <kl...@pivotal.io>.
Looks like OutOfMemory is the cause of this failure. Do we need to increase
heap size for Jenkins or is there a way to get debug info?
-Kirk
On Wed, Jul 27, 2016 at 12:37 AM, Apache Jenkins Server <
jenkins@builds.apache.org> wrote:
> See <https://builds.apache.org/job/Geode-release/17/changes>
>
> Changes:
>
> [wmarkito] GEODE-1696 - Updating release version
>
> ------------------------------------------
> [...truncated 1019 lines...]
> at
> com.gemstone.gemfire.internal.admin.remote.AdminRegion.destroyRegion(AdminRegion.java:128)
> at
> com.gemstone.gemfire.distributed.internal.ConsoleDistributionManagerDUnitTest.testApplications(ConsoleDistributionManagerDUnitTest.java:308)
>
> 7433 tests completed, 1 failed, 587 skipped
> :geode-core:distributedTest FAILED
> :geode-core:flakyTest
>
> com.gemstone.gemfire.security.ClientAuthenticationDUnitTest >
> testCredentialsForNotifications FAILED
> com.gemstone.gemfire.test.dunit.RMIException: While invoking
> com.gemstone.gemfire.security.ClientAuthenticationTestCase$$Lambda$16/180944566.run
> in VM 2 running on Host asf900.gq1.ygridcore.net with 4 VMs
> at com.gemstone.gemfire.test.dunit.VM.invoke(VM.java:389)
> at com.gemstone.gemfire.test.dunit.VM.invoke(VM.java:355)
> at com.gemstone.gemfire.test.dunit.VM.invoke(VM.java:293)
> at
> com.gemstone.gemfire.security.ClientAuthenticationTestCase.createClient1NoException(ClientAuthenticationTestCase.java:540)
> at
> com.gemstone.gemfire.security.ClientAuthenticationTestCase.doTestCredentialsForNotifications(ClientAuthenticationTestCase.java:427)
> at
> com.gemstone.gemfire.security.ClientAuthenticationDUnitTest.testCredentialsForNotifications(ClientAuthenticationDUnitTest.java:82)
>
> Caused by:
> java.lang.OutOfMemoryError: unable to create new native thread
>
> java.lang.AssertionError: Suspicious strings were written to the log
> during this run.
> Fix the strings or use IgnoredException.addIgnoredException to ignore.
> -----------------------------------------------------------------------
> Found suspect string in log4j at line 1157
>
> [error 2016/07/27 02:00:23.987 UTC <RMI TCP
> Connection(1)-67.195.81.144> tid=0x1b] java.lang.OutOfMemoryError: unable
> to create new native thread
>
> com.gemstone.gemfire.distributed.internal.deadlock.GemFireDeadlockDetectorDUnitTest
> > classMethod FAILED
> java.lang.RuntimeException: Unable to launch dunit VMS
>
> Caused by:
> java.lang.RuntimeException: VMs did not start up with 30 seconds
>
> 189 tests completed, 2 failed, 6 skipped
> :geode-core:flakyTest FAILED
> :geode-core:integrationTest
> :geode-cq:assemble
> :geode-cq:compileTestJavaNote: Some input files use or override a
> deprecated API.
> Note: Recompile with -Xlint:deprecation for details.
> Note: Some input files use unchecked or unsafe operations.
> Note: Recompile with -Xlint:unchecked for details.
>
> :geode-cq:processTestResources
> :geode-cq:testClasses
> :geode-cq:checkMissedTests
> :geode-cq:test
> :geode-cq:check
> :geode-cq:build
> :geode-cq:distributedTest
> :geode-cq:flakyTest
> :geode-cq:integrationTest
> :geode-json:assemble
> :geode-json:compileTestJava UP-TO-DATE
> :geode-json:processTestResources UP-TO-DATE
> :geode-json:testClasses UP-TO-DATE
> :geode-json:checkMissedTests UP-TO-DATE
> :geode-json:test UP-TO-DATE
> :geode-json:check
> :geode-json:build
> :geode-json:distributedTest UP-TO-DATE
> :geode-json:flakyTest UP-TO-DATE
> :geode-json:integrationTest UP-TO-DATE
> :geode-junit:javadoc
> :geode-junit:javadocJar
> :geode-junit:sourcesJar
> :geode-junit:signArchives SKIPPED
> :geode-junit:assemble
> :geode-junit:compileTestJava
> :geode-junit:processTestResources UP-TO-DATE
> :geode-junit:testClasses
> :geode-junit:checkMissedTests
> :geode-junit:test
> :geode-junit:check
> :geode-junit:build
> :geode-junit:distributedTest
> :geode-junit:flakyTest
> :geode-junit:integrationTest
> :geode-lucene:assemble
> :geode-lucene:compileTestJava
> Download
> https://repo1.maven.org/maven2/org/apache/lucene/lucene-test-framework/6.0.0/lucene-test-framework-6.0.0.pom
> Download
> https://repo1.maven.org/maven2/org/apache/lucene/lucene-codecs/6.0.0/lucene-codecs-6.0.0.pom
> Download
> https://repo1.maven.org/maven2/com/carrotsearch/randomizedtesting/randomizedtesting-runner/2.3.2/randomizedtesting-runner-2.3.2.pom
> Download
> https://repo1.maven.org/maven2/com/carrotsearch/randomizedtesting/randomizedtesting-parent/2.3.2/randomizedtesting-parent-2.3.2.pom
> Download
> https://repo1.maven.org/maven2/org/apache/lucene/lucene-test-framework/6.0.0/lucene-test-framework-6.0.0.jar
> Download
> https://repo1.maven.org/maven2/org/apache/lucene/lucene-codecs/6.0.0/lucene-codecs-6.0.0.jar
> Download
> https://repo1.maven.org/maven2/com/carrotsearch/randomizedtesting/randomizedtesting-runner/2.3.2/randomizedtesting-runner-2.3.2.jar
> Note: Some input files use or override a deprecated API.
> Note: Recompile with -Xlint:deprecation for details.
> Note: Some input files use unchecked or unsafe operations.
> Note: Recompile with -Xlint:unchecked for details.
> :geode-lucene:processTestResources
> :geode-lucene:testClasses
> :geode-lucene:checkMissedTests
> :geode-lucene:test
> :geode-lucene:check
> :geode-lucene:build
> :geode-lucene:distributedTest
> :geode-lucene:flakyTest
> :geode-lucene:integrationTest
> :geode-pulse:assemble
> :geode-pulse:compileTestJava
> Download
> https://repo1.maven.org/maven2/org/seleniumhq/selenium/selenium-firefox-driver/2.53.1/selenium-firefox-driver-2.53.1.pom
> Download
> https://repo1.maven.org/maven2/org/seleniumhq/selenium/selenium-parent/2.53.1/selenium-parent-2.53.1.pom
> Download
> https://repo1.maven.org/maven2/org/seleniumhq/selenium/selenium-api/2.53.1/selenium-api-2.53.1.pom
> Download
> https://repo1.maven.org/maven2/org/seleniumhq/selenium/selenium-remote-driver/2.53.1/selenium-remote-driver-2.53.1.pom
> Download
> https://repo1.maven.org/maven2/org/seleniumhq/selenium/selenium-support/2.53.1/selenium-support-2.53.1.pom
> Download
> https://repo1.maven.org/maven2/org/springframework/spring-test/4.2.4.RELEASE/spring-test-4.2.4.RELEASE.pom
> Download
> https://repo1.maven.org/maven2/com/google/code/gson/gson/2.3.1/gson-2.3.1.pom
> Download
> https://repo1.maven.org/maven2/org/seleniumhq/selenium/selenium-firefox-driver/2.53.1/selenium-firefox-driver-2.53.1.jar
> Download
> https://repo1.maven.org/maven2/org/seleniumhq/selenium/selenium-api/2.53.1/selenium-api-2.53.1.jar
> Download
> https://repo1.maven.org/maven2/org/seleniumhq/selenium/selenium-remote-driver/2.53.1/selenium-remote-driver-2.53.1.jar
> Download
> https://repo1.maven.org/maven2/org/seleniumhq/selenium/selenium-support/2.53.1/selenium-support-2.53.1.jar
> Download
> https://repo1.maven.org/maven2/org/springframework/spring-test/4.2.4.RELEASE/spring-test-4.2.4.RELEASE.jar
> Download
> https://repo1.maven.org/maven2/com/google/code/gson/gson/2.3.1/gson-2.3.1.jar
> Note: <
> https://builds.apache.org/job/Geode-release/ws/geode-pulse/src/test/java/com/vmware/gemfire/tools/pulse/tests/PulseAbstractTest.java>
> uses or overrides a deprecated API.
> Note: Recompile with -Xlint:deprecation for details.
> Note: Some input files use unchecked or unsafe operations.
> Note: Recompile with -Xlint:unchecked for details.
> :geode-pulse:processTestResources
> :geode-pulse:testClasses
> :geode-pulse:checkMissedTests
> Download
> https://repo1.maven.org/maven2/com/jayway/jsonpath/json-path/1.2.0/json-path-1.2.0.pom
> Download
> https://repo1.maven.org/maven2/net/minidev/json-smart/2.1.0/json-smart-2.1.0.pom
> Download
> https://repo1.maven.org/maven2/net/minidev/parent/2.1.0/parent-2.1.0.pom
> Download
> https://repo1.maven.org/maven2/net/minidev/asm/1.0.2/asm-1.0.2.pom
> Download
> https://repo1.maven.org/maven2/com/jayway/jsonpath/json-path/1.2.0/json-path-1.2.0.jar
> Download
> https://repo1.maven.org/maven2/net/minidev/json-smart/2.1.0/json-smart-2.1.0.jar
> Download
> https://repo1.maven.org/maven2/net/minidev/asm/1.0.2/asm-1.0.2.jar
> :geode-pulse:test
> :geode-pulse:check
> :geode-pulse:build
> :geode-pulse:distributedTest
> :geode-pulse:flakyTest
> :geode-pulse:integrationTest
> :geode-rebalancer:jar
> :geode-rebalancer:javadoc
> :geode-rebalancer:javadocJar
> :geode-rebalancer:sourcesJar
> :geode-rebalancer:signArchives SKIPPED
> :geode-rebalancer:assemble
> :geode-rebalancer:compileTestJava
> :geode-rebalancer:processTestResources UP-TO-DATE
> :geode-rebalancer:testClasses
> :geode-rebalancer:checkMissedTests
> :geode-rebalancer:test
> :geode-rebalancer:check
> :geode-rebalancer:build
> :geode-rebalancer:distributedTest
> :geode-rebalancer:flakyTest
> :geode-rebalancer:integrationTest
> :geode-wan:assemble
> :geode-wan:compileTestJavaNote: Some input files use or override a
> deprecated API.
> Note: Recompile with -Xlint:deprecation for details.
> Note: Some input files use unchecked or unsafe operations.
> Note: Recompile with -Xlint:unchecked for details.
>
> :geode-wan:processTestResources
> :geode-wan:testClasses
> :geode-wan:checkMissedTests
> :geode-wan:test
> :geode-wan:check
> :geode-wan:build
> :geode-wan:distributedTest
> :geode-wan:flakyTest
> :geode-wan:integrationTest
> :geode-web:assemble
> :geode-web:compileTestJavaNote: <
> https://builds.apache.org/job/Geode-release/ws/geode-web/src/test/java/com/gemstone/gemfire/management/internal/cli/commands/DataCommandsOverHttpDistributedTest.java>
> uses or overrides a deprecated API.
> Note: Recompile with -Xlint:deprecation for details.
> Note: Some input files use unchecked or unsafe operations.
> Note: Recompile with -Xlint:unchecked for details.
>
> :geode-web:processTestResources UP-TO-DATE
> :geode-web:testClasses
> :geode-web:checkMissedTests
> :geode-web:test
> :geode-web:check
> :geode-web:build
> :geode-web:distributedTest
> :geode-web:flakyTest
> :geode-web:integrationTest
> :geode-web-api:assemble
> :geode-web-api:compileTestJava UP-TO-DATE
> :geode-web-api:processTestResources UP-TO-DATE
> :geode-web-api:testClasses UP-TO-DATE
> :geode-web-api:checkMissedTests UP-TO-DATE
> :geode-web-api:test UP-TO-DATE
> :geode-web-api:check
> :geode-web-api:build
> :geode-web-api:distributedTest UP-TO-DATE
> :geode-web-api:flakyTest UP-TO-DATE
> :geode-web-api:integrationTest UP-TO-DATE
> :combineReports
> All test reports at <
> https://builds.apache.org/job/Geode-release/ws/build/reports/combined>
> :extensions/geode-modules:precheckin
> :extensions/geode-modules-assembly:precheckin
> :extensions/geode-modules-hibernate:precheckin
> :extensions/geode-modules-session:precheckin
> :extensions/geode-modules-session-internal:precheckin
> :extensions/geode-modules-tomcat7:precheckin
> :geode-common:precheckin
> :geode-cq:precheckin
> :geode-json:precheckin
> :geode-junit:precheckin
> :geode-lucene:precheckin
> :geode-pulse:precheckin
> :geode-rebalancer:precheckin
> :geode-wan:precheckin
> :geode-web:precheckin
> :geode-web-api:precheckin
>
> FAILURE: Build completed with 3 failures.
>
> 1: Task failed with an exception.
> -----------
> * What went wrong:
> Execution failed for task ':geode-assembly:flakyTest'.
> > There were failing tests. See the report at: file://<
> https://builds.apache.org/job/Geode-release/ws/geode-assembly/build/reports/flakyTest/index.html
> >
>
> * Try:
> Run with --stacktrace option to get the stack trace. Run with --info or
> --debug option to get more log output.
>
> ==============================================================================
>
> 2: Task failed with an exception.
> -----------
> * What went wrong:
> Execution failed for task ':geode-core:distributedTest'.
> > There were failing tests. See the report at: file://<
> https://builds.apache.org/job/Geode-release/ws/geode-core/build/reports/distributedTest/index.html
> >
>
> * Try:
> Run with --stacktrace option to get the stack trace. Run with --info or
> --debug option to get more log output.
>
> ==============================================================================
>
> 3: Task failed with an exception.
> -----------
> * What went wrong:
> Execution failed for task ':geode-core:flakyTest'.
> > There were failing tests. See the report at: file://<
> https://builds.apache.org/job/Geode-release/ws/geode-core/build/reports/flakyTest/index.html
> >
>
> * Try:
> Run with --stacktrace option to get the stack trace. Run with --info or
> --debug option to get more log output.
>
> ==============================================================================
>
> BUILD FAILED
>
> Total time: 11 hrs 26 mins 30.535 secs
> Build step 'Invoke Gradle script' changed build result to FAILURE
> Build step 'Invoke Gradle script' marked build as failure
> Archiving artifacts
> Compressed 250.79 MB of artifacts by 12.1% relative to #7
> Recording test results
>
Build failed in Jenkins: Geode-release #17
Posted by Apache Jenkins Server <je...@builds.apache.org>.
See <https://builds.apache.org/job/Geode-release/17/changes>
Changes:
[wmarkito] GEODE-1696 - Updating release version
------------------------------------------
[...truncated 1019 lines...]
at com.gemstone.gemfire.internal.admin.remote.AdminRegion.destroyRegion(AdminRegion.java:128)
at com.gemstone.gemfire.distributed.internal.ConsoleDistributionManagerDUnitTest.testApplications(ConsoleDistributionManagerDUnitTest.java:308)
7433 tests completed, 1 failed, 587 skipped
:geode-core:distributedTest FAILED
:geode-core:flakyTest
com.gemstone.gemfire.security.ClientAuthenticationDUnitTest > testCredentialsForNotifications FAILED
com.gemstone.gemfire.test.dunit.RMIException: While invoking com.gemstone.gemfire.security.ClientAuthenticationTestCase$$Lambda$16/180944566.run in VM 2 running on Host asf900.gq1.ygridcore.net with 4 VMs
at com.gemstone.gemfire.test.dunit.VM.invoke(VM.java:389)
at com.gemstone.gemfire.test.dunit.VM.invoke(VM.java:355)
at com.gemstone.gemfire.test.dunit.VM.invoke(VM.java:293)
at com.gemstone.gemfire.security.ClientAuthenticationTestCase.createClient1NoException(ClientAuthenticationTestCase.java:540)
at com.gemstone.gemfire.security.ClientAuthenticationTestCase.doTestCredentialsForNotifications(ClientAuthenticationTestCase.java:427)
at com.gemstone.gemfire.security.ClientAuthenticationDUnitTest.testCredentialsForNotifications(ClientAuthenticationDUnitTest.java:82)
Caused by:
java.lang.OutOfMemoryError: unable to create new native thread
java.lang.AssertionError: Suspicious strings were written to the log during this run.
Fix the strings or use IgnoredException.addIgnoredException to ignore.
-----------------------------------------------------------------------
Found suspect string in log4j at line 1157
[error 2016/07/27 02:00:23.987 UTC <RMI TCP Connection(1)-67.195.81.144> tid=0x1b] java.lang.OutOfMemoryError: unable to create new native thread
com.gemstone.gemfire.distributed.internal.deadlock.GemFireDeadlockDetectorDUnitTest > classMethod FAILED
java.lang.RuntimeException: Unable to launch dunit VMS
Caused by:
java.lang.RuntimeException: VMs did not start up with 30 seconds
189 tests completed, 2 failed, 6 skipped
:geode-core:flakyTest FAILED
:geode-core:integrationTest
:geode-cq:assemble
:geode-cq:compileTestJavaNote: Some input files use or override a deprecated API.
Note: Recompile with -Xlint:deprecation for details.
Note: Some input files use unchecked or unsafe operations.
Note: Recompile with -Xlint:unchecked for details.
:geode-cq:processTestResources
:geode-cq:testClasses
:geode-cq:checkMissedTests
:geode-cq:test
:geode-cq:check
:geode-cq:build
:geode-cq:distributedTest
:geode-cq:flakyTest
:geode-cq:integrationTest
:geode-json:assemble
:geode-json:compileTestJava UP-TO-DATE
:geode-json:processTestResources UP-TO-DATE
:geode-json:testClasses UP-TO-DATE
:geode-json:checkMissedTests UP-TO-DATE
:geode-json:test UP-TO-DATE
:geode-json:check
:geode-json:build
:geode-json:distributedTest UP-TO-DATE
:geode-json:flakyTest UP-TO-DATE
:geode-json:integrationTest UP-TO-DATE
:geode-junit:javadoc
:geode-junit:javadocJar
:geode-junit:sourcesJar
:geode-junit:signArchives SKIPPED
:geode-junit:assemble
:geode-junit:compileTestJava
:geode-junit:processTestResources UP-TO-DATE
:geode-junit:testClasses
:geode-junit:checkMissedTests
:geode-junit:test
:geode-junit:check
:geode-junit:build
:geode-junit:distributedTest
:geode-junit:flakyTest
:geode-junit:integrationTest
:geode-lucene:assemble
:geode-lucene:compileTestJava
Download https://repo1.maven.org/maven2/org/apache/lucene/lucene-test-framework/6.0.0/lucene-test-framework-6.0.0.pom
Download https://repo1.maven.org/maven2/org/apache/lucene/lucene-codecs/6.0.0/lucene-codecs-6.0.0.pom
Download https://repo1.maven.org/maven2/com/carrotsearch/randomizedtesting/randomizedtesting-runner/2.3.2/randomizedtesting-runner-2.3.2.pom
Download https://repo1.maven.org/maven2/com/carrotsearch/randomizedtesting/randomizedtesting-parent/2.3.2/randomizedtesting-parent-2.3.2.pom
Download https://repo1.maven.org/maven2/org/apache/lucene/lucene-test-framework/6.0.0/lucene-test-framework-6.0.0.jar
Download https://repo1.maven.org/maven2/org/apache/lucene/lucene-codecs/6.0.0/lucene-codecs-6.0.0.jar
Download https://repo1.maven.org/maven2/com/carrotsearch/randomizedtesting/randomizedtesting-runner/2.3.2/randomizedtesting-runner-2.3.2.jar
Note: Some input files use or override a deprecated API.
Note: Recompile with -Xlint:deprecation for details.
Note: Some input files use unchecked or unsafe operations.
Note: Recompile with -Xlint:unchecked for details.
:geode-lucene:processTestResources
:geode-lucene:testClasses
:geode-lucene:checkMissedTests
:geode-lucene:test
:geode-lucene:check
:geode-lucene:build
:geode-lucene:distributedTest
:geode-lucene:flakyTest
:geode-lucene:integrationTest
:geode-pulse:assemble
:geode-pulse:compileTestJava
Download https://repo1.maven.org/maven2/org/seleniumhq/selenium/selenium-firefox-driver/2.53.1/selenium-firefox-driver-2.53.1.pom
Download https://repo1.maven.org/maven2/org/seleniumhq/selenium/selenium-parent/2.53.1/selenium-parent-2.53.1.pom
Download https://repo1.maven.org/maven2/org/seleniumhq/selenium/selenium-api/2.53.1/selenium-api-2.53.1.pom
Download https://repo1.maven.org/maven2/org/seleniumhq/selenium/selenium-remote-driver/2.53.1/selenium-remote-driver-2.53.1.pom
Download https://repo1.maven.org/maven2/org/seleniumhq/selenium/selenium-support/2.53.1/selenium-support-2.53.1.pom
Download https://repo1.maven.org/maven2/org/springframework/spring-test/4.2.4.RELEASE/spring-test-4.2.4.RELEASE.pom
Download https://repo1.maven.org/maven2/com/google/code/gson/gson/2.3.1/gson-2.3.1.pom
Download https://repo1.maven.org/maven2/org/seleniumhq/selenium/selenium-firefox-driver/2.53.1/selenium-firefox-driver-2.53.1.jar
Download https://repo1.maven.org/maven2/org/seleniumhq/selenium/selenium-api/2.53.1/selenium-api-2.53.1.jar
Download https://repo1.maven.org/maven2/org/seleniumhq/selenium/selenium-remote-driver/2.53.1/selenium-remote-driver-2.53.1.jar
Download https://repo1.maven.org/maven2/org/seleniumhq/selenium/selenium-support/2.53.1/selenium-support-2.53.1.jar
Download https://repo1.maven.org/maven2/org/springframework/spring-test/4.2.4.RELEASE/spring-test-4.2.4.RELEASE.jar
Download https://repo1.maven.org/maven2/com/google/code/gson/gson/2.3.1/gson-2.3.1.jar
Note: <https://builds.apache.org/job/Geode-release/ws/geode-pulse/src/test/java/com/vmware/gemfire/tools/pulse/tests/PulseAbstractTest.java> uses or overrides a deprecated API.
Note: Recompile with -Xlint:deprecation for details.
Note: Some input files use unchecked or unsafe operations.
Note: Recompile with -Xlint:unchecked for details.
:geode-pulse:processTestResources
:geode-pulse:testClasses
:geode-pulse:checkMissedTests
Download https://repo1.maven.org/maven2/com/jayway/jsonpath/json-path/1.2.0/json-path-1.2.0.pom
Download https://repo1.maven.org/maven2/net/minidev/json-smart/2.1.0/json-smart-2.1.0.pom
Download https://repo1.maven.org/maven2/net/minidev/parent/2.1.0/parent-2.1.0.pom
Download https://repo1.maven.org/maven2/net/minidev/asm/1.0.2/asm-1.0.2.pom
Download https://repo1.maven.org/maven2/com/jayway/jsonpath/json-path/1.2.0/json-path-1.2.0.jar
Download https://repo1.maven.org/maven2/net/minidev/json-smart/2.1.0/json-smart-2.1.0.jar
Download https://repo1.maven.org/maven2/net/minidev/asm/1.0.2/asm-1.0.2.jar
:geode-pulse:test
:geode-pulse:check
:geode-pulse:build
:geode-pulse:distributedTest
:geode-pulse:flakyTest
:geode-pulse:integrationTest
:geode-rebalancer:jar
:geode-rebalancer:javadoc
:geode-rebalancer:javadocJar
:geode-rebalancer:sourcesJar
:geode-rebalancer:signArchives SKIPPED
:geode-rebalancer:assemble
:geode-rebalancer:compileTestJava
:geode-rebalancer:processTestResources UP-TO-DATE
:geode-rebalancer:testClasses
:geode-rebalancer:checkMissedTests
:geode-rebalancer:test
:geode-rebalancer:check
:geode-rebalancer:build
:geode-rebalancer:distributedTest
:geode-rebalancer:flakyTest
:geode-rebalancer:integrationTest
:geode-wan:assemble
:geode-wan:compileTestJavaNote: Some input files use or override a deprecated API.
Note: Recompile with -Xlint:deprecation for details.
Note: Some input files use unchecked or unsafe operations.
Note: Recompile with -Xlint:unchecked for details.
:geode-wan:processTestResources
:geode-wan:testClasses
:geode-wan:checkMissedTests
:geode-wan:test
:geode-wan:check
:geode-wan:build
:geode-wan:distributedTest
:geode-wan:flakyTest
:geode-wan:integrationTest
:geode-web:assemble
:geode-web:compileTestJavaNote: <https://builds.apache.org/job/Geode-release/ws/geode-web/src/test/java/com/gemstone/gemfire/management/internal/cli/commands/DataCommandsOverHttpDistributedTest.java> uses or overrides a deprecated API.
Note: Recompile with -Xlint:deprecation for details.
Note: Some input files use unchecked or unsafe operations.
Note: Recompile with -Xlint:unchecked for details.
:geode-web:processTestResources UP-TO-DATE
:geode-web:testClasses
:geode-web:checkMissedTests
:geode-web:test
:geode-web:check
:geode-web:build
:geode-web:distributedTest
:geode-web:flakyTest
:geode-web:integrationTest
:geode-web-api:assemble
:geode-web-api:compileTestJava UP-TO-DATE
:geode-web-api:processTestResources UP-TO-DATE
:geode-web-api:testClasses UP-TO-DATE
:geode-web-api:checkMissedTests UP-TO-DATE
:geode-web-api:test UP-TO-DATE
:geode-web-api:check
:geode-web-api:build
:geode-web-api:distributedTest UP-TO-DATE
:geode-web-api:flakyTest UP-TO-DATE
:geode-web-api:integrationTest UP-TO-DATE
:combineReports
All test reports at <https://builds.apache.org/job/Geode-release/ws/build/reports/combined>
:extensions/geode-modules:precheckin
:extensions/geode-modules-assembly:precheckin
:extensions/geode-modules-hibernate:precheckin
:extensions/geode-modules-session:precheckin
:extensions/geode-modules-session-internal:precheckin
:extensions/geode-modules-tomcat7:precheckin
:geode-common:precheckin
:geode-cq:precheckin
:geode-json:precheckin
:geode-junit:precheckin
:geode-lucene:precheckin
:geode-pulse:precheckin
:geode-rebalancer:precheckin
:geode-wan:precheckin
:geode-web:precheckin
:geode-web-api:precheckin
FAILURE: Build completed with 3 failures.
1: Task failed with an exception.
-----------
* What went wrong:
Execution failed for task ':geode-assembly:flakyTest'.
> There were failing tests. See the report at: file://<https://builds.apache.org/job/Geode-release/ws/geode-assembly/build/reports/flakyTest/index.html>
* Try:
Run with --stacktrace option to get the stack trace. Run with --info or --debug option to get more log output.
==============================================================================
2: Task failed with an exception.
-----------
* What went wrong:
Execution failed for task ':geode-core:distributedTest'.
> There were failing tests. See the report at: file://<https://builds.apache.org/job/Geode-release/ws/geode-core/build/reports/distributedTest/index.html>
* Try:
Run with --stacktrace option to get the stack trace. Run with --info or --debug option to get more log output.
==============================================================================
3: Task failed with an exception.
-----------
* What went wrong:
Execution failed for task ':geode-core:flakyTest'.
> There were failing tests. See the report at: file://<https://builds.apache.org/job/Geode-release/ws/geode-core/build/reports/flakyTest/index.html>
* Try:
Run with --stacktrace option to get the stack trace. Run with --info or --debug option to get more log output.
==============================================================================
BUILD FAILED
Total time: 11 hrs 26 mins 30.535 secs
Build step 'Invoke Gradle script' changed build result to FAILURE
Build step 'Invoke Gradle script' marked build as failure
Archiving artifacts
Compressed 250.79 MB of artifacts by 12.1% relative to #7
Recording test results