You are viewing a plain text version of this content. The canonical link for it is here.
Posted to dev@lucene.apache.org by Apache Jenkins Server <je...@builds.apache.org> on 2014/10/15 19:16:46 UTC

[JENKINS] Lucene-Solr-NightlyTests-trunk - Build # 658 - Failure

Build: https://builds.apache.org/job/Lucene-Solr-NightlyTests-trunk/658/

4 tests failed.
REGRESSION:  org.apache.solr.cloud.CollectionsAPIDistributedZkTest.testDistribSearch

Error Message:
Error CREATEing SolrCore 'halfcollection_shard1_replica1': Unable to create core [halfcollection_shard1_replica1] Caused by: Could not get shard id for core: halfcollection_shard1_replica1

Stack Trace:
org.apache.solr.client.solrj.impl.HttpSolrServer$RemoteSolrException: Error CREATEing SolrCore 'halfcollection_shard1_replica1': Unable to create core [halfcollection_shard1_replica1] Caused by: Could not get shard id for core: halfcollection_shard1_replica1
	at org.apache.solr.client.solrj.impl.HttpSolrServer.executeMethod(HttpSolrServer.java:569)
	at org.apache.solr.client.solrj.impl.HttpSolrServer.request(HttpSolrServer.java:215)
	at org.apache.solr.client.solrj.impl.HttpSolrServer.request(HttpSolrServer.java:211)
	at org.apache.solr.cloud.CollectionsAPIDistributedZkTest.testErrorHandling(CollectionsAPIDistributedZkTest.java:583)
	at org.apache.solr.cloud.CollectionsAPIDistributedZkTest.doTest(CollectionsAPIDistributedZkTest.java:205)
	at org.apache.solr.BaseDistributedSearchTestCase.testDistribSearch(BaseDistributedSearchTestCase.java:869)
	at sun.reflect.NativeMethodAccessorImpl.invoke0(Native Method)
	at sun.reflect.NativeMethodAccessorImpl.invoke(NativeMethodAccessorImpl.java:57)
	at sun.reflect.DelegatingMethodAccessorImpl.invoke(DelegatingMethodAccessorImpl.java:43)
	at java.lang.reflect.Method.invoke(Method.java:606)
	at com.carrotsearch.randomizedtesting.RandomizedRunner.invoke(RandomizedRunner.java:1618)
	at com.carrotsearch.randomizedtesting.RandomizedRunner$6.evaluate(RandomizedRunner.java:827)
	at com.carrotsearch.randomizedtesting.RandomizedRunner$7.evaluate(RandomizedRunner.java:863)
	at com.carrotsearch.randomizedtesting.RandomizedRunner$8.evaluate(RandomizedRunner.java:877)
	at com.carrotsearch.randomizedtesting.rules.SystemPropertiesRestoreRule$1.evaluate(SystemPropertiesRestoreRule.java:53)
	at org.apache.lucene.util.TestRuleSetupTeardownChained$1.evaluate(TestRuleSetupTeardownChained.java:50)
	at org.apache.lucene.util.AbstractBeforeAfterRule$1.evaluate(AbstractBeforeAfterRule.java:46)
	at com.carrotsearch.randomizedtesting.rules.SystemPropertiesInvariantRule$1.evaluate(SystemPropertiesInvariantRule.java:55)
	at org.apache.lucene.util.TestRuleThreadAndTestName$1.evaluate(TestRuleThreadAndTestName.java:49)
	at org.apache.lucene.util.TestRuleIgnoreAfterMaxFailures$1.evaluate(TestRuleIgnoreAfterMaxFailures.java:65)
	at org.apache.lucene.util.TestRuleMarkFailure$1.evaluate(TestRuleMarkFailure.java:48)
	at com.carrotsearch.randomizedtesting.rules.StatementAdapter.evaluate(StatementAdapter.java:36)
	at com.carrotsearch.randomizedtesting.ThreadLeakControl$StatementRunner.run(ThreadLeakControl.java:365)
	at com.carrotsearch.randomizedtesting.ThreadLeakControl.forkTimeoutingTask(ThreadLeakControl.java:798)
	at com.carrotsearch.randomizedtesting.ThreadLeakControl$3.evaluate(ThreadLeakControl.java:458)
	at com.carrotsearch.randomizedtesting.RandomizedRunner.runSingleTest(RandomizedRunner.java:836)
	at com.carrotsearch.randomizedtesting.RandomizedRunner$3.evaluate(RandomizedRunner.java:738)
	at com.carrotsearch.randomizedtesting.RandomizedRunner$4.evaluate(RandomizedRunner.java:772)
	at com.carrotsearch.randomizedtesting.RandomizedRunner$5.evaluate(RandomizedRunner.java:783)
	at com.carrotsearch.randomizedtesting.rules.StatementAdapter.evaluate(StatementAdapter.java:36)
	at com.carrotsearch.randomizedtesting.rules.SystemPropertiesRestoreRule$1.evaluate(SystemPropertiesRestoreRule.java:53)
	at org.apache.lucene.util.AbstractBeforeAfterRule$1.evaluate(AbstractBeforeAfterRule.java:46)
	at org.apache.lucene.util.TestRuleStoreClassName$1.evaluate(TestRuleStoreClassName.java:42)
	at com.carrotsearch.randomizedtesting.rules.SystemPropertiesInvariantRule$1.evaluate(SystemPropertiesInvariantRule.java:55)
	at com.carrotsearch.randomizedtesting.rules.NoShadowingOrOverridesOnMethodsRule$1.evaluate(NoShadowingOrOverridesOnMethodsRule.java:39)
	at com.carrotsearch.randomizedtesting.rules.NoShadowingOrOverridesOnMethodsRule$1.evaluate(NoShadowingOrOverridesOnMethodsRule.java:39)
	at com.carrotsearch.randomizedtesting.rules.StatementAdapter.evaluate(StatementAdapter.java:36)
	at com.carrotsearch.randomizedtesting.rules.StatementAdapter.evaluate(StatementAdapter.java:36)
	at com.carrotsearch.randomizedtesting.rules.StatementAdapter.evaluate(StatementAdapter.java:36)
	at org.apache.lucene.util.TestRuleAssertionsRequired$1.evaluate(TestRuleAssertionsRequired.java:43)
	at org.apache.lucene.util.TestRuleMarkFailure$1.evaluate(TestRuleMarkFailure.java:48)
	at org.apache.lucene.util.TestRuleIgnoreAfterMaxFailures$1.evaluate(TestRuleIgnoreAfterMaxFailures.java:65)
	at org.apache.lucene.util.TestRuleIgnoreTestSuites$1.evaluate(TestRuleIgnoreTestSuites.java:55)
	at com.carrotsearch.randomizedtesting.rules.StatementAdapter.evaluate(StatementAdapter.java:36)
	at com.carrotsearch.randomizedtesting.ThreadLeakControl$StatementRunner.run(ThreadLeakControl.java:365)
	at java.lang.Thread.run(Thread.java:745)


REGRESSION:  org.apache.solr.cloud.DeleteReplicaTest.testDistribSearch

Error Message:
No live SolrServers available to handle this request:[https://127.0.0.1:31553, https://127.0.0.1:55629, https://127.0.0.1:32855, https://127.0.0.1:10887, https://127.0.0.1:35232]

Stack Trace:
org.apache.solr.client.solrj.SolrServerException: No live SolrServers available to handle this request:[https://127.0.0.1:31553, https://127.0.0.1:55629, https://127.0.0.1:32855, https://127.0.0.1:10887, https://127.0.0.1:35232]
	at __randomizedtesting.SeedInfo.seed([E72D0CF5E9237892:66CB82ED9E7C18AE]:0)
	at org.apache.solr.client.solrj.impl.LBHttpSolrServer.request(LBHttpSolrServer.java:332)
	at org.apache.solr.client.solrj.impl.CloudSolrServer.sendRequest(CloudSolrServer.java:939)
	at org.apache.solr.client.solrj.impl.CloudSolrServer.requestWithRetryOnStaleState(CloudSolrServer.java:717)
	at org.apache.solr.client.solrj.impl.CloudSolrServer.request(CloudSolrServer.java:660)
	at org.apache.solr.cloud.DeleteReplicaTest.removeAndWaitForReplicaGone(DeleteReplicaTest.java:172)
	at org.apache.solr.cloud.DeleteReplicaTest.deleteLiveReplicaTest(DeleteReplicaTest.java:145)
	at org.apache.solr.cloud.DeleteReplicaTest.doTest(DeleteReplicaTest.java:89)
	at org.apache.solr.BaseDistributedSearchTestCase.testDistribSearch(BaseDistributedSearchTestCase.java:869)
	at sun.reflect.NativeMethodAccessorImpl.invoke0(Native Method)
	at sun.reflect.NativeMethodAccessorImpl.invoke(NativeMethodAccessorImpl.java:57)
	at sun.reflect.DelegatingMethodAccessorImpl.invoke(DelegatingMethodAccessorImpl.java:43)
	at java.lang.reflect.Method.invoke(Method.java:606)
	at com.carrotsearch.randomizedtesting.RandomizedRunner.invoke(RandomizedRunner.java:1618)
	at com.carrotsearch.randomizedtesting.RandomizedRunner$6.evaluate(RandomizedRunner.java:827)
	at com.carrotsearch.randomizedtesting.RandomizedRunner$7.evaluate(RandomizedRunner.java:863)
	at com.carrotsearch.randomizedtesting.RandomizedRunner$8.evaluate(RandomizedRunner.java:877)
	at com.carrotsearch.randomizedtesting.rules.SystemPropertiesRestoreRule$1.evaluate(SystemPropertiesRestoreRule.java:53)
	at org.apache.lucene.util.TestRuleSetupTeardownChained$1.evaluate(TestRuleSetupTeardownChained.java:50)
	at org.apache.lucene.util.AbstractBeforeAfterRule$1.evaluate(AbstractBeforeAfterRule.java:46)
	at com.carrotsearch.randomizedtesting.rules.SystemPropertiesInvariantRule$1.evaluate(SystemPropertiesInvariantRule.java:55)
	at org.apache.lucene.util.TestRuleThreadAndTestName$1.evaluate(TestRuleThreadAndTestName.java:49)
	at org.apache.lucene.util.TestRuleIgnoreAfterMaxFailures$1.evaluate(TestRuleIgnoreAfterMaxFailures.java:65)
	at org.apache.lucene.util.TestRuleMarkFailure$1.evaluate(TestRuleMarkFailure.java:48)
	at com.carrotsearch.randomizedtesting.rules.StatementAdapter.evaluate(StatementAdapter.java:36)
	at com.carrotsearch.randomizedtesting.ThreadLeakControl$StatementRunner.run(ThreadLeakControl.java:365)
	at com.carrotsearch.randomizedtesting.ThreadLeakControl.forkTimeoutingTask(ThreadLeakControl.java:798)
	at com.carrotsearch.randomizedtesting.ThreadLeakControl$3.evaluate(ThreadLeakControl.java:458)
	at com.carrotsearch.randomizedtesting.RandomizedRunner.runSingleTest(RandomizedRunner.java:836)
	at com.carrotsearch.randomizedtesting.RandomizedRunner$3.evaluate(RandomizedRunner.java:738)
	at com.carrotsearch.randomizedtesting.RandomizedRunner$4.evaluate(RandomizedRunner.java:772)
	at com.carrotsearch.randomizedtesting.RandomizedRunner$5.evaluate(RandomizedRunner.java:783)
	at com.carrotsearch.randomizedtesting.rules.StatementAdapter.evaluate(StatementAdapter.java:36)
	at com.carrotsearch.randomizedtesting.rules.SystemPropertiesRestoreRule$1.evaluate(SystemPropertiesRestoreRule.java:53)
	at org.apache.lucene.util.AbstractBeforeAfterRule$1.evaluate(AbstractBeforeAfterRule.java:46)
	at org.apache.lucene.util.TestRuleStoreClassName$1.evaluate(TestRuleStoreClassName.java:42)
	at com.carrotsearch.randomizedtesting.rules.SystemPropertiesInvariantRule$1.evaluate(SystemPropertiesInvariantRule.java:55)
	at com.carrotsearch.randomizedtesting.rules.NoShadowingOrOverridesOnMethodsRule$1.evaluate(NoShadowingOrOverridesOnMethodsRule.java:39)
	at com.carrotsearch.randomizedtesting.rules.NoShadowingOrOverridesOnMethodsRule$1.evaluate(NoShadowingOrOverridesOnMethodsRule.java:39)
	at com.carrotsearch.randomizedtesting.rules.StatementAdapter.evaluate(StatementAdapter.java:36)
	at com.carrotsearch.randomizedtesting.rules.StatementAdapter.evaluate(StatementAdapter.java:36)
	at com.carrotsearch.randomizedtesting.rules.StatementAdapter.evaluate(StatementAdapter.java:36)
	at org.apache.lucene.util.TestRuleAssertionsRequired$1.evaluate(TestRuleAssertionsRequired.java:43)
	at org.apache.lucene.util.TestRuleMarkFailure$1.evaluate(TestRuleMarkFailure.java:48)
	at org.apache.lucene.util.TestRuleIgnoreAfterMaxFailures$1.evaluate(TestRuleIgnoreAfterMaxFailures.java:65)
	at org.apache.lucene.util.TestRuleIgnoreTestSuites$1.evaluate(TestRuleIgnoreTestSuites.java:55)
	at com.carrotsearch.randomizedtesting.rules.StatementAdapter.evaluate(StatementAdapter.java:36)
	at com.carrotsearch.randomizedtesting.ThreadLeakControl$StatementRunner.run(ThreadLeakControl.java:365)
	at java.lang.Thread.run(Thread.java:745)
Caused by: org.apache.solr.client.solrj.impl.HttpSolrServer$RemoteSolrException: Could not  remove replica : delLiveColl/shard1/core_node1
	at org.apache.solr.client.solrj.impl.HttpSolrServer.executeMethod(HttpSolrServer.java:569)
	at org.apache.solr.client.solrj.impl.HttpSolrServer.request(HttpSolrServer.java:215)
	at org.apache.solr.client.solrj.impl.HttpSolrServer.request(HttpSolrServer.java:211)
	at org.apache.solr.client.solrj.impl.LBHttpSolrServer.doRequest(LBHttpSolrServer.java:353)
	at org.apache.solr.client.solrj.impl.LBHttpSolrServer.request(LBHttpSolrServer.java:312)
	... 47 more


REGRESSION:  org.apache.solr.cloud.FullSolrCloudDistribCmdsTest.testDistribSearch

Error Message:
Error executing query

Stack Trace:
org.apache.solr.client.solrj.SolrServerException: Error executing query
	at __randomizedtesting.SeedInfo.seed([E72D0CF5E9237892:66CB82ED9E7C18AE]:0)
	at org.apache.solr.client.solrj.request.QueryRequest.process(QueryRequest.java:100)
	at org.apache.solr.client.solrj.SolrServer.query(SolrServer.java:301)
	at org.apache.solr.cloud.CloudInspectUtil.compareResults(CloudInspectUtil.java:223)
	at org.apache.solr.cloud.CloudInspectUtil.compareResults(CloudInspectUtil.java:165)
	at org.apache.solr.cloud.FullSolrCloudDistribCmdsTest.testIndexingBatchPerRequestWithHttpSolrServer(FullSolrCloudDistribCmdsTest.java:414)
	at org.apache.solr.cloud.FullSolrCloudDistribCmdsTest.doTest(FullSolrCloudDistribCmdsTest.java:144)
	at org.apache.solr.BaseDistributedSearchTestCase.testDistribSearch(BaseDistributedSearchTestCase.java:869)
	at sun.reflect.NativeMethodAccessorImpl.invoke0(Native Method)
	at sun.reflect.NativeMethodAccessorImpl.invoke(NativeMethodAccessorImpl.java:57)
	at sun.reflect.DelegatingMethodAccessorImpl.invoke(DelegatingMethodAccessorImpl.java:43)
	at java.lang.reflect.Method.invoke(Method.java:606)
	at com.carrotsearch.randomizedtesting.RandomizedRunner.invoke(RandomizedRunner.java:1618)
	at com.carrotsearch.randomizedtesting.RandomizedRunner$6.evaluate(RandomizedRunner.java:827)
	at com.carrotsearch.randomizedtesting.RandomizedRunner$7.evaluate(RandomizedRunner.java:863)
	at com.carrotsearch.randomizedtesting.RandomizedRunner$8.evaluate(RandomizedRunner.java:877)
	at com.carrotsearch.randomizedtesting.rules.SystemPropertiesRestoreRule$1.evaluate(SystemPropertiesRestoreRule.java:53)
	at org.apache.lucene.util.TestRuleSetupTeardownChained$1.evaluate(TestRuleSetupTeardownChained.java:50)
	at org.apache.lucene.util.AbstractBeforeAfterRule$1.evaluate(AbstractBeforeAfterRule.java:46)
	at com.carrotsearch.randomizedtesting.rules.SystemPropertiesInvariantRule$1.evaluate(SystemPropertiesInvariantRule.java:55)
	at org.apache.lucene.util.TestRuleThreadAndTestName$1.evaluate(TestRuleThreadAndTestName.java:49)
	at org.apache.lucene.util.TestRuleIgnoreAfterMaxFailures$1.evaluate(TestRuleIgnoreAfterMaxFailures.java:65)
	at org.apache.lucene.util.TestRuleMarkFailure$1.evaluate(TestRuleMarkFailure.java:48)
	at com.carrotsearch.randomizedtesting.rules.StatementAdapter.evaluate(StatementAdapter.java:36)
	at com.carrotsearch.randomizedtesting.ThreadLeakControl$StatementRunner.run(ThreadLeakControl.java:365)
	at com.carrotsearch.randomizedtesting.ThreadLeakControl.forkTimeoutingTask(ThreadLeakControl.java:798)
	at com.carrotsearch.randomizedtesting.ThreadLeakControl$3.evaluate(ThreadLeakControl.java:458)
	at com.carrotsearch.randomizedtesting.RandomizedRunner.runSingleTest(RandomizedRunner.java:836)
	at com.carrotsearch.randomizedtesting.RandomizedRunner$3.evaluate(RandomizedRunner.java:738)
	at com.carrotsearch.randomizedtesting.RandomizedRunner$4.evaluate(RandomizedRunner.java:772)
	at com.carrotsearch.randomizedtesting.RandomizedRunner$5.evaluate(RandomizedRunner.java:783)
	at com.carrotsearch.randomizedtesting.rules.StatementAdapter.evaluate(StatementAdapter.java:36)
	at com.carrotsearch.randomizedtesting.rules.SystemPropertiesRestoreRule$1.evaluate(SystemPropertiesRestoreRule.java:53)
	at org.apache.lucene.util.AbstractBeforeAfterRule$1.evaluate(AbstractBeforeAfterRule.java:46)
	at org.apache.lucene.util.TestRuleStoreClassName$1.evaluate(TestRuleStoreClassName.java:42)
	at com.carrotsearch.randomizedtesting.rules.SystemPropertiesInvariantRule$1.evaluate(SystemPropertiesInvariantRule.java:55)
	at com.carrotsearch.randomizedtesting.rules.NoShadowingOrOverridesOnMethodsRule$1.evaluate(NoShadowingOrOverridesOnMethodsRule.java:39)
	at com.carrotsearch.randomizedtesting.rules.NoShadowingOrOverridesOnMethodsRule$1.evaluate(NoShadowingOrOverridesOnMethodsRule.java:39)
	at com.carrotsearch.randomizedtesting.rules.StatementAdapter.evaluate(StatementAdapter.java:36)
	at com.carrotsearch.randomizedtesting.rules.StatementAdapter.evaluate(StatementAdapter.java:36)
	at com.carrotsearch.randomizedtesting.rules.StatementAdapter.evaluate(StatementAdapter.java:36)
	at org.apache.lucene.util.TestRuleAssertionsRequired$1.evaluate(TestRuleAssertionsRequired.java:43)
	at org.apache.lucene.util.TestRuleMarkFailure$1.evaluate(TestRuleMarkFailure.java:48)
	at org.apache.lucene.util.TestRuleIgnoreAfterMaxFailures$1.evaluate(TestRuleIgnoreAfterMaxFailures.java:65)
	at org.apache.lucene.util.TestRuleIgnoreTestSuites$1.evaluate(TestRuleIgnoreTestSuites.java:55)
	at com.carrotsearch.randomizedtesting.rules.StatementAdapter.evaluate(StatementAdapter.java:36)
	at com.carrotsearch.randomizedtesting.ThreadLeakControl$StatementRunner.run(ThreadLeakControl.java:365)
	at java.lang.Thread.run(Thread.java:745)
Caused by: org.apache.http.ParseException: Invalid content type: 
	at org.apache.http.entity.ContentType.parse(ContentType.java:233)
	at org.apache.solr.client.solrj.impl.HttpSolrServer.executeMethod(HttpSolrServer.java:513)
	at org.apache.solr.client.solrj.impl.HttpSolrServer.request(HttpSolrServer.java:215)
	at org.apache.solr.client.solrj.impl.HttpSolrServer.request(HttpSolrServer.java:211)
	at org.apache.solr.client.solrj.request.QueryRequest.process(QueryRequest.java:91)
	... 46 more


REGRESSION:  org.apache.solr.handler.TestReplicationHandler.doTestReplicateAfterCoreReload

Error Message:
expected:<[{indexVersion=1413390466428,generation=2,filelist=[_nw.fdt, _nw.fdx, _nw.fnm, _nw.nvd, _nw.nvm, _nw.si, _nw_Lucene41VarGapFixedInterval_0.doc, _nw_Lucene41VarGapFixedInterval_0.tib, _nw_Lucene41VarGapFixedInterval_0.tiv, _nx.fdt, _nx.fdx, _nx.fnm, _nx.nvd, _nx.nvm, _nx.si, _nx_Lucene41VarGapFixedInterval_0.doc, _nx_Lucene41VarGapFixedInterval_0.tib, _nx_Lucene41VarGapFixedInterval_0.tiv, _ny.fdt, _ny.fdx, _ny.fnm, _ny.nvd, _ny.nvm, _ny.si, _ny_Lucene41VarGapFixedInterval_0.doc, _ny_Lucene41VarGapFixedInterval_0.tib, _ny_Lucene41VarGapFixedInterval_0.tiv, _nz.fdt, _nz.fdx, _nz.fnm, _nz.nvd, _nz.nvm, _nz.si, _nz_Lucene41VarGapFixedInterval_0.doc, _nz_Lucene41VarGapFixedInterval_0.tib, _nz_Lucene41VarGapFixedInterval_0.tiv, _o0.fdt, _o0.fdx, _o0.fnm, _o0.nvd, _o0.nvm, _o0.si, _o0_Lucene41VarGapFixedInterval_0.doc, _o0_Lucene41VarGapFixedInterval_0.tib, _o0_Lucene41VarGapFixedInterval_0.tiv, _o1.fdt, _o1.fdx, _o1.fnm, _o1.nvd, _o1.nvm, _o1.si, _o1_Lucene41VarGapFixedInterval_0.doc, _o1_Lucene41VarGapFixedInterval_0.tib, _o1_Lucene41VarGapFixedInterval_0.tiv, _o2.fdt, _o2.fdx, _o2.fnm, _o2.nvd, _o2.nvm, _o2.si, _o2_Lucene41VarGapFixedInterval_0.doc, _o2_Lucene41VarGapFixedInterval_0.tib, _o2_Lucene41VarGapFixedInterval_0.tiv, _o3.fdt, _o3.fdx, _o3.fnm, _o3.nvd, _o3.nvm, _o3.si, _o3_Lucene41VarGapFixedInterval_0.doc, _o3_Lucene41VarGapFixedInterval_0.tib, _o3_Lucene41VarGapFixedInterval_0.tiv, _o4.fdt, _o4.fdx, _o4.fnm, _o4.nvd, _o4.nvm, _o4.si, _o4_Lucene41VarGapFixedInterval_0.doc, _o4_Lucene41VarGapFixedInterval_0.tib, _o4_Lucene41VarGapFixedInterval_0.tiv, _o5.fdt, _o5.fdx, _o5.fnm, _o5.nvd, _o5.nvm, _o5.si, _o5_Lucene41VarGapFixedInterval_0.doc, _o5_Lucene41VarGapFixedInterval_0.tib, _o5_Lucene41VarGapFixedInterval_0.tiv, _o6.fdt, _o6.fdx, _o6.fnm, _o6.nvd, _o6.nvm, _o6.si, _o6_Lucene41VarGapFixedInterval_0.doc, _o6_Lucene41VarGapFixedInterval_0.tib, _o6_Lucene41VarGapFixedInterval_0.tiv, _o7.fdt, _o7.fdx, _o7.fnm, _o7.nvd, _o7.nvm, _o7.si, _o7_Lucene41VarGapFixedInterval_0.doc, _o7_Lucene41VarGapFixedInterval_0.tib, _o7_Lucene41VarGapFixedInterval_0.tiv, _o8.fdt, _o8.fdx, _o8.fnm, _o8.nvd, _o8.nvm, _o8.si, _o8_Lucene41VarGapFixedInterval_0.doc, _o8_Lucene41VarGapFixedInterval_0.tib, _o8_Lucene41VarGapFixedInterval_0.tiv, _o9.fdt, _o9.fdx, _o9.fnm, _o9.nvd, _o9.nvm, _o9.si, _o9_Lucene41VarGapFixedInterval_0.doc, _o9_Lucene41VarGapFixedInterval_0.tib, _o9_Lucene41VarGapFixedInterval_0.tiv, _oa.fdt, _oa.fdx, _oa.fnm, _oa.nvd, _oa.nvm, _oa.si, _oa_Lucene41VarGapFixedInterval_0.doc, _oa_Lucene41VarGapFixedInterval_0.tib, _oa_Lucene41VarGapFixedInterval_0.tiv, _ob.fdt, _ob.fdx, _ob.fnm, _ob.nvd, _ob.nvm, _ob.si, _ob_Lucene41VarGapFixedInterval_0.doc, _ob_Lucene41VarGapFixedInterval_0.tib, _ob_Lucene41VarGapFixedInterval_0.tiv, _oc.fdt, _oc.fdx, _oc.fnm, _oc.nvd, _oc.nvm, _oc.si, _oc_Lucene41VarGapFixedInterval_0.doc, _oc_Lucene41VarGapFixedInterval_0.tib, _oc_Lucene41VarGapFixedInterval_0.tiv, _od.fdt, _od.fdx, _od.fnm, _od.nvd, _od.nvm, _od.si, _od_Lucene41VarGapFixedInterval_0.doc, _od_Lucene41VarGapFixedInterval_0.tib, _od_Lucene41VarGapFixedInterval_0.tiv, _oe.fdt, _oe.fdx, _oe.fnm, _oe.nvd, _oe.nvm, _oe.si, _oe_Lucene41VarGapFixedInterval_0.doc, _oe_Lucene41VarGapFixedInterval_0.tib, _oe_Lucene41VarGapFixedInterval_0.tiv, _of.fdt, _of.fdx, _of.fnm, _of.nvd, _of.nvm, _of.si, _of_Lucene41VarGapFixedInterval_0.doc, _of_Lucene41VarGapFixedInterval_0.tib, _of_Lucene41VarGapFixedInterval_0.tiv, _og.fdt, _og.fdx, _og.fnm, _og.nvd, _og.nvm, _og.si, _og_Lucene41VarGapFixedInterval_0.doc, _og_Lucene41VarGapFixedInterval_0.tib, _og_Lucene41VarGapFixedInterval_0.tiv, _oi.fdt, _oi.fdx, _oi.fnm, _oi.nvd, _oi.nvm, _oi.si, _oi_Lucene41VarGapFixedInterval_0.doc, _oi_Lucene41VarGapFixedInterval_0.tib, _oi_Lucene41VarGapFixedInterval_0.tiv, _oj.fdt, _oj.fdx, _oj.fnm, _oj.nvd, _oj.nvm, _oj.si, _oj_Lucene41VarGapFixedInterval_0.doc, _oj_Lucene41VarGapFixedInterval_0.tib, _oj_Lucene41VarGapFixedInterval_0.tiv, _ok.fdt, _ok.fdx, _ok.fnm, _ok.nvd, _ok.nvm, _ok.si, _ok_Lucene41VarGapFixedInterval_0.doc, _ok_Lucene41VarGapFixedInterval_0.tib, _ok_Lucene41VarGapFixedInterval_0.tiv, _ol.fdt, _ol.fdx, _ol.fnm, _ol.nvd, _ol.nvm, _ol.si, _ol_Lucene41VarGapFixedInterval_0.doc, _ol_Lucene41VarGapFixedInterval_0.tib, _ol_Lucene41VarGapFixedInterval_0.tiv, _om.fdt, _om.fdx, _om.fnm, _om.nvd, _om.nvm, _om.si, _om_Lucene41VarGapFixedInterval_0.doc, _om_Lucene41VarGapFixedInterval_0.tib, _om_Lucene41VarGapFixedInterval_0.tiv, _on.fdt, _on.fdx, _on.fnm, _on.nvd, _on.nvm, _on.si, _on_Lucene41VarGapFixedInterval_0.doc, _on_Lucene41VarGapFixedInterval_0.tib, _on_Lucene41VarGapFixedInterval_0.tiv, segments_2]}]> but was:<[{indexVersion=1413390466428,generation=3,filelist=[_og.fdt, _og.fdx, _og.fnm, _og.nvd, _og.nvm, _og.si, _og_Lucene41VarGapFixedInterval_0.doc, _og_Lucene41VarGapFixedInterval_0.tib, _og_Lucene41VarGapFixedInterval_0.tiv, _oh.fdt, _oh.fdx, _oh.fnm, _oh.nvd, _oh.nvm, _oh.si, _oh_Lucene41VarGapFixedInterval_0.doc, _oh_Lucene41VarGapFixedInterval_0.tib, _oh_Lucene41VarGapFixedInterval_0.tiv, _oi.fdt, _oi.fdx, _oi.fnm, _oi.nvd, _oi.nvm, _oi.si, _oi_Lucene41VarGapFixedInterval_0.doc, _oi_Lucene41VarGapFixedInterval_0.tib, _oi_Lucene41VarGapFixedInterval_0.tiv, _oj.fdt, _oj.fdx, _oj.fnm, _oj.nvd, _oj.nvm, _oj.si, _oj_Lucene41VarGapFixedInterval_0.doc, _oj_Lucene41VarGapFixedInterval_0.tib, _oj_Lucene41VarGapFixedInterval_0.tiv, _ok.fdt, _ok.fdx, _ok.fnm, _ok.nvd, _ok.nvm, _ok.si, _ok_Lucene41VarGapFixedInterval_0.doc, _ok_Lucene41VarGapFixedInterval_0.tib, _ok_Lucene41VarGapFixedInterval_0.tiv, _ol.fdt, _ol.fdx, _ol.fnm, _ol.nvd, _ol.nvm, _ol.si, _ol_Lucene41VarGapFixedInterval_0.doc, _ol_Lucene41VarGapFixedInterval_0.tib, _ol_Lucene41VarGapFixedInterval_0.tiv, _om.fdt, _om.fdx, _om.fnm, _om.nvd, _om.nvm, _om.si, _om_Lucene41VarGapFixedInterval_0.doc, _om_Lucene41VarGapFixedInterval_0.tib, _om_Lucene41VarGapFixedInterval_0.tiv, _on.fdt, _on.fdx, _on.fnm, _on.nvd, _on.nvm, _on.si, _on_Lucene41VarGapFixedInterval_0.doc, _on_Lucene41VarGapFixedInterval_0.tib, _on_Lucene41VarGapFixedInterval_0.tiv, segments_3]}, {indexVersion=1413390466428,generation=2,filelist=[_nw.fdt, _nw.fdx, _nw.fnm, _nw.nvd, _nw.nvm, _nw.si, _nw_Lucene41VarGapFixedInterval_0.doc, _nw_Lucene41VarGapFixedInterval_0.tib, _nw_Lucene41VarGapFixedInterval_0.tiv, _nx.fdt, _nx.fdx, _nx.fnm, _nx.nvd, _nx.nvm, _nx.si, _nx_Lucene41VarGapFixedInterval_0.doc, _nx_Lucene41VarGapFixedInterval_0.tib, _nx_Lucene41VarGapFixedInterval_0.tiv, _ny.fdt, _ny.fdx, _ny.fnm, _ny.nvd, _ny.nvm, _ny.si, _ny_Lucene41VarGapFixedInterval_0.doc, _ny_Lucene41VarGapFixedInterval_0.tib, _ny_Lucene41VarGapFixedInterval_0.tiv, _nz.fdt, _nz.fdx, _nz.fnm, _nz.nvd, _nz.nvm, _nz.si, _nz_Lucene41VarGapFixedInterval_0.doc, _nz_Lucene41VarGapFixedInterval_0.tib, _nz_Lucene41VarGapFixedInterval_0.tiv, _o0.fdt, _o0.fdx, _o0.fnm, _o0.nvd, _o0.nvm, _o0.si, _o0_Lucene41VarGapFixedInterval_0.doc, _o0_Lucene41VarGapFixedInterval_0.tib, _o0_Lucene41VarGapFixedInterval_0.tiv, _o1.fdt, _o1.fdx, _o1.fnm, _o1.nvd, _o1.nvm, _o1.si, _o1_Lucene41VarGapFixedInterval_0.doc, _o1_Lucene41VarGapFixedInterval_0.tib, _o1_Lucene41VarGapFixedInterval_0.tiv, _o2.fdt, _o2.fdx, _o2.fnm, _o2.nvd, _o2.nvm, _o2.si, _o2_Lucene41VarGapFixedInterval_0.doc, _o2_Lucene41VarGapFixedInterval_0.tib, _o2_Lucene41VarGapFixedInterval_0.tiv, _o3.fdt, _o3.fdx, _o3.fnm, _o3.nvd, _o3.nvm, _o3.si, _o3_Lucene41VarGapFixedInterval_0.doc, _o3_Lucene41VarGapFixedInterval_0.tib, _o3_Lucene41VarGapFixedInterval_0.tiv, _o4.fdt, _o4.fdx, _o4.fnm, _o4.nvd, _o4.nvm, _o4.si, _o4_Lucene41VarGapFixedInterval_0.doc, _o4_Lucene41VarGapFixedInterval_0.tib, _o4_Lucene41VarGapFixedInterval_0.tiv, _o5.fdt, _o5.fdx, _o5.fnm, _o5.nvd, _o5.nvm, _o5.si, _o5_Lucene41VarGapFixedInterval_0.doc, _o5_Lucene41VarGapFixedInterval_0.tib, _o5_Lucene41VarGapFixedInterval_0.tiv, _o6.fdt, _o6.fdx, _o6.fnm, _o6.nvd, _o6.nvm, _o6.si, _o6_Lucene41VarGapFixedInterval_0.doc, _o6_Lucene41VarGapFixedInterval_0.tib, _o6_Lucene41VarGapFixedInterval_0.tiv, _o7.fdt, _o7.fdx, _o7.fnm, _o7.nvd, _o7.nvm, _o7.si, _o7_Lucene41VarGapFixedInterval_0.doc, _o7_Lucene41VarGapFixedInterval_0.tib, _o7_Lucene41VarGapFixedInterval_0.tiv, _o8.fdt, _o8.fdx, _o8.fnm, _o8.nvd, _o8.nvm, _o8.si, _o8_Lucene41VarGapFixedInterval_0.doc, _o8_Lucene41VarGapFixedInterval_0.tib, _o8_Lucene41VarGapFixedInterval_0.tiv, _o9.fdt, _o9.fdx, _o9.fnm, _o9.nvd, _o9.nvm, _o9.si, _o9_Lucene41VarGapFixedInterval_0.doc, _o9_Lucene41VarGapFixedInterval_0.tib, _o9_Lucene41VarGapFixedInterval_0.tiv, _oa.fdt, _oa.fdx, _oa.fnm, _oa.nvd, _oa.nvm, _oa.si, _oa_Lucene41VarGapFixedInterval_0.doc, _oa_Lucene41VarGapFixedInterval_0.tib, _oa_Lucene41VarGapFixedInterval_0.tiv, _ob.fdt, _ob.fdx, _ob.fnm, _ob.nvd, _ob.nvm, _ob.si, _ob_Lucene41VarGapFixedInterval_0.doc, _ob_Lucene41VarGapFixedInterval_0.tib, _ob_Lucene41VarGapFixedInterval_0.tiv, _oc.fdt, _oc.fdx, _oc.fnm, _oc.nvd, _oc.nvm, _oc.si, _oc_Lucene41VarGapFixedInterval_0.doc, _oc_Lucene41VarGapFixedInterval_0.tib, _oc_Lucene41VarGapFixedInterval_0.tiv, _od.fdt, _od.fdx, _od.fnm, _od.nvd, _od.nvm, _od.si, _od_Lucene41VarGapFixedInterval_0.doc, _od_Lucene41VarGapFixedInterval_0.tib, _od_Lucene41VarGapFixedInterval_0.tiv, _oe.fdt, _oe.fdx, _oe.fnm, _oe.nvd, _oe.nvm, _oe.si, _oe_Lucene41VarGapFixedInterval_0.doc, _oe_Lucene41VarGapFixedInterval_0.tib, _oe_Lucene41VarGapFixedInterval_0.tiv, _of.fdt, _of.fdx, _of.fnm, _of.nvd, _of.nvm, _of.si, _of_Lucene41VarGapFixedInterval_0.doc, _of_Lucene41VarGapFixedInterval_0.tib, _of_Lucene41VarGapFixedInterval_0.tiv, _og.fdt, _og.fdx, _og.fnm, _og.nvd, _og.nvm, _og.si, _og_Lucene41VarGapFixedInterval_0.doc, _og_Lucene41VarGapFixedInterval_0.tib, _og_Lucene41VarGapFixedInterval_0.tiv, _oi.fdt, _oi.fdx, _oi.fnm, _oi.nvd, _oi.nvm, _oi.si, _oi_Lucene41VarGapFixedInterval_0.doc, _oi_Lucene41VarGapFixedInterval_0.tib, _oi_Lucene41VarGapFixedInterval_0.tiv, _oj.fdt, _oj.fdx, _oj.fnm, _oj.nvd, _oj.nvm, _oj.si, _oj_Lucene41VarGapFixedInterval_0.doc, _oj_Lucene41VarGapFixedInterval_0.tib, _oj_Lucene41VarGapFixedInterval_0.tiv, _ok.fdt, _ok.fdx, _ok.fnm, _ok.nvd, _ok.nvm, _ok.si, _ok_Lucene41VarGapFixedInterval_0.doc, _ok_Lucene41VarGapFixedInterval_0.tib, _ok_Lucene41VarGapFixedInterval_0.tiv, _ol.fdt, _ol.fdx, _ol.fnm, _ol.nvd, _ol.nvm, _ol.si, _ol_Lucene41VarGapFixedInterval_0.doc, _ol_Lucene41VarGapFixedInterval_0.tib, _ol_Lucene41VarGapFixedInterval_0.tiv, _om.fdt, _om.fdx, _om.fnm, _om.nvd, _om.nvm, _om.si, _om_Lucene41VarGapFixedInterval_0.doc, _om_Lucene41VarGapFixedInterval_0.tib, _om_Lucene41VarGapFixedInterval_0.tiv, _on.fdt, _on.fdx, _on.fnm, _on.nvd, _on.nvm, _on.si, _on_Lucene41VarGapFixedInterval_0.doc, _on_Lucene41VarGapFixedInterval_0.tib, _on_Lucene41VarGapFixedInterval_0.tiv, segments_2]}]>

Stack Trace:
java.lang.AssertionError: expected:<[{indexVersion=1413390466428,generation=2,filelist=[_nw.fdt, _nw.fdx, _nw.fnm, _nw.nvd, _nw.nvm, _nw.si, _nw_Lucene41VarGapFixedInterval_0.doc, _nw_Lucene41VarGapFixedInterval_0.tib, _nw_Lucene41VarGapFixedInterval_0.tiv, _nx.fdt, _nx.fdx, _nx.fnm, _nx.nvd, _nx.nvm, _nx.si, _nx_Lucene41VarGapFixedInterval_0.doc, _nx_Lucene41VarGapFixedInterval_0.tib, _nx_Lucene41VarGapFixedInterval_0.tiv, _ny.fdt, _ny.fdx, _ny.fnm, _ny.nvd, _ny.nvm, _ny.si, _ny_Lucene41VarGapFixedInterval_0.doc, _ny_Lucene41VarGapFixedInterval_0.tib, _ny_Lucene41VarGapFixedInterval_0.tiv, _nz.fdt, _nz.fdx, _nz.fnm, _nz.nvd, _nz.nvm, _nz.si, _nz_Lucene41VarGapFixedInterval_0.doc, _nz_Lucene41VarGapFixedInterval_0.tib, _nz_Lucene41VarGapFixedInterval_0.tiv, _o0.fdt, _o0.fdx, _o0.fnm, _o0.nvd, _o0.nvm, _o0.si, _o0_Lucene41VarGapFixedInterval_0.doc, _o0_Lucene41VarGapFixedInterval_0.tib, _o0_Lucene41VarGapFixedInterval_0.tiv, _o1.fdt, _o1.fdx, _o1.fnm, _o1.nvd, _o1.nvm, _o1.si, _o1_Lucene41VarGapFixedInterval_0.doc, _o1_Lucene41VarGapFixedInterval_0.tib, _o1_Lucene41VarGapFixedInterval_0.tiv, _o2.fdt, _o2.fdx, _o2.fnm, _o2.nvd, _o2.nvm, _o2.si, _o2_Lucene41VarGapFixedInterval_0.doc, _o2_Lucene41VarGapFixedInterval_0.tib, _o2_Lucene41VarGapFixedInterval_0.tiv, _o3.fdt, _o3.fdx, _o3.fnm, _o3.nvd, _o3.nvm, _o3.si, _o3_Lucene41VarGapFixedInterval_0.doc, _o3_Lucene41VarGapFixedInterval_0.tib, _o3_Lucene41VarGapFixedInterval_0.tiv, _o4.fdt, _o4.fdx, _o4.fnm, _o4.nvd, _o4.nvm, _o4.si, _o4_Lucene41VarGapFixedInterval_0.doc, _o4_Lucene41VarGapFixedInterval_0.tib, _o4_Lucene41VarGapFixedInterval_0.tiv, _o5.fdt, _o5.fdx, _o5.fnm, _o5.nvd, _o5.nvm, _o5.si, _o5_Lucene41VarGapFixedInterval_0.doc, _o5_Lucene41VarGapFixedInterval_0.tib, _o5_Lucene41VarGapFixedInterval_0.tiv, _o6.fdt, _o6.fdx, _o6.fnm, _o6.nvd, _o6.nvm, _o6.si, _o6_Lucene41VarGapFixedInterval_0.doc, _o6_Lucene41VarGapFixedInterval_0.tib, _o6_Lucene41VarGapFixedInterval_0.tiv, _o7.fdt, _o7.fdx, _o7.fnm, _o7.nvd, _o7.nvm, _o7.si, _o7_Lucene41VarGapFixedInterval_0.doc, _o7_Lucene41VarGapFixedInterval_0.tib, _o7_Lucene41VarGapFixedInterval_0.tiv, _o8.fdt, _o8.fdx, _o8.fnm, _o8.nvd, _o8.nvm, _o8.si, _o8_Lucene41VarGapFixedInterval_0.doc, _o8_Lucene41VarGapFixedInterval_0.tib, _o8_Lucene41VarGapFixedInterval_0.tiv, _o9.fdt, _o9.fdx, _o9.fnm, _o9.nvd, _o9.nvm, _o9.si, _o9_Lucene41VarGapFixedInterval_0.doc, _o9_Lucene41VarGapFixedInterval_0.tib, _o9_Lucene41VarGapFixedInterval_0.tiv, _oa.fdt, _oa.fdx, _oa.fnm, _oa.nvd, _oa.nvm, _oa.si, _oa_Lucene41VarGapFixedInterval_0.doc, _oa_Lucene41VarGapFixedInterval_0.tib, _oa_Lucene41VarGapFixedInterval_0.tiv, _ob.fdt, _ob.fdx, _ob.fnm, _ob.nvd, _ob.nvm, _ob.si, _ob_Lucene41VarGapFixedInterval_0.doc, _ob_Lucene41VarGapFixedInterval_0.tib, _ob_Lucene41VarGapFixedInterval_0.tiv, _oc.fdt, _oc.fdx, _oc.fnm, _oc.nvd, _oc.nvm, _oc.si, _oc_Lucene41VarGapFixedInterval_0.doc, _oc_Lucene41VarGapFixedInterval_0.tib, _oc_Lucene41VarGapFixedInterval_0.tiv, _od.fdt, _od.fdx, _od.fnm, _od.nvd, _od.nvm, _od.si, _od_Lucene41VarGapFixedInterval_0.doc, _od_Lucene41VarGapFixedInterval_0.tib, _od_Lucene41VarGapFixedInterval_0.tiv, _oe.fdt, _oe.fdx, _oe.fnm, _oe.nvd, _oe.nvm, _oe.si, _oe_Lucene41VarGapFixedInterval_0.doc, _oe_Lucene41VarGapFixedInterval_0.tib, _oe_Lucene41VarGapFixedInterval_0.tiv, _of.fdt, _of.fdx, _of.fnm, _of.nvd, _of.nvm, _of.si, _of_Lucene41VarGapFixedInterval_0.doc, _of_Lucene41VarGapFixedInterval_0.tib, _of_Lucene41VarGapFixedInterval_0.tiv, _og.fdt, _og.fdx, _og.fnm, _og.nvd, _og.nvm, _og.si, _og_Lucene41VarGapFixedInterval_0.doc, _og_Lucene41VarGapFixedInterval_0.tib, _og_Lucene41VarGapFixedInterval_0.tiv, _oi.fdt, _oi.fdx, _oi.fnm, _oi.nvd, _oi.nvm, _oi.si, _oi_Lucene41VarGapFixedInterval_0.doc, _oi_Lucene41VarGapFixedInterval_0.tib, _oi_Lucene41VarGapFixedInterval_0.tiv, _oj.fdt, _oj.fdx, _oj.fnm, _oj.nvd, _oj.nvm, _oj.si, _oj_Lucene41VarGapFixedInterval_0.doc, _oj_Lucene41VarGapFixedInterval_0.tib, _oj_Lucene41VarGapFixedInterval_0.tiv, _ok.fdt, _ok.fdx, _ok.fnm, _ok.nvd, _ok.nvm, _ok.si, _ok_Lucene41VarGapFixedInterval_0.doc, _ok_Lucene41VarGapFixedInterval_0.tib, _ok_Lucene41VarGapFixedInterval_0.tiv, _ol.fdt, _ol.fdx, _ol.fnm, _ol.nvd, _ol.nvm, _ol.si, _ol_Lucene41VarGapFixedInterval_0.doc, _ol_Lucene41VarGapFixedInterval_0.tib, _ol_Lucene41VarGapFixedInterval_0.tiv, _om.fdt, _om.fdx, _om.fnm, _om.nvd, _om.nvm, _om.si, _om_Lucene41VarGapFixedInterval_0.doc, _om_Lucene41VarGapFixedInterval_0.tib, _om_Lucene41VarGapFixedInterval_0.tiv, _on.fdt, _on.fdx, _on.fnm, _on.nvd, _on.nvm, _on.si, _on_Lucene41VarGapFixedInterval_0.doc, _on_Lucene41VarGapFixedInterval_0.tib, _on_Lucene41VarGapFixedInterval_0.tiv, segments_2]}]> but was:<[{indexVersion=1413390466428,generation=3,filelist=[_og.fdt, _og.fdx, _og.fnm, _og.nvd, _og.nvm, _og.si, _og_Lucene41VarGapFixedInterval_0.doc, _og_Lucene41VarGapFixedInterval_0.tib, _og_Lucene41VarGapFixedInterval_0.tiv, _oh.fdt, _oh.fdx, _oh.fnm, _oh.nvd, _oh.nvm, _oh.si, _oh_Lucene41VarGapFixedInterval_0.doc, _oh_Lucene41VarGapFixedInterval_0.tib, _oh_Lucene41VarGapFixedInterval_0.tiv, _oi.fdt, _oi.fdx, _oi.fnm, _oi.nvd, _oi.nvm, _oi.si, _oi_Lucene41VarGapFixedInterval_0.doc, _oi_Lucene41VarGapFixedInterval_0.tib, _oi_Lucene41VarGapFixedInterval_0.tiv, _oj.fdt, _oj.fdx, _oj.fnm, _oj.nvd, _oj.nvm, _oj.si, _oj_Lucene41VarGapFixedInterval_0.doc, _oj_Lucene41VarGapFixedInterval_0.tib, _oj_Lucene41VarGapFixedInterval_0.tiv, _ok.fdt, _ok.fdx, _ok.fnm, _ok.nvd, _ok.nvm, _ok.si, _ok_Lucene41VarGapFixedInterval_0.doc, _ok_Lucene41VarGapFixedInterval_0.tib, _ok_Lucene41VarGapFixedInterval_0.tiv, _ol.fdt, _ol.fdx, _ol.fnm, _ol.nvd, _ol.nvm, _ol.si, _ol_Lucene41VarGapFixedInterval_0.doc, _ol_Lucene41VarGapFixedInterval_0.tib, _ol_Lucene41VarGapFixedInterval_0.tiv, _om.fdt, _om.fdx, _om.fnm, _om.nvd, _om.nvm, _om.si, _om_Lucene41VarGapFixedInterval_0.doc, _om_Lucene41VarGapFixedInterval_0.tib, _om_Lucene41VarGapFixedInterval_0.tiv, _on.fdt, _on.fdx, _on.fnm, _on.nvd, _on.nvm, _on.si, _on_Lucene41VarGapFixedInterval_0.doc, _on_Lucene41VarGapFixedInterval_0.tib, _on_Lucene41VarGapFixedInterval_0.tiv, segments_3]}, {indexVersion=1413390466428,generation=2,filelist=[_nw.fdt, _nw.fdx, _nw.fnm, _nw.nvd, _nw.nvm, _nw.si, _nw_Lucene41VarGapFixedInterval_0.doc, _nw_Lucene41VarGapFixedInterval_0.tib, _nw_Lucene41VarGapFixedInterval_0.tiv, _nx.fdt, _nx.fdx, _nx.fnm, _nx.nvd, _nx.nvm, _nx.si, _nx_Lucene41VarGapFixedInterval_0.doc, _nx_Lucene41VarGapFixedInterval_0.tib, _nx_Lucene41VarGapFixedInterval_0.tiv, _ny.fdt, _ny.fdx, _ny.fnm, _ny.nvd, _ny.nvm, _ny.si, _ny_Lucene41VarGapFixedInterval_0.doc, _ny_Lucene41VarGapFixedInterval_0.tib, _ny_Lucene41VarGapFixedInterval_0.tiv, _nz.fdt, _nz.fdx, _nz.fnm, _nz.nvd, _nz.nvm, _nz.si, _nz_Lucene41VarGapFixedInterval_0.doc, _nz_Lucene41VarGapFixedInterval_0.tib, _nz_Lucene41VarGapFixedInterval_0.tiv, _o0.fdt, _o0.fdx, _o0.fnm, _o0.nvd, _o0.nvm, _o0.si, _o0_Lucene41VarGapFixedInterval_0.doc, _o0_Lucene41VarGapFixedInterval_0.tib, _o0_Lucene41VarGapFixedInterval_0.tiv, _o1.fdt, _o1.fdx, _o1.fnm, _o1.nvd, _o1.nvm, _o1.si, _o1_Lucene41VarGapFixedInterval_0.doc, _o1_Lucene41VarGapFixedInterval_0.tib, _o1_Lucene41VarGapFixedInterval_0.tiv, _o2.fdt, _o2.fdx, _o2.fnm, _o2.nvd, _o2.nvm, _o2.si, _o2_Lucene41VarGapFixedInterval_0.doc, _o2_Lucene41VarGapFixedInterval_0.tib, _o2_Lucene41VarGapFixedInterval_0.tiv, _o3.fdt, _o3.fdx, _o3.fnm, _o3.nvd, _o3.nvm, _o3.si, _o3_Lucene41VarGapFixedInterval_0.doc, _o3_Lucene41VarGapFixedInterval_0.tib, _o3_Lucene41VarGapFixedInterval_0.tiv, _o4.fdt, _o4.fdx, _o4.fnm, _o4.nvd, _o4.nvm, _o4.si, _o4_Lucene41VarGapFixedInterval_0.doc, _o4_Lucene41VarGapFixedInterval_0.tib, _o4_Lucene41VarGapFixedInterval_0.tiv, _o5.fdt, _o5.fdx, _o5.fnm, _o5.nvd, _o5.nvm, _o5.si, _o5_Lucene41VarGapFixedInterval_0.doc, _o5_Lucene41VarGapFixedInterval_0.tib, _o5_Lucene41VarGapFixedInterval_0.tiv, _o6.fdt, _o6.fdx, _o6.fnm, _o6.nvd, _o6.nvm, _o6.si, _o6_Lucene41VarGapFixedInterval_0.doc, _o6_Lucene41VarGapFixedInterval_0.tib, _o6_Lucene41VarGapFixedInterval_0.tiv, _o7.fdt, _o7.fdx, _o7.fnm, _o7.nvd, _o7.nvm, _o7.si, _o7_Lucene41VarGapFixedInterval_0.doc, _o7_Lucene41VarGapFixedInterval_0.tib, _o7_Lucene41VarGapFixedInterval_0.tiv, _o8.fdt, _o8.fdx, _o8.fnm, _o8.nvd, _o8.nvm, _o8.si, _o8_Lucene41VarGapFixedInterval_0.doc, _o8_Lucene41VarGapFixedInterval_0.tib, _o8_Lucene41VarGapFixedInterval_0.tiv, _o9.fdt, _o9.fdx, _o9.fnm, _o9.nvd, _o9.nvm, _o9.si, _o9_Lucene41VarGapFixedInterval_0.doc, _o9_Lucene41VarGapFixedInterval_0.tib, _o9_Lucene41VarGapFixedInterval_0.tiv, _oa.fdt, _oa.fdx, _oa.fnm, _oa.nvd, _oa.nvm, _oa.si, _oa_Lucene41VarGapFixedInterval_0.doc, _oa_Lucene41VarGapFixedInterval_0.tib, _oa_Lucene41VarGapFixedInterval_0.tiv, _ob.fdt, _ob.fdx, _ob.fnm, _ob.nvd, _ob.nvm, _ob.si, _ob_Lucene41VarGapFixedInterval_0.doc, _ob_Lucene41VarGapFixedInterval_0.tib, _ob_Lucene41VarGapFixedInterval_0.tiv, _oc.fdt, _oc.fdx, _oc.fnm, _oc.nvd, _oc.nvm, _oc.si, _oc_Lucene41VarGapFixedInterval_0.doc, _oc_Lucene41VarGapFixedInterval_0.tib, _oc_Lucene41VarGapFixedInterval_0.tiv, _od.fdt, _od.fdx, _od.fnm, _od.nvd, _od.nvm, _od.si, _od_Lucene41VarGapFixedInterval_0.doc, _od_Lucene41VarGapFixedInterval_0.tib, _od_Lucene41VarGapFixedInterval_0.tiv, _oe.fdt, _oe.fdx, _oe.fnm, _oe.nvd, _oe.nvm, _oe.si, _oe_Lucene41VarGapFixedInterval_0.doc, _oe_Lucene41VarGapFixedInterval_0.tib, _oe_Lucene41VarGapFixedInterval_0.tiv, _of.fdt, _of.fdx, _of.fnm, _of.nvd, _of.nvm, _of.si, _of_Lucene41VarGapFixedInterval_0.doc, _of_Lucene41VarGapFixedInterval_0.tib, _of_Lucene41VarGapFixedInterval_0.tiv, _og.fdt, _og.fdx, _og.fnm, _og.nvd, _og.nvm, _og.si, _og_Lucene41VarGapFixedInterval_0.doc, _og_Lucene41VarGapFixedInterval_0.tib, _og_Lucene41VarGapFixedInterval_0.tiv, _oi.fdt, _oi.fdx, _oi.fnm, _oi.nvd, _oi.nvm, _oi.si, _oi_Lucene41VarGapFixedInterval_0.doc, _oi_Lucene41VarGapFixedInterval_0.tib, _oi_Lucene41VarGapFixedInterval_0.tiv, _oj.fdt, _oj.fdx, _oj.fnm, _oj.nvd, _oj.nvm, _oj.si, _oj_Lucene41VarGapFixedInterval_0.doc, _oj_Lucene41VarGapFixedInterval_0.tib, _oj_Lucene41VarGapFixedInterval_0.tiv, _ok.fdt, _ok.fdx, _ok.fnm, _ok.nvd, _ok.nvm, _ok.si, _ok_Lucene41VarGapFixedInterval_0.doc, _ok_Lucene41VarGapFixedInterval_0.tib, _ok_Lucene41VarGapFixedInterval_0.tiv, _ol.fdt, _ol.fdx, _ol.fnm, _ol.nvd, _ol.nvm, _ol.si, _ol_Lucene41VarGapFixedInterval_0.doc, _ol_Lucene41VarGapFixedInterval_0.tib, _ol_Lucene41VarGapFixedInterval_0.tiv, _om.fdt, _om.fdx, _om.fnm, _om.nvd, _om.nvm, _om.si, _om_Lucene41VarGapFixedInterval_0.doc, _om_Lucene41VarGapFixedInterval_0.tib, _om_Lucene41VarGapFixedInterval_0.tiv, _on.fdt, _on.fdx, _on.fnm, _on.nvd, _on.nvm, _on.si, _on_Lucene41VarGapFixedInterval_0.doc, _on_Lucene41VarGapFixedInterval_0.tib, _on_Lucene41VarGapFixedInterval_0.tiv, segments_2]}]>
	at __randomizedtesting.SeedInfo.seed([E72D0CF5E9237892:C2FA17C5996B7691]:0)
	at org.junit.Assert.fail(Assert.java:93)
	at org.junit.Assert.failNotEquals(Assert.java:647)
	at org.junit.Assert.assertEquals(Assert.java:128)
	at org.junit.Assert.assertEquals(Assert.java:147)
	at org.apache.solr.handler.TestReplicationHandler.doTestReplicateAfterCoreReload(TestReplicationHandler.java:1175)
	at sun.reflect.NativeMethodAccessorImpl.invoke0(Native Method)
	at sun.reflect.NativeMethodAccessorImpl.invoke(NativeMethodAccessorImpl.java:57)
	at sun.reflect.DelegatingMethodAccessorImpl.invoke(DelegatingMethodAccessorImpl.java:43)
	at java.lang.reflect.Method.invoke(Method.java:606)
	at com.carrotsearch.randomizedtesting.RandomizedRunner.invoke(RandomizedRunner.java:1618)
	at com.carrotsearch.randomizedtesting.RandomizedRunner$6.evaluate(RandomizedRunner.java:827)
	at com.carrotsearch.randomizedtesting.RandomizedRunner$7.evaluate(RandomizedRunner.java:863)
	at com.carrotsearch.randomizedtesting.RandomizedRunner$8.evaluate(RandomizedRunner.java:877)
	at com.carrotsearch.randomizedtesting.rules.SystemPropertiesRestoreRule$1.evaluate(SystemPropertiesRestoreRule.java:53)
	at org.apache.lucene.util.TestRuleSetupTeardownChained$1.evaluate(TestRuleSetupTeardownChained.java:50)
	at org.apache.lucene.util.AbstractBeforeAfterRule$1.evaluate(AbstractBeforeAfterRule.java:46)
	at com.carrotsearch.randomizedtesting.rules.SystemPropertiesInvariantRule$1.evaluate(SystemPropertiesInvariantRule.java:55)
	at org.apache.lucene.util.TestRuleThreadAndTestName$1.evaluate(TestRuleThreadAndTestName.java:49)
	at org.apache.lucene.util.TestRuleIgnoreAfterMaxFailures$1.evaluate(TestRuleIgnoreAfterMaxFailures.java:65)
	at org.apache.lucene.util.TestRuleMarkFailure$1.evaluate(TestRuleMarkFailure.java:48)
	at com.carrotsearch.randomizedtesting.rules.StatementAdapter.evaluate(StatementAdapter.java:36)
	at com.carrotsearch.randomizedtesting.ThreadLeakControl$StatementRunner.run(ThreadLeakControl.java:365)
	at com.carrotsearch.randomizedtesting.ThreadLeakControl.forkTimeoutingTask(ThreadLeakControl.java:798)
	at com.carrotsearch.randomizedtesting.ThreadLeakControl$3.evaluate(ThreadLeakControl.java:458)
	at com.carrotsearch.randomizedtesting.RandomizedRunner.runSingleTest(RandomizedRunner.java:836)
	at com.carrotsearch.randomizedtesting.RandomizedRunner$3.evaluate(RandomizedRunner.java:738)
	at com.carrotsearch.randomizedtesting.RandomizedRunner$4.evaluate(RandomizedRunner.java:772)
	at com.carrotsearch.randomizedtesting.RandomizedRunner$5.evaluate(RandomizedRunner.java:783)
	at com.carrotsearch.randomizedtesting.rules.StatementAdapter.evaluate(StatementAdapter.java:36)
	at com.carrotsearch.randomizedtesting.rules.SystemPropertiesRestoreRule$1.evaluate(SystemPropertiesRestoreRule.java:53)
	at org.apache.lucene.util.AbstractBeforeAfterRule$1.evaluate(AbstractBeforeAfterRule.java:46)
	at org.apache.lucene.util.TestRuleStoreClassName$1.evaluate(TestRuleStoreClassName.java:42)
	at com.carrotsearch.randomizedtesting.rules.SystemPropertiesInvariantRule$1.evaluate(SystemPropertiesInvariantRule.java:55)
	at com.carrotsearch.randomizedtesting.rules.NoShadowingOrOverridesOnMethodsRule$1.evaluate(NoShadowingOrOverridesOnMethodsRule.java:39)
	at com.carrotsearch.randomizedtesting.rules.NoShadowingOrOverridesOnMethodsRule$1.evaluate(NoShadowingOrOverridesOnMethodsRule.java:39)
	at com.carrotsearch.randomizedtesting.rules.StatementAdapter.evaluate(StatementAdapter.java:36)
	at com.carrotsearch.randomizedtesting.rules.StatementAdapter.evaluate(StatementAdapter.java:36)
	at com.carrotsearch.randomizedtesting.rules.StatementAdapter.evaluate(StatementAdapter.java:36)
	at org.apache.lucene.util.TestRuleAssertionsRequired$1.evaluate(TestRuleAssertionsRequired.java:43)
	at org.apache.lucene.util.TestRuleMarkFailure$1.evaluate(TestRuleMarkFailure.java:48)
	at org.apache.lucene.util.TestRuleIgnoreAfterMaxFailures$1.evaluate(TestRuleIgnoreAfterMaxFailures.java:65)
	at org.apache.lucene.util.TestRuleIgnoreTestSuites$1.evaluate(TestRuleIgnoreTestSuites.java:55)
	at com.carrotsearch.randomizedtesting.rules.StatementAdapter.evaluate(StatementAdapter.java:36)
	at com.carrotsearch.randomizedtesting.ThreadLeakControl$StatementRunner.run(ThreadLeakControl.java:365)
	at java.lang.Thread.run(Thread.java:745)




Build Log:
[...truncated 12072 lines...]
   [junit4] Suite: org.apache.solr.cloud.FullSolrCloudDistribCmdsTest
   [junit4]   2> Creating dataDir: /usr/home/jenkins/jenkins-slave/workspace/Lucene-Solr-NightlyTests-trunk/solr/build/solr-core/test/J1/temp/solr.cloud.FullSolrCloudDistribCmdsTest-E72D0CF5E9237892-001/init-core-data-001
   [junit4]   2> 614674 T1728 oas.BaseDistributedSearchTestCase.initHostContext Setting hostContext system property: /_am/wj
   [junit4]   2> 614680 T1728 oas.SolrTestCaseJ4.setUp ###Starting testDistribSearch
   [junit4]   2> 614680 T1728 oasc.ZkTestServer.run STARTING ZK TEST SERVER
   [junit4]   1> client port:0.0.0.0/0.0.0.0:0
   [junit4]   2> 614681 T1729 oasc.ZkTestServer$ZKServerMain.runFromConfig Starting server
   [junit4]   2> 614781 T1728 oasc.ZkTestServer.run start zk server on port:22211
   [junit4]   2> 614782 T1728 oascc.SolrZkClient.createZkCredentialsToAddAutomatically Using default ZkCredentialsProvider
   [junit4]   2> 614783 T1728 oascc.ConnectionManager.waitForConnected Waiting for client to connect to ZooKeeper
   [junit4]   2> 614788 T1735 oascc.ConnectionManager.process Watcher org.apache.solr.common.cloud.ConnectionManager@b4593a3 name:ZooKeeperConnection Watcher:127.0.0.1:22211 got event WatchedEvent state:SyncConnected type:None path:null path:null type:None
   [junit4]   2> 614788 T1728 oascc.ConnectionManager.waitForConnected Client is connected to ZooKeeper
   [junit4]   2> 614788 T1728 oascc.SolrZkClient.createZkACLProvider Using default ZkACLProvider
   [junit4]   2> 614789 T1728 oascc.SolrZkClient.makePath makePath: /solr
   [junit4]   2> 614792 T1728 oascc.SolrZkClient.createZkCredentialsToAddAutomatically Using default ZkCredentialsProvider
   [junit4]   2> 614793 T1728 oascc.ConnectionManager.waitForConnected Waiting for client to connect to ZooKeeper
   [junit4]   2> 614794 T1737 oascc.ConnectionManager.process Watcher org.apache.solr.common.cloud.ConnectionManager@718cd5b name:ZooKeeperConnection Watcher:127.0.0.1:22211/solr got event WatchedEvent state:SyncConnected type:None path:null path:null type:None
   [junit4]   2> 614794 T1728 oascc.ConnectionManager.waitForConnected Client is connected to ZooKeeper
   [junit4]   2> 614795 T1728 oascc.SolrZkClient.createZkACLProvider Using default ZkACLProvider
   [junit4]   2> 614795 T1728 oascc.SolrZkClient.makePath makePath: /collections/collection1
   [junit4]   2> 614798 T1728 oascc.SolrZkClient.makePath makePath: /collections/collection1/shards
   [junit4]   2> 614800 T1728 oascc.SolrZkClient.makePath makePath: /collections/control_collection
   [junit4]   2> 614802 T1728 oascc.SolrZkClient.makePath makePath: /collections/control_collection/shards
   [junit4]   2> 614805 T1728 oasc.AbstractZkTestCase.putConfig put /usr/home/jenkins/jenkins-slave/workspace/Lucene-Solr-NightlyTests-trunk/solr/core/src/test-files/solr/collection1/conf/solrconfig-tlog.xml to /configs/conf1/solrconfig.xml
   [junit4]   2> 614805 T1728 oascc.SolrZkClient.makePath makePath: /configs/conf1/solrconfig.xml
   [junit4]   2> 614809 T1728 oasc.AbstractZkTestCase.putConfig put /usr/home/jenkins/jenkins-slave/workspace/Lucene-Solr-NightlyTests-trunk/solr/core/src/test-files/solr/collection1/conf/schema15.xml to /configs/conf1/schema.xml
   [junit4]   2> 614810 T1728 oascc.SolrZkClient.makePath makePath: /configs/conf1/schema.xml
   [junit4]   2> 614813 T1728 oasc.AbstractZkTestCase.putConfig put /usr/home/jenkins/jenkins-slave/workspace/Lucene-Solr-NightlyTests-trunk/solr/core/src/test-files/solr/collection1/conf/solrconfig.snippet.randomindexconfig.xml to /configs/conf1/solrconfig.snippet.randomindexconfig.xml
   [junit4]   2> 614814 T1728 oascc.SolrZkClient.makePath makePath: /configs/conf1/solrconfig.snippet.randomindexconfig.xml
   [junit4]   2> 614816 T1728 oasc.AbstractZkTestCase.putConfig put /usr/home/jenkins/jenkins-slave/workspace/Lucene-Solr-NightlyTests-trunk/solr/core/src/test-files/solr/collection1/conf/stopwords.txt to /configs/conf1/stopwords.txt
   [junit4]   2> 614817 T1728 oascc.SolrZkClient.makePath makePath: /configs/conf1/stopwords.txt
   [junit4]   2> 614820 T1728 oasc.AbstractZkTestCase.putConfig put /usr/home/jenkins/jenkins-slave/workspace/Lucene-Solr-NightlyTests-trunk/solr/core/src/test-files/solr/collection1/conf/protwords.txt to /configs/conf1/protwords.txt
   [junit4]   2> 614820 T1728 oascc.SolrZkClient.makePath makePath: /configs/conf1/protwords.txt
   [junit4]   2> 614823 T1728 oasc.AbstractZkTestCase.putConfig put /usr/home/jenkins/jenkins-slave/workspace/Lucene-Solr-NightlyTests-trunk/solr/core/src/test-files/solr/collection1/conf/currency.xml to /configs/conf1/currency.xml
   [junit4]   2> 614824 T1728 oascc.SolrZkClient.makePath makePath: /configs/conf1/currency.xml
   [junit4]   2> 614826 T1728 oasc.AbstractZkTestCase.putConfig put /usr/home/jenkins/jenkins-slave/workspace/Lucene-Solr-NightlyTests-trunk/solr/core/src/test-files/solr/collection1/conf/enumsConfig.xml to /configs/conf1/enumsConfig.xml
   [junit4]   2> 614827 T1728 oascc.SolrZkClient.makePath makePath: /configs/conf1/enumsConfig.xml
   [junit4]   2> 614829 T1728 oasc.AbstractZkTestCase.putConfig put /usr/home/jenkins/jenkins-slave/workspace/Lucene-Solr-NightlyTests-trunk/solr/core/src/test-files/solr/collection1/conf/open-exchange-rates.json to /configs/conf1/open-exchange-rates.json
   [junit4]   2> 614830 T1728 oascc.SolrZkClient.makePath makePath: /configs/conf1/open-exchange-rates.json
   [junit4]   2> 614833 T1728 oasc.AbstractZkTestCase.putConfig put /usr/home/jenkins/jenkins-slave/workspace/Lucene-Solr-NightlyTests-trunk/solr/core/src/test-files/solr/collection1/conf/mapping-ISOLatin1Accent.txt to /configs/conf1/mapping-ISOLatin1Accent.txt
   [junit4]   2> 614833 T1728 oascc.SolrZkClient.makePath makePath: /configs/conf1/mapping-ISOLatin1Accent.txt
   [junit4]   2> 614836 T1728 oasc.AbstractZkTestCase.putConfig put /usr/home/jenkins/jenkins-slave/workspace/Lucene-Solr-NightlyTests-trunk/solr/core/src/test-files/solr/collection1/conf/old_synonyms.txt to /configs/conf1/old_synonyms.txt
   [junit4]   2> 614837 T1728 oascc.SolrZkClient.makePath makePath: /configs/conf1/old_synonyms.txt
   [junit4]   2> 614839 T1728 oasc.AbstractZkTestCase.putConfig put /usr/home/jenkins/jenkins-slave/workspace/Lucene-Solr-NightlyTests-trunk/solr/core/src/test-files/solr/collection1/conf/synonyms.txt to /configs/conf1/synonyms.txt
   [junit4]   2> 614840 T1728 oascc.SolrZkClient.makePath makePath: /configs/conf1/synonyms.txt
   [junit4]   2> 616355 T1728 oejs.Server.doStart jetty-8.1.10.v20130312
   [junit4]   2> 616360 T1728 oejs.AbstractConnector.doStart Started SocketConnector@127.0.0.1:22214
   [junit4]   2> 616361 T1728 oass.SolrDispatchFilter.init SolrDispatchFilter.init()
   [junit4]   2> 616361 T1728 oasc.SolrResourceLoader.locateSolrHome JNDI not configured for solr (NoInitialContextEx)
   [junit4]   2> 616361 T1728 oasc.SolrResourceLoader.locateSolrHome using system property solr.solr.home: ../../../../../../../../../../../usr/home/jenkins/jenkins-slave/workspace/Lucene-Solr-NightlyTests-trunk/solr/build/solr-core/test/J1/temp/solr.cloud.FullSolrCloudDistribCmdsTest-E72D0CF5E9237892-001/tempDir-002
   [junit4]   2> 616362 T1728 oasc.SolrResourceLoader.<init> new SolrResourceLoader for directory: '../../../../../../../../../../../usr/home/jenkins/jenkins-slave/workspace/Lucene-Solr-NightlyTests-trunk/solr/build/solr-core/test/J1/temp/solr.cloud.FullSolrCloudDistribCmdsTest-E72D0CF5E9237892-001/tempDir-002/'
   [junit4]   2> 616407 T1728 oasc.ConfigSolr.fromFile Loading container configuration from /usr/home/jenkins/jenkins-slave/workspace/Lucene-Solr-NightlyTests-trunk/solr/build/solr-core/test/J1/../../../../../../../../../../../usr/home/jenkins/jenkins-slave/workspace/Lucene-Solr-NightlyTests-trunk/solr/build/solr-core/test/J1/temp/solr.cloud.FullSolrCloudDistribCmdsTest-E72D0CF5E9237892-001/tempDir-002/solr.xml
   [junit4]   2> 616489 T1728 oasc.CoreContainer.<init> New CoreContainer 2035313463
   [junit4]   2> 616490 T1728 oasc.CoreContainer.load Loading cores into CoreContainer [instanceDir=../../../../../../../../../../../usr/home/jenkins/jenkins-slave/workspace/Lucene-Solr-NightlyTests-trunk/solr/build/solr-core/test/J1/temp/solr.cloud.FullSolrCloudDistribCmdsTest-E72D0CF5E9237892-001/tempDir-002/]
   [junit4]   2> 616505 T1728 oashc.HttpShardHandlerFactory.getParameter Setting socketTimeout to: 90000
   [junit4]   2> 616506 T1728 oashc.HttpShardHandlerFactory.getParameter Setting urlScheme to: 
   [junit4]   2> 616506 T1728 oashc.HttpShardHandlerFactory.getParameter Setting connTimeout to: 15000
   [junit4]   2> 616507 T1728 oashc.HttpShardHandlerFactory.getParameter Setting maxConnectionsPerHost to: 20
   [junit4]   2> 616507 T1728 oashc.HttpShardHandlerFactory.getParameter Setting maxConnections to: 10000
   [junit4]   2> 616507 T1728 oashc.HttpShardHandlerFactory.getParameter Setting corePoolSize to: 0
   [junit4]   2> 616508 T1728 oashc.HttpShardHandlerFactory.getParameter Setting maximumPoolSize to: 2147483647
   [junit4]   2> 616508 T1728 oashc.HttpShardHandlerFactory.getParameter Setting maxThreadIdleTime to: 5
   [junit4]   2> 616508 T1728 oashc.HttpShardHandlerFactory.getParameter Setting sizeOfQueue to: -1
   [junit4]   2> 616509 T1728 oashc.HttpShardHandlerFactory.getParameter Setting fairnessPolicy to: false
   [junit4]   2> 616510 T1728 oasu.UpdateShardHandler.<init> Creating UpdateShardHandler HTTP client with params: socketTimeout=340000&connTimeout=45000&retry=false
   [junit4]   2> 616510 T1728 oasl.LogWatcher.createWatcher SLF4J impl is org.slf4j.impl.Log4jLoggerFactory
   [junit4]   2> 616510 T1728 oasl.LogWatcher.newRegisteredLogWatcher Registering Log Listener [Log4j (org.slf4j.impl.Log4jLoggerFactory)]
   [junit4]   2> 616511 T1728 oasc.CoreContainer.load Host Name: 127.0.0.1
   [junit4]   2> 616511 T1728 oasc.ZkContainer.initZooKeeper Zookeeper client=127.0.0.1:22211/solr
   [junit4]   2> 616512 T1728 oasc.ZkController.checkChrootPath zkHost includes chroot
   [junit4]   2> 616512 T1728 oascc.SolrZkClient.createZkCredentialsToAddAutomatically Using default ZkCredentialsProvider
   [junit4]   2> 616513 T1728 oascc.ConnectionManager.waitForConnected Waiting for client to connect to ZooKeeper
   [junit4]   2> 616516 T1748 oascc.ConnectionManager.process Watcher org.apache.solr.common.cloud.ConnectionManager@4cad9405 name:ZooKeeperConnection Watcher:127.0.0.1:22211 got event WatchedEvent state:SyncConnected type:None path:null path:null type:None
   [junit4]   2> 616516 T1728 oascc.ConnectionManager.waitForConnected Client is connected to ZooKeeper
   [junit4]   2> 616517 T1728 oascc.SolrZkClient.createZkACLProvider Using default ZkACLProvider
   [junit4]   2> 616519 T1728 oascc.ConnectionManager.waitForConnected Waiting for client to connect to ZooKeeper
   [junit4]   2> 616520 T1750 oascc.ConnectionManager.process Watcher org.apache.solr.common.cloud.ConnectionManager@48933e47 name:ZooKeeperConnection Watcher:127.0.0.1:22211/solr got event WatchedEvent state:SyncConnected type:None path:null path:null type:None
   [junit4]   2> 616521 T1728 oascc.ConnectionManager.waitForConnected Client is connected to ZooKeeper
   [junit4]   2> 616522 T1728 oascc.SolrZkClient.makePath makePath: /overseer/queue
   [junit4]   2> 616525 T1728 oascc.SolrZkClient.makePath makePath: /overseer/collection-queue-work
   [junit4]   2> 616528 T1728 oascc.SolrZkClient.makePath makePath: /overseer/collection-map-running
   [junit4]   2> 616531 T1728 oascc.SolrZkClient.makePath makePath: /overseer/collection-map-completed
   [junit4]   2> 616534 T1728 oascc.SolrZkClient.makePath makePath: /overseer/collection-map-failure
   [junit4]   2> 616537 T1728 oascc.SolrZkClient.makePath makePath: /live_nodes
   [junit4]   2> 616539 T1728 oasc.ZkController.createEphemeralLiveNode Register node as live in ZooKeeper:/live_nodes/127.0.0.1:22214__am%2Fwj
   [junit4]   2> 616540 T1728 oascc.SolrZkClient.makePath makePath: /live_nodes/127.0.0.1:22214__am%2Fwj
   [junit4]   2> 616543 T1728 oascc.SolrZkClient.makePath makePath: /overseer_elect
   [junit4]   2> 616545 T1728 oascc.SolrZkClient.makePath makePath: /overseer_elect/election
   [junit4]   2> 616547 T1728 oasc.Overseer.close Overseer (id=null) closing
   [junit4]   2> 616549 T1728 oasc.OverseerElectionContext.runLeaderProcess I am going to be the leader 127.0.0.1:22214__am%2Fwj
   [junit4]   2> 616549 T1728 oascc.SolrZkClient.makePath makePath: /overseer_elect/leader
   [junit4]   2> 616552 T1728 oasc.Overseer.start Overseer (id=92627837701062659-127.0.0.1:22214__am%2Fwj-n_0000000000) starting
   [junit4]   2> 616554 T1728 oascc.SolrZkClient.makePath makePath: /overseer/queue-work
   [junit4]   2> 616564 T1728 oasc.OverseerAutoReplicaFailoverThread.<init> Starting OverseerAutoReplicaFailoverThread autoReplicaFailoverWorkLoopDelay=10000 autoReplicaFailoverWaitAfterExpiration=30000 autoReplicaFailoverBadNodeExpiration=60000
   [junit4]   2> 616564 T1752 oasc.OverseerCollectionProcessor.run Process current queue of collection creations
   [junit4]   2> 616565 T1728 oascc.SolrZkClient.makePath makePath: /clusterstate.json
   [junit4]   2> 616567 T1728 oascc.SolrZkClient.makePath makePath: /aliases.json
   [junit4]   2> 616569 T1728 oascc.ZkStateReader.createClusterStateWatchersAndUpdate Updating cluster state from ZooKeeper... 
   [junit4]   2> 616573 T1751 oasc.Overseer$ClusterStateUpdater.run Starting to work on the main queue
   [junit4]   2> 616579 T1754 oasc.ZkController.publish publishing core=collection1 state=down collection=control_collection
   [junit4]   2> 616579 T1754 oasc.ZkController.publish numShards not found on descriptor - reading it from system property
   [junit4]   2> 616580 T1754 oasc.ZkController.waitForCoreNodeName look for our core node name
   [junit4]   2> 616581 T1755 oasc.DistributedQueue$LatchChildWatcher.process LatchChildWatcher fired on path: /overseer/queue state: SyncConnected type NodeChildrenChanged
   [junit4]   2> 616584 T1751 oasc.Overseer$ClusterStateUpdater.updateState Update state numShards=1 message={
   [junit4]   2> 	  "base_url":"http://127.0.0.1:22214/_am/wj",
   [junit4]   2> 	  "numShards":"1",
   [junit4]   2> 	  "node_name":"127.0.0.1:22214__am%2Fwj",
   [junit4]   2> 	  "roles":null,
   [junit4]   2> 	  "shard":null,
   [junit4]   2> 	  "operation":"state",
   [junit4]   2> 	  "collection":"control_collection",
   [junit4]   2> 	  "core":"collection1",
   [junit4]   2> 	  "state":"down"}
   [junit4]   2> 616584 T1751 oasc.Overseer$ClusterStateUpdater.createCollection Create collection control_collection with shards [shard1]
   [junit4]   2> 616585 T1751 oasc.Overseer$ClusterStateUpdater.createCollection state version control_collection 1
   [junit4]   2> 616585 T1751 oasc.Overseer$ClusterStateUpdater.updateState Assigning new node to shard shard=shard1
   [junit4]   2> 616588 T1755 oascc.ZkStateReader$2.process A cluster state change: WatchedEvent state:SyncConnected type:NodeDataChanged path:/clusterstate.json, has occurred - updating... (live nodes size: 1)
   [junit4]   2> 617581 T1754 oasc.ZkController.waitForShardId waiting to find shard id in clusterstate for collection1
   [junit4]   2> 617582 T1754 oasc.ZkController.createCollectionZkNode Check for collection zkNode:control_collection
   [junit4]   2> 617583 T1754 oasc.ZkController.createCollectionZkNode Collection zkNode exists
   [junit4]   2> 617583 T1754 oascc.ZkStateReader.readConfigName Load collection config from:/collections/control_collection
   [junit4]   2> 617584 T1754 oascc.ZkStateReader.readConfigName path=/collections/control_collection configName=conf1 specified config exists in ZooKeeper
   [junit4]   2> 617584 T1754 oasc.SolrResourceLoader.<init> new SolrResourceLoader for directory: '../../../../../../../../../../../usr/home/jenkins/jenkins-slave/workspace/Lucene-Solr-NightlyTests-trunk/solr/build/solr-core/test/J1/temp/solr.cloud.FullSolrCloudDistribCmdsTest-E72D0CF5E9237892-001/tempDir-002/collection1/'
   [junit4]   2> 617586 T1754 oasc.SolrResourceLoader.replaceClassLoader Adding 'file:/usr/home/jenkins/jenkins-slave/workspace/Lucene-Solr-NightlyTests-trunk/solr/build/solr-core/test/J1/temp/solr.cloud.FullSolrCloudDistribCmdsTest-E72D0CF5E9237892-001/tempDir-002/collection1/lib/classes/' to classloader
   [junit4]   2> 617587 T1754 oasc.SolrResourceLoader.replaceClassLoader Adding 'file:/usr/home/jenkins/jenkins-slave/workspace/Lucene-Solr-NightlyTests-trunk/solr/build/solr-core/test/J1/temp/solr.cloud.FullSolrCloudDistribCmdsTest-E72D0CF5E9237892-001/tempDir-002/collection1/lib/README' to classloader
   [junit4]   2> 617588 T1754 oasc.SolrResourceLoader.replaceClassLoader Adding 'file:/usr/home/jenkins/jenkins-slave/workspace/Lucene-Solr-NightlyTests-trunk/solr/build/solr-core/test/J1/temp/solr.cloud.FullSolrCloudDistribCmdsTest-E72D0CF5E9237892-001/tempDir-002/collection1/lib/.svn/' to classloader
   [junit4]   2> 617653 T1754 oasc.SolrConfig.<init> Using Lucene MatchVersion: 6.0.0
   [junit4]   2> 617700 T1754 oasc.SolrConfig.<init> Loaded SolrConfig: solrconfig.xml
   [junit4]   2> 617701 T1754 oass.IndexSchema.readSchema Reading Solr Schema from schema.xml
   [junit4]   2> 617711 T1754 oass.IndexSchema.readSchema [collection1] Schema name=test
   [junit4]   2> 618059 T1754 oass.IndexSchema.readSchema default search field in schema is text
   [junit4]   2> 618062 T1754 oass.IndexSchema.readSchema unique key field: id
   [junit4]   2> 618064 T1754 oass.FileExchangeRateProvider.reload Reloading exchange rates from file currency.xml
   [junit4]   2> 618069 T1754 oass.FileExchangeRateProvider.reload Reloading exchange rates from file currency.xml
   [junit4]   2> 618098 T1754 oasc.CoreContainer.create Creating SolrCore 'collection1' using configuration from collection control_collection
   [junit4]   2> 618098 T1754 oasc.SolrCore.initDirectoryFactory org.apache.solr.core.MockDirectoryFactory
   [junit4]   2> 618098 T1754 oasc.SolrCore.<init> [collection1] Opening new SolrCore at ../../../../../../../../../../../usr/home/jenkins/jenkins-slave/workspace/Lucene-Solr-NightlyTests-trunk/solr/build/solr-core/test/J1/temp/solr.cloud.FullSolrCloudDistribCmdsTest-E72D0CF5E9237892-001/tempDir-002/collection1/, dataDir=/usr/home/jenkins/jenkins-slave/workspace/Lucene-Solr-NightlyTests-trunk/solr/build/solr-core/test/J1/temp/solr.cloud.FullSolrCloudDistribCmdsTest-E72D0CF5E9237892-001/tempDir-001/control/data/
   [junit4]   2> 618099 T1754 oasc.JmxMonitoredMap.<init> JMX monitoring is enabled. Adding Solr mbeans to JMX Server: com.sun.jmx.mbeanserver.JmxMBeanServer@796c75b1
   [junit4]   2> 618099 T1754 oasc.CachingDirectoryFactory.get return new directory for /usr/home/jenkins/jenkins-slave/workspace/Lucene-Solr-NightlyTests-trunk/solr/build/solr-core/test/J1/temp/solr.cloud.FullSolrCloudDistribCmdsTest-E72D0CF5E9237892-001/tempDir-001/control/data
   [junit4]   2> 618100 T1754 oasc.SolrCore.getNewIndexDir New index directory detected: old=null new=/usr/home/jenkins/jenkins-slave/workspace/Lucene-Solr-NightlyTests-trunk/solr/build/solr-core/test/J1/temp/solr.cloud.FullSolrCloudDistribCmdsTest-E72D0CF5E9237892-001/tempDir-001/control/data/index/
   [junit4]   2> 618100 T1754 oasc.SolrCore.initIndex WARN [collection1] Solr index directory '/usr/home/jenkins/jenkins-slave/workspace/Lucene-Solr-NightlyTests-trunk/solr/build/solr-core/test/J1/temp/solr.cloud.FullSolrCloudDistribCmdsTest-E72D0CF5E9237892-001/tempDir-001/control/data/index' doesn't exist. Creating new index...
   [junit4]   2> 618101 T1754 oasc.CachingDirectoryFactory.get return new directory for /usr/home/jenkins/jenkins-slave/workspace/Lucene-Solr-NightlyTests-trunk/solr/build/solr-core/test/J1/temp/solr.cloud.FullSolrCloudDistribCmdsTest-E72D0CF5E9237892-001/tempDir-001/control/data/index
   [junit4]   2> 618101 T1754 oasu.RandomMergePolicy.<init> RandomMergePolicy wrapping class org.apache.lucene.index.TieredMergePolicy: [TieredMergePolicy: maxMergeAtOnce=20, maxMergeAtOnceExplicit=29, maxMergedSegmentMB=19.408203125, floorSegmentMB=1.2998046875, forceMergeDeletesPctAllowed=9.848782905084622, segmentsPerTier=48.0, maxCFSSegmentSizeMB=8.796093022207999E12, noCFSRatio=1.0
   [junit4]   2> 618102 T1754 oasc.SolrDeletionPolicy.onCommit SolrDeletionPolicy.onCommit: commits: num=1
   [junit4]   2> 		commit{dir=MockDirectoryWrapper(NRTCachingDirectory(RAMDirectory(id=lucene-18feae1d); maxCacheMB=0.4326171875 maxMergeSizeMB=0.2724609375)),segFN=segments_1,generation=1}
   [junit4]   2> 618102 T1754 oasc.SolrDeletionPolicy.updateCommits newest commit generation = 1
   [junit4]   2> 618107 T1754 oasup.UpdateRequestProcessorChain.init creating updateRequestProcessorChain "nodistrib"
   [junit4]   2> 618108 T1754 oasup.UpdateRequestProcessorChain.init creating updateRequestProcessorChain "dedupe"
   [junit4]   2> 618108 T1754 oasup.UpdateRequestProcessorChain.init inserting DistributedUpdateProcessorFactory into updateRequestProcessorChain "dedupe"
   [junit4]   2> 618109 T1754 oasup.UpdateRequestProcessorChain.init creating updateRequestProcessorChain "stored_sig"
   [junit4]   2> 618109 T1754 oasup.UpdateRequestProcessorChain.init inserting DistributedUpdateProcessorFactory into updateRequestProcessorChain "stored_sig"
   [junit4]   2> 618109 T1754 oasup.UpdateRequestProcessorChain.init creating updateRequestProcessorChain "distrib-dup-test-chain-explicit"
   [junit4]   2> 618110 T1754 oasup.UpdateRequestProcessorChain.init creating updateRequestProcessorChain "distrib-dup-test-chain-implicit"
   [junit4]   2> 618110 T1754 oasup.UpdateRequestProcessorChain.init inserting DistributedUpdateProcessorFactory into updateRequestProcessorChain "distrib-dup-test-chain-implicit"
   [junit4]   2> 618110 T1754 oasc.SolrCore.loadUpdateProcessorChains no updateRequestProcessorChain defined as default, creating implicit default
   [junit4]   2> 618111 T1754 oasc.RequestHandlers.initHandlersFromConfig created /update/csv: org.apache.solr.handler.UpdateRequestHandler
   [junit4]   2> 618112 T1754 oasc.RequestHandlers.initHandlersFromConfig created /update/json: org.apache.solr.handler.UpdateRequestHandler
   [junit4]   2> 618112 T1754 oasc.RequestHandlers.initHandlersFromConfig created /update/json/docs: org.apache.solr.handler.UpdateRequestHandler
   [junit4]   2> 618113 T1754 oasc.RequestHandlers.initHandlersFromConfig created standard: solr.StandardRequestHandler
   [junit4]   2> 618113 T1754 oasc.RequestHandlers.initHandlersFromConfig created /get: solr.RealTimeGetHandler
   [junit4]   2> 618113 T1754 oasc.RequestHandlers.initHandlersFromConfig adding lazy requestHandler: solr.ReplicationHandler
   [junit4]   2> 618114 T1754 oasc.RequestHandlers.initHandlersFromConfig created /replication: solr.ReplicationHandler
   [junit4]   2> 618114 T1754 oasc.RequestHandlers.initHandlersFromConfig created /update: solr.UpdateRequestHandler
   [junit4]   2> 618115 T1754 oasc.RequestHandlers.initHandlersFromConfig created /admin/: org.apache.solr.handler.admin.AdminHandlers
   [junit4]   2> 618115 T1754 oasc.RequestHandlers.initHandlersFromConfig created /admin/file: solr.admin.ShowFileRequestHandler
   [junit4]   2> 618116 T1754 oasc.RequestHandlers.initHandlersFromConfig created /admin/fileedit: solr.admin.EditFileRequestHandler
   [junit4]   2> 618135 T1754 oashl.XMLLoader.init xsltCacheLifetimeSeconds=60
   [junit4]   2> 618137 T1754 oashl.XMLLoader.init xsltCacheLifetimeSeconds=60
   [junit4]   2> 618139 T1754 oashl.XMLLoader.init xsltCacheLifetimeSeconds=60
   [junit4]   2> 618140 T1754 oashl.XMLLoader.init xsltCacheLifetimeSeconds=60
   [junit4]   2> 618146 T1754 oasu.CommitTracker.<init> Hard AutoCommit: disabled
   [junit4]   2> 618146 T1754 oasu.CommitTracker.<init> Soft AutoCommit: disabled
   [junit4]   2> 618147 T1754 oasu.RandomMergePolicy.<init> RandomMergePolicy wrapping class org.apache.lucene.index.MockRandomMergePolicy: org.apache.lucene.index.MockRandomMergePolicy@ec4d331
   [junit4]   2> 618148 T1754 oasc.SolrDeletionPolicy.onInit SolrDeletionPolicy.onInit: commits: num=1
   [junit4]   2> 		commit{dir=MockDirectoryWrapper(NRTCachingDirectory(RAMDirectory(id=lucene-18feae1d); maxCacheMB=0.4326171875 maxMergeSizeMB=0.2724609375)),segFN=segments_1,generation=1}
   [junit4]   2> 618148 T1754 oasc.SolrDeletionPolicy.updateCommits newest commit generation = 1
   [junit4]   2> 618148 T1754 oass.SolrIndexSearcher.<init> Opening Searcher@189c0576[collection1] main
   [junit4]   2> 618149 T1754 oascc.ZkStateReader.readConfigName Load collection config from:/collections/control_collection
   [junit4]   2> 618150 T1754 oascc.ZkStateReader.readConfigName path=/collections/control_collection configName=conf1 specified config exists in ZooKeeper
   [junit4]   2> 618150 T1754 oasr.ManagedResourceStorage.newStorageIO Setting up ZooKeeper-based storage for the RestManager with znodeBase: /configs/conf1
   [junit4]   2> 618151 T1754 oasr.ManagedResourceStorage$ZooKeeperStorageIO.configure Configured ZooKeeperStorageIO with znodeBase: /configs/conf1
   [junit4]   2> 618151 T1754 oasr.RestManager.init Initializing RestManager with initArgs: {}
   [junit4]   2> 618151 T1754 oasr.ManagedResourceStorage.load Reading _rest_managed.json using ZooKeeperStorageIO:path=/configs/conf1
   [junit4]   2> 618152 T1754 oasr.ManagedResourceStorage$ZooKeeperStorageIO.openInputStream No data found for znode /configs/conf1/_rest_managed.json
   [junit4]   2> 618152 T1754 oasr.ManagedResourceStorage.load Loaded null at path _rest_managed.json using ZooKeeperStorageIO:path=/configs/conf1
   [junit4]   2> 618153 T1754 oascc.SolrZkClient.makePath makePath: /configs/conf1/_rest_managed.json
   [junit4]   2> 618155 T1754 oasr.ManagedResourceStorage$ZooKeeperStorageIO$1.close Wrote 38 bytes to new znode /configs/conf1/_rest_managed.json
   [junit4]   2> 618155 T1754 oasr.ManagedResourceStorage$JsonStorage.store Saved JSON object to path _rest_managed.json using ZooKeeperStorageIO:path=/configs/conf1
   [junit4]   2> 618156 T1754 oasr.RestManager.init Initializing 0 registered ManagedResources
   [junit4]   2> 618160 T1756 oasc.SolrCore.registerSearcher [collection1] Registered new searcher Searcher@189c0576[collection1] main{ExitableDirectoryReader(UninvertingDirectoryReader())}
   [junit4]   2> 618164 T1754 oasc.CoreContainer.registerCore registering core: collection1
   [junit4]   2> 618165 T1759 oasc.ZkController.register Register replica - core:collection1 address:http://127.0.0.1:22214/_am/wj collection:control_collection shard:shard1
   [junit4]   2> 618166 T1728 oass.SolrDispatchFilter.init user.dir=/usr/home/jenkins/jenkins-slave/workspace/Lucene-Solr-NightlyTests-trunk/solr/build/solr-core/test/J1
   [junit4]   2> 618166 T1728 oass.SolrDispatchFilter.init SolrDispatchFilter.init() done
   [junit4]   2> 618167 T1759 oascc.SolrZkClient.makePath makePath: /collections/control_collection/leader_elect/shard1/election
   [junit4]   2> 618167 T1728 oascc.SolrZkClient.createZkCredentialsToAddAutomatically Using default ZkCredentialsProvider
   [junit4]   2> 618168 T1728 oascc.ConnectionManager.waitForConnected Waiting for client to connect to ZooKeeper
   [junit4]   2> 618170 T1761 oascc.ConnectionManager.process Watcher org.apache.solr.common.cloud.ConnectionManager@450858b9 name:ZooKeeperConnection Watcher:127.0.0.1:22211/solr got event WatchedEvent state:SyncConnected type:None path:null path:null type:None
   [junit4]   2> 618170 T1728 oascc.ConnectionManager.waitForConnected Client is connected to ZooKeeper
   [junit4]   2> 618170 T1728 oascc.SolrZkClient.createZkACLProvider Using default ZkACLProvider
   [junit4]   2> 618171 T1728 oascc.ZkStateReader.createClusterStateWatchersAndUpdate Updating cluster state from ZooKeeper... 
   [junit4]   2> 618174 T1759 oasc.ShardLeaderElectionContext.runLeaderProcess Running the leader process for shard shard1
   [junit4]   2> 618175 T1728 oasc.ChaosMonkey.monkeyLog monkey: init - expire sessions:false cause connection loss:false
   [junit4]   2> 618176 T1755 oasc.DistributedQueue$LatchChildWatcher.process LatchChildWatcher fired on path: /overseer/queue state: SyncConnected type NodeChildrenChanged
   [junit4]   2> 618176 T1728 oasc.AbstractFullDistribZkTestBase.createJettys Creating collection1 with stateFormat=2
   [junit4]   2> 618176 T1759 oasc.ShardLeaderElectionContext.waitForReplicasToComeUp Enough replicas found to continue.
   [junit4]   2> 618177 T1728 oascc.SolrZkClient.createZkCredentialsToAddAutomatically Using default ZkCredentialsProvider
   [junit4]   2> 618177 T1759 oasc.ShardLeaderElectionContext.runLeaderProcess I may be the new leader - try and sync
   [junit4]   2> ASYNC  NEW_CORE C327 name=collection1 org.apache.solr.core.SolrCore@24478b4 url=http://127.0.0.1:22214/_am/wj/collection1 node=127.0.0.1:22214__am%2Fwj C327_STATE=coll:control_collection core:collection1 props:{base_url=http://127.0.0.1:22214/_am/wj, node_name=127.0.0.1:22214__am%2Fwj, core=collection1, state=down}
   [junit4]   2> 618177 T1759 C327 P22214 oasc.SyncStrategy.sync Sync replicas to http://127.0.0.1:22214/_am/wj/collection1/
   [junit4]   2> 618177 T1728 oascc.ConnectionManager.waitForConnected Waiting for client to connect to ZooKeeper
   [junit4]   2> 618178 T1759 C327 P22214 oasc.SyncStrategy.syncReplicas Sync Success - now sync replicas to me
   [junit4]   2> 618178 T1759 C327 P22214 oasc.SyncStrategy.syncToMe http://127.0.0.1:22214/_am/wj/collection1/ has no replicas
   [junit4]   2> 618179 T1759 oasc.ShardLeaderElectionContext.runLeaderProcess I am the new leader: http://127.0.0.1:22214/_am/wj/collection1/ shard1
   [junit4]   2> 618179 T1763 oascc.ConnectionManager.process Watcher org.apache.solr.common.cloud.ConnectionManager@69b38eb8 name:ZooKeeperConnection Watcher:127.0.0.1:22211/solr got event WatchedEvent state:SyncConnected type:None path:null path:null type:None
   [junit4]   2> 618179 T1759 oascc.SolrZkClient.makePath makePath: /collections/control_collection/leaders/shard1
   [junit4]   2> 618179 T1728 oascc.ConnectionManager.waitForConnected Client is connected to ZooKeeper
   [junit4]   2> 618180 T1728 oascc.SolrZkClient.createZkACLProvider Using default ZkACLProvider
   [junit4]   2> 618184 T1755 oascc.ZkStateReader$2.process A cluster state change: WatchedEvent state:SyncConnected type:NodeDataChanged path:/clusterstate.json, has occurred - updating... (live nodes size: 1)
   [junit4]   2> 618184 T1764 oascc.ZkStateReader$2.process A cluster state change: WatchedEvent state:SyncConnected type:NodeDataChanged path:/clusterstate.json, has occurred - updating... (live nodes size: 1)
   [junit4]   2> 618190 T1751 oasc.Overseer$ClusterStateUpdater.buildCollection building a new collection: collection1
   [junit4]   2> 618190 T1751 oasc.Overseer$ClusterStateUpdater.createCollection Create collection collection1 with shards [shard1, shard2, shard3]
   [junit4]   2> 618190 T1751 oasc.Overseer$ClusterStateUpdater.createCollection state version collection1 2
   [junit4]   2> 618193 T1755 oasc.DistributedQueue$LatchChildWatcher.process LatchChildWatcher fired on path: /overseer/queue state: SyncConnected type NodeChildrenChanged
   [junit4]   2> 618193 T1751 oasc.Overseer$ClusterStateUpdater.updateZkStates going to create_collection /collections/collection1/state.json
   [junit4]   2> 618195 T1755 oascc.ZkStateReader$2.process A cluster state change: WatchedEvent state:SyncConnected type:NodeDataChanged path:/clusterstate.json, has occurred - updating... (live nodes size: 1)
   [junit4]   2> 618195 T1764 oascc.ZkStateReader$2.process A cluster state change: WatchedEvent state:SyncConnected type:NodeDataChanged path:/clusterstate.json, has occurred - updating... (live nodes size: 1)
   [junit4]   2> 618203 T1755 oasc.DistributedQueue$LatchChildWatcher.process LatchChildWatcher fired on path: /overseer/queue state: SyncConnected type NodeChildrenChanged
   [junit4]   2> 618204 T1755 oascc.ZkStateReader$2.process A cluster state change: WatchedEvent state:SyncConnected type:NodeDataChanged path:/clusterstate.json, has occurred - updating... (live nodes size: 1)
   [junit4]   2> 618204 T1764 oascc.ZkStateReader$2.process A cluster state change: WatchedEvent state:SyncConnected type:NodeDataChanged path:/clusterstate.json, has occurred - updating... (live nodes size: 1)
   [junit4]   2> 618237 T1759 oasc.ZkController.register We are http://127.0.0.1:22214/_am/wj/collection1/ and leader is http://127.0.0.1:22214/_am/wj/collection1/
   [junit4]   2> 618238 T1759 oasc.ZkController.register No LogReplay needed for core=collection1 baseURL=http://127.0.0.1:22214/_am/wj
   [junit4]   2> 618238 T1759 oasc.ZkController.checkRecovery I am the leader, no recovery necessary
   [junit4]   2> 618238 T1759 oasc.ZkController.publish publishing core=collection1 state=active collection=control_collection
   [junit4]   2> 618238 T1759 oasc.ZkController.publish numShards not found on descriptor - reading it from system property
   [junit4]   2> 618240 T1755 oasc.DistributedQueue$LatchChildWatcher.process LatchChildWatcher fired on path: /overseer/queue state: SyncConnected type NodeChildrenChanged
   [junit4]   2> 618244 T1751 oasc.Overseer$ClusterStateUpdater.updateState Update state numShards=3 message={
   [junit4]   2> 	  "base_url":"http://127.0.0.1:22214/_am/wj",
   [junit4]   2> 	  "numShards":"3",
   [junit4]   2> 	  "node_name":"127.0.0.1:22214__am%2Fwj",
   [junit4]   2> 	  "core_node_name":"core_node1",
   [junit4]   2> 	  "roles":null,
   [junit4]   2> 	  "shard":"shard1",
   [junit4]   2> 	  "operation":"state",
   [junit4]   2> 	  "collection":"control_collection",
   [junit4]   2> 	  "core":"collection1",
   [junit4]   2> 	  "state":"active"}
   [junit4]   2> 618348 T1755 oascc.ZkStateReader$2.process A cluster state change: WatchedEvent state:SyncConnected type:NodeDataChanged path:/clusterstate.json, has occurred - updating... (live nodes size: 1)
   [junit4]   2> 618348 T1764 oascc.ZkStateReader$2.process A cluster state change: WatchedEvent state:SyncConnected type:NodeDataChanged path:/clusterstate.json, has occurred - updating... (live nodes size: 1)
   [junit4]   2> 619566 T1728 oasc.AbstractFullDistribZkTestBase.createJettys create jetty 1
   [junit4]   2> 619567 T1728 oejs.Server.doStart jetty-8.1.10.v20130312
   [junit4]   2> 619569 T1728 oejs.AbstractConnector.doStart Started SocketConnector@127.0.0.1:22219
   [junit4]   2> 619570 T1728 oass.SolrDispatchFilter.init SolrDispatchFilter.init()
   [junit4]   2> 619570 T1728 oasc.SolrResourceLoader.locateSolrHome JNDI not configured for solr (NoInitialContextEx)
   [junit4]   2> 619570 T1728 oasc.SolrResourceLoader.locateSolrHome using system property solr.solr.home: /usr/home/jenkins/jenkins-slave/workspace/Lucene-Solr-NightlyTests-trunk/solr/build/solr-core/test/J1/temp/solr.cloud.FullSolrCloudDistribCmdsTest-E72D0CF5E9237892-001/tempDir-003
   [junit4]   2> 619570 T1728 oasc.SolrResourceLoader.<init> new SolrResourceLoader for directory: '/usr/home/jenkins/jenkins-slave/workspace/Lucene-Solr-NightlyTests-trunk/solr/build/solr-core/test/J1/temp/solr.cloud.FullSolrCloudDistribCmdsTest-E72D0CF5E9237892-001/tempDir-003/'
   [junit4]   2> 619600 T1728 oasc.ConfigSolr.fromFile Loading container configuration from /usr/home/jenkins/jenkins-slave/workspace/Lucene-Solr-NightlyTests-trunk/solr/build/solr-core/test/J1/temp/solr.cloud.FullSolrCloudDistribCmdsTest-E72D0CF5E9237892-001/tempDir-003/solr.xml
   [junit4]   2> 619654 T1728 oasc.CoreContainer.<init> New CoreContainer 1170317028
   [junit4]   2> 619654 T1728 oasc.CoreContainer.load Loading cores into CoreContainer [instanceDir=/usr/home/jenkins/jenkins-slave/workspace/Lucene-Solr-NightlyTests-trunk/solr/build/solr-core/test/J1/temp/solr.cloud.FullSolrCloudDistribCmdsTest-E72D0CF5E9237892-001/tempDir-003/]
   [junit4]   2> 619655 T1728 oashc.HttpShardHandlerFactory.getParameter Setting socketTimeout to: 90000
   [junit4]   2> 619655 T1728 oashc.HttpShardHandlerFactory.getParameter Setting urlScheme to: 
   [junit4]   2> 619656 T1728 oashc.HttpShardHandlerFactory.getParameter Setting connTimeout to: 15000
   [junit4]   2> 619656 T1728 oashc.HttpShardHandlerFactory.getParameter Setting maxConnectionsPerHost to: 20
   [junit4]   2> 619656 T1728 oashc.HttpShardHandlerFactory.getParameter Setting maxConnections to: 10000
   [junit4]   2> 619656 T1728 oashc.HttpShardHandlerFactory.getParameter Setting corePoolSize to: 0
   [junit4]   2> 619657 T1728 oashc.HttpShardHandlerFactory.getParameter Setting maximumPoolSize to: 2147483647
   [junit4]   2> 619657 T1728 oashc.HttpShardHandlerFactory.getParameter Setting maxThreadIdleTime to: 5
   [junit4]   2> 619657 T1728 oashc.HttpShardHandlerFactory.getParameter Setting sizeOfQueue to: -1
   [junit4]   2> 619657 T1728 oashc.HttpShardHandlerFactory.getParameter Setting fairnessPolicy to: false
   [junit4]   2> 619658 T1728 oasu.UpdateShardHandler.<init> Creating UpdateShardHandler HTTP client with params: socketTimeout=340000&connTimeout=45000&retry=false
   [junit4]   2> 619658 T1728 oasl.LogWatcher.createWatcher SLF4J impl is org.slf4j.impl.Log4jLoggerFactory
   [junit4]   2> 619658 T1728 oasl.LogWatcher.newRegisteredLogWatcher Registering Log Listener [Log4j (org.slf4j.impl.Log4jLoggerFactory)]
   [junit4]   2> 619659 T1728 oasc.CoreContainer.load Host Name: 127.0.0.1
   [junit4]   2> 619659 T1728 oasc.ZkContainer.initZooKeeper Zookeeper client=127.0.0.1:22211/solr
   [junit4]   2> 619659 T1728 oasc.ZkController.checkChrootPath zkHost includes chroot
   [junit4]   2> 619659 T1728 oascc.SolrZkClient.createZkCredentialsToAddAutomatically Using default ZkCredentialsProvider
   [junit4]   2> 619660 T1728 oascc.ConnectionManager.waitForConnected Waiting for client to connect to ZooKeeper
   [junit4]   2> 619662 T1775 oascc.ConnectionManager.process Watcher org.apache.solr.common.cloud.ConnectionManager@2aa6ae83 name:ZooKeeperConnection Watcher:127.0.0.1:22211 got event WatchedEvent state:SyncConnected type:None path:null path:null type:None
   [junit4]   2> 619662 T1728 oascc.ConnectionManager.waitForConnected Client is connected to ZooKeeper
   [junit4]   2> 619663 T1728 oascc.SolrZkClient.createZkACLProvider Using default ZkACLProvider
   [junit4]   2> 619664 T1728 oascc.ConnectionManager.waitForConnected Waiting for client to connect to ZooKeeper
   [junit4]   2> 619665 T1777 oascc.ConnectionManager.process Watcher org.apache.solr.common.cloud.ConnectionManager@1dd9fd0e name:ZooKeeperConnection Watcher:127.0.0.1:22211/solr got event WatchedEvent state:SyncConnected type:None path:null path:null type:None
   [junit4]   2> 619666 T1728 oascc.ConnectionManager.waitForConnected Client is connected to ZooKeeper
   [junit4]   2> 619671 T1728 oascc.ZkStateReader.createClusterStateWatchersAndUpdate Updating cluster state from ZooKeeper... 
   [junit4]   2> 620677 T1728 oasc.ZkController.createEphemeralLiveNode Register node as live in ZooKeeper:/live_nodes/127.0.0.1:22219__am%2Fwj
   [junit4]   2> 620678 T1728 oascc.SolrZkClient.makePath makePath: /live_nodes/127.0.0.1:22219__am%2Fwj
   [junit4]   2> 620683 T1728 oasc.Overseer.close Overseer (id=null) closing
   [junit4]   2> 620693 T1779 oasc.ZkController.publish publishing core=collection1 state=down collection=collection1
   [junit4]   2> 620693 T1779 oasc.ZkController.publish numShards not found on descriptor - reading it from system property
   [junit4]   2> 620695 T1755 oasc.DistributedQueue$LatchChildWatcher.process LatchChildWatcher fired on path: /overseer/queue state: SyncConnected type NodeChildrenChanged
   [junit4]   2> 620696 T1779 oasc.ZkController.preRegister Registering watch for external collection collection1
   [junit4]   2> 620696 T1779 oascc.ZkStateReader.addZkWatch addZkWatch collection1
   [junit4]   2> 620697 T1779 oascc.ZkStateReader.addZkWatch Updating collection state at /collections/collection1/state.json from ZooKeeper... 
   [junit4]   2> 620698 T1779 oascc.ZkStateReader.updateWatchedCollection Updating data for collection1 to ver 0 
   [junit4]   2> 620699 T1751 oasc.Overseer$ClusterStateUpdater.updateState Update state numShards=3 message={
   [junit4]   2> 	  "base_url":"http://127.0.0.1:22219/_am/wj",
   [junit4]   2> 	  "numShards":"3",
   [junit4]   2> 	  "node_name":"127.0.0.1:22219__am%2Fwj",
   [junit4]   2> 	  "roles":null,
   [junit4]   2> 	  "shard":null,
   [junit4]   2> 	  "operation":"state",
   [junit4]   2> 	  "collection":"collection1",
   [junit4]   2> 	  "core":"collection1",
   [junit4]   2> 	  "state":"down"}
   [junit4]   2> 620699 T1779 oasc.ZkController.waitForCoreNodeName look for our core node name
   [junit4]   2> 620703 T1751 oasc.Overseer$ClusterStateUpdater.updateState Collection already exists with numShards=3
   [junit4]   2> 620704 T1751 oasc.Overseer$ClusterStateUpdater.updateState Assigning new node to shard shard=shard1
   [junit4]   2> 620710 T1751 oasc.Overseer$ClusterStateUpdater.updateZkStates going to update_collection /collections/collection1/state.json
   [junit4]   2> 620711 T1778 oascc.ZkStateReader$7.process A cluster state change: WatchedEvent state:SyncConnected type:NodeDataChanged path:/collections/collection1/state.json, has occurred - updating... 
   [junit4]   2> 620712 T1778 oascc.ZkStateReader.updateWatchedCollection Updating data for collection1 to ver 1 
   [junit4]   2> 621699 T1779 oasc.ZkController.waitForShardId waiting to find shard id in clusterstate for collection1
   [junit4]   2> 621700 T1779 oasc.ZkController.createCollectionZkNode Check for collection zkNode:collection1
   [junit4]   2> 621701 T1779 oasc.ZkController.createCollectionZkNode Collection zkNode exists
   [junit4]   2> 621701 T1779 oascc.ZkStateReader.readConfigName Load collection config from:/collections/collection1
   [junit4]   2> 621702 T1779 oascc.ZkStateReader.readConfigName path=/collections/collection1 configName=conf1 specified config exists in ZooKeeper
   [junit4]   2> 621702 T1779 oasc.SolrResourceLoader.<init> new SolrResourceLoader for directory: '/usr/home/jenkins/jenkins-slave/workspace/Lucene-Solr-NightlyTests-trunk/solr/build/solr-core/test/J1/temp/solr.cloud.FullSolrCloudDistribCmdsTest-E72D0CF5E9237892-001/tempDir-003/collection1/'
   [junit4]   2> 621704 T1779 oasc.SolrResourceLoader.replaceClassLoader Adding 'file:/usr/home/jenkins/jenkins-slave/workspace/Lucene-Solr-NightlyTests-trunk/solr/build/solr-core/test/J1/temp/solr.cloud.FullSolrCloudDistribCmdsTest-E72D0CF5E9237892-001/tempDir-003/collection1/lib/README' to classloader
   [junit4]   2> 621705 T1779 oasc.SolrResourceLoader.replaceClassLoader Adding 'file:/usr/home/jenkins/jenkins-slave/workspace/Lucene-Solr-NightlyTests-trunk/solr/build/solr-core/test/J1/temp/solr.cloud.FullSolrCloudDistribCmdsTest-E72D0CF5E9237892-001/tempDir-003/collection1/lib/classes/' to classloader
   [junit4]   2> 621705 T1779 oasc.SolrResourceLoader.replaceClassLoader Adding 'file:/usr/home/jenkins/jenkins-slave/workspace/Lucene-Solr-NightlyTests-trunk/solr/build/solr-core/test/J1/temp/solr.cloud.FullSolrCloudDistribCmdsTest-E72D0CF5E9237892-001/tempDir-003/collection1/lib/.svn/' to classloader
   [junit4]   2> 621773 T1779 oasc.SolrConfig.<init> Using Lucene MatchVersion: 6.0.0
   [junit4]   2> 621821 T1779 oasc.SolrConfig.<init> Loaded SolrConfig: solrconfig.xml
   [junit4]   2> 621823 T1779 oass.IndexSchema.readSchema Reading Solr Schema from schema.xml
   [junit4]   2> 621833 T1779 oass.IndexSchema.readSchema [collection1] Schema name=test
   [junit4]   2> 622191 T1779 oass.IndexSchema.readSchema default search field in schema is text
   [junit4]   2> 622194 T1779 oass.IndexSchema.readSchema unique key field: id
   [junit4]   2> 622196 T1779 oass.FileExchangeRateProvider.reload Reloading exchange rates from file currency.xml
   [junit4]   2> 622201 T1779 oass.FileExchangeRateProvider.reload Reloading exchange rates from file currency.xml
   [junit4]   2> 622227 T1779 oasc.CoreContainer.create Creating SolrCore 'collection1' using configuration from collection collection1
   [junit4]   2> 622227 T1779 oasc.SolrCore.initDirectoryFactory org.apache.solr.core.MockDirectoryFactory
   [junit4]   2> 622227 T1779 oasc.SolrCore.<init> [collection1] Opening new SolrCore at /usr/home/jenkins/jenkins-slave/workspace/Lucene-Solr-NightlyTests-trunk/solr/build/solr-core/test/J1/temp/solr.cloud.FullSolrCloudDistribCmdsTest-E72D0CF5E9237892-001/tempDir-003/collection1/, dataDir=/usr/home/jenkins/jenkins-slave/workspace/Lucene-Solr-NightlyTests-trunk/solr/build/solr-core/test/J1/temp/solr.cloud.FullSolrCloudDistribCmdsTest-E72D0CF5E9237892-001/tempDir-001/jetty1/
   [junit4]   2> 622228 T1779 oasc.JmxMonitoredMap.<init> JMX monitoring is enabled. Adding Solr mbeans to JMX Server: com.sun.jmx.mbeanserver.JmxMBeanServer@796c75b1
   [junit4]   2> 622229 T1779 oasc.CachingDirectoryFactory.get return new directory for /usr/home/jenkins/jenkins-slave/workspace/Lucene-Solr-NightlyTests-trunk/solr/build/solr-core/test/J1/temp/solr.cloud.FullSolrCloudDistribCmdsTest-E72D0CF5E9237892-001/tempDir-001/jetty1
   [junit4]   2> 622229 T1779 oasc.SolrCore.getNewIndexDir New index directory detected: old=null new=/usr/home/jenkins/jenkins-slave/workspace/Lucene-Solr-NightlyTests-trunk/solr/build/solr-core/test/J1/temp/solr.cloud.FullSolrCloudDistribCmdsTest-E72D0CF5E9237892-001/tempDir-001/jetty1/index/
   [junit4]   2> 622229 T1779 oasc.SolrCore.initIndex WARN [collection1] Solr index directory '/usr/home/jenkins/jenkins-slave/workspace/Lucene-Solr-NightlyTests-trunk/solr/build/solr-core/test/J1/temp/solr.cloud.FullSolrCloudDistribCmdsTest-E72D0CF5E9237892-001/tempDir-001/jetty1/index' doesn't exist. Creating new index...
   [junit4]   2> 622230 T1779 oasc.CachingDirectoryFactory.get return new directory for /usr/home/jenkins/jenkins-slave/workspace/Lucene-Solr-NightlyTests-trunk/solr/build/solr-core/test/J1/temp/solr.cloud.FullSolrCloudDistribCmdsTest-E72D0CF5E9237892-001/tempDir-001/jetty1/index
   [junit4]   2> 622230 T1779 oasu.RandomMergePolicy.<init> RandomMergePolicy wrapping class org.apache.lucene.index.TieredMergePolicy: [TieredMergePolicy: maxMergeAtOnce=20, maxMergeAtOnceExplicit=29, maxMergedSegmentMB=19.408203125, floorSegmentMB=1.2998046875, forceMergeDeletesPctAllowed=9.848782905084622, segmentsPerTier=48.0, maxCFSSegmentSizeMB=8.796093022207999E12, noCFSRatio=1.0
   [junit4]   2> 622231 T1779 oasc.SolrDeletionPolicy.onCommit SolrDeletionPolicy.onCommit: commits: num=1
   [junit4]   2> 		commit{dir=MockDirectoryWrapper(NRTCachingDirectory(RAMDirectory(id=lucene-46de2fbc); maxCacheMB=0.4326171875 maxMergeSizeMB=0.2724609375)),segFN=segments_1,generation=1}
   [junit4]   2> 622232 T1779 oasc.SolrDeletionPolicy.updateCommits newest commit generation = 1
   [junit4]   2> 622238 T1779 oasup.UpdateRequestProcessorChain.init creating updateRequestProcessorChain "nodistrib"
   [junit4]   2> 622239 T1779 oasup.UpdateRequestProcessorChain.init creating updateRequestProcessorChain "dedupe"
   [junit4]   2> 622239 T1779 oasup.UpdateRequestProcessorChain.init inserting DistributedUpdateProcessorFactory into updateRequestProcessorChain "dedupe"
   [junit4]   2> 622239 T1779 oasup.UpdateRequestProcessorChain.init creating updateRequestProcessorChain "stored_sig"
   [junit4]   2> 622240 T1779 oasup.UpdateRequestProcessorChain.init inserting DistributedUpdateProcessorFactory into updateRequestProcessorChain "stored_sig"
   [junit4]   2> 622240 T1779 oasup.UpdateRequestProcessorChain.init creating updateRequestProcessorChain "distrib-dup-test-ch

[...truncated too long message...]

AndConfigAliasReplication
   [junit4]   2> 2767324 T3173 oasc.CoreContainer.shutdown Shutting down CoreContainer instance=2069585190
   [junit4]   2> 2767325 T3173 oasc.SolrCore.close [collection1]  CLOSING SolrCore org.apache.solr.core.SolrCore@1bfb0e77
   [junit4]   2> 2767325 T3173 oasu.DirectUpdateHandler2.close closing DirectUpdateHandler2{commits=1,autocommits=0,soft autocommits=0,optimizes=0,rollbacks=0,expungeDeletes=0,docsPending=0,adds=0,deletesById=0,deletesByQuery=0,errors=0,cumulative_adds=1,cumulative_deletesById=0,cumulative_deletesByQuery=0,cumulative_errors=0}
   [junit4]   2> 2767326 T3173 oasu.SolrCoreState.decrefSolrCoreState Closing SolrCoreState
   [junit4]   2> 2767327 T3173 oasu.DefaultSolrCoreState.closeIndexWriter SolrCoreState ref count has reached 0 - closing IndexWriter
   [junit4]   2> 2767327 T3173 oasu.DefaultSolrCoreState.closeIndexWriter closing IndexWriter with IndexWriterCloser
   [junit4]   2> 2767328 T3173 oasc.SolrCore.closeSearcher [collection1] Closing main searcher on request.
   [junit4]   2> 2767328 T3173 oasc.CachingDirectoryFactory.close Closing MockDirectoryFactory - 2 directories currently being tracked
   [junit4]   2> 2767329 T3173 oasc.CachingDirectoryFactory.closeCacheValue looking to close /usr/home/jenkins/jenkins-slave/workspace/Lucene-Solr-NightlyTests-trunk/solr/build/solr-core/test/J2/temp/solr.handler.TestReplicationHandler-E72D0CF5E9237892-001/solr-instance-001/collection1/data/index [CachedDir<<refCount=0;path=/usr/home/jenkins/jenkins-slave/workspace/Lucene-Solr-NightlyTests-trunk/solr/build/solr-core/test/J2/temp/solr.handler.TestReplicationHandler-E72D0CF5E9237892-001/solr-instance-001/collection1/data/index;done=false>>]
   [junit4]   2> 2767329 T3173 oasc.CachingDirectoryFactory.close Closing directory: /usr/home/jenkins/jenkins-slave/workspace/Lucene-Solr-NightlyTests-trunk/solr/build/solr-core/test/J2/temp/solr.handler.TestReplicationHandler-E72D0CF5E9237892-001/solr-instance-001/collection1/data/index
   [junit4]   2> 2767330 T3173 oasc.CachingDirectoryFactory.closeCacheValue looking to close /usr/home/jenkins/jenkins-slave/workspace/Lucene-Solr-NightlyTests-trunk/solr/build/solr-core/test/J2/temp/solr.handler.TestReplicationHandler-E72D0CF5E9237892-001/solr-instance-001/collection1/data [CachedDir<<refCount=0;path=/usr/home/jenkins/jenkins-slave/workspace/Lucene-Solr-NightlyTests-trunk/solr/build/solr-core/test/J2/temp/solr.handler.TestReplicationHandler-E72D0CF5E9237892-001/solr-instance-001/collection1/data;done=false>>]
   [junit4]   2> 2767330 T3173 oasc.CachingDirectoryFactory.close Closing directory: /usr/home/jenkins/jenkins-slave/workspace/Lucene-Solr-NightlyTests-trunk/solr/build/solr-core/test/J2/temp/solr.handler.TestReplicationHandler-E72D0CF5E9237892-001/solr-instance-001/collection1/data
   [junit4]   2> 2767331 T3173 oejsh.ContextHandler.doStop stopped o.e.j.s.ServletContextHandler{/solr,null}
   [junit4]   2> 2772328 T3173 oasc.CoreContainer.shutdown Shutting down CoreContainer instance=1723997811
   [junit4]   2> 2772329 T3173 oasc.SolrCore.close [collection1]  CLOSING SolrCore org.apache.solr.core.SolrCore@2a6ce668
   [junit4]   2> 2782976 T4253 oash.SnapPuller.fetchLatestIndex ERROR Master at: http://127.0.0.1:62198/solr is not available. Index fetch failed. Exception: IOException occured when talking to server at: http://127.0.0.1:62198/solr
   [junit4]   2> 2782977 T3173 oasu.DirectUpdateHandler2.close closing DirectUpdateHandler2{commits=1,autocommits=0,soft autocommits=0,optimizes=0,rollbacks=0,expungeDeletes=0,docsPending=0,adds=0,deletesById=0,deletesByQuery=0,errors=0,cumulative_adds=1,cumulative_deletesById=0,cumulative_deletesByQuery=0,cumulative_errors=0}
   [junit4]   2> 2782978 T3173 oasu.SolrCoreState.decrefSolrCoreState Closing SolrCoreState
   [junit4]   2> 2782979 T3173 oasu.DefaultSolrCoreState.closeIndexWriter SolrCoreState ref count has reached 0 - closing IndexWriter
   [junit4]   2> 2782979 T3173 oasu.DefaultSolrCoreState.closeIndexWriter closing IndexWriter with IndexWriterCloser
   [junit4]   2> 2782980 T3173 oasc.SolrCore.closeSearcher [collection1] Closing main searcher on request.
   [junit4]   2> 2782981 T3173 oasc.CachingDirectoryFactory.close Closing MockDirectoryFactory - 2 directories currently being tracked
   [junit4]   2> 2782981 T3173 oasc.CachingDirectoryFactory.closeCacheValue looking to close /usr/home/jenkins/jenkins-slave/workspace/Lucene-Solr-NightlyTests-trunk/solr/build/solr-core/test/J2/temp/solr.handler.TestReplicationHandler-E72D0CF5E9237892-001/solr-instance-002/collection1/data [CachedDir<<refCount=0;path=/usr/home/jenkins/jenkins-slave/workspace/Lucene-Solr-NightlyTests-trunk/solr/build/solr-core/test/J2/temp/solr.handler.TestReplicationHandler-E72D0CF5E9237892-001/solr-instance-002/collection1/data;done=false>>]
   [junit4]   2> 2782982 T3173 oasc.CachingDirectoryFactory.close Closing directory: /usr/home/jenkins/jenkins-slave/workspace/Lucene-Solr-NightlyTests-trunk/solr/build/solr-core/test/J2/temp/solr.handler.TestReplicationHandler-E72D0CF5E9237892-001/solr-instance-002/collection1/data
   [junit4]   2> 2782982 T3173 oasc.CachingDirectoryFactory.closeCacheValue looking to close /usr/home/jenkins/jenkins-slave/workspace/Lucene-Solr-NightlyTests-trunk/solr/build/solr-core/test/J2/temp/solr.handler.TestReplicationHandler-E72D0CF5E9237892-001/solr-instance-002/collection1/data/index.20141015083306009 [CachedDir<<refCount=0;path=/usr/home/jenkins/jenkins-slave/workspace/Lucene-Solr-NightlyTests-trunk/solr/build/solr-core/test/J2/temp/solr.handler.TestReplicationHandler-E72D0CF5E9237892-001/solr-instance-002/collection1/data/index.20141015083306009;done=false>>]
   [junit4]   2> 2782982 T3173 oasc.CachingDirectoryFactory.close Closing directory: /usr/home/jenkins/jenkins-slave/workspace/Lucene-Solr-NightlyTests-trunk/solr/build/solr-core/test/J2/temp/solr.handler.TestReplicationHandler-E72D0CF5E9237892-001/solr-instance-002/collection1/data/index.20141015083306009
   [junit4]   2> 2782983 T3173 oejsh.ContextHandler.doStop stopped o.e.j.s.ServletContextHandler{/solr,null}
   [junit4]   2> 2787345 T3173 oas.SolrTestCaseJ4.deleteCore ###deleteCore
   [junit4]   2> NOTE: leaving temporary files on disk at: /usr/home/jenkins/jenkins-slave/workspace/Lucene-Solr-NightlyTests-trunk/solr/build/solr-core/test/J2/temp/solr.handler.TestReplicationHandler-E72D0CF5E9237892-001
   [junit4]   2> NOTE: test params are: codec=Asserting(Lucene50): {newname=PostingsFormat(name=Lucene41VarGapFixedInterval), name=PostingsFormat(name=Lucene41VarGapFixedInterval), id=PostingsFormat(name=Lucene41VarGapFixedInterval)}, docValues:{}, sim=DefaultSimilarity, locale=el, timezone=America/Sitka
   [junit4]   2> NOTE: FreeBSD 9.1-RELEASE-p3 amd64/Oracle Corporation 1.7.0_65 (64-bit)/cpus=16,threads=1,free=77829512,total=222298112
   [junit4]   2> NOTE: All tests run in this JVM: [QueryResultKeyTest, TestStressRecovery, StatsComponentTest, TestManagedSchema, LegacyHTMLStripCharFilterTest, NumericFieldsTest, IndexSchemaTest, CurrencyFieldXmlFileTest, TestAnalyzeInfixSuggestions, TestSearcherReuse, TestReplicaProperties, ModifyConfFileTest, TestSolrQueryParser, SyncSliceTest, HighlighterConfigTest, TestHashPartitioner, TestOmitPositions, OpenExchangeRatesOrgProviderTest, TestReversedWildcardFilterFactory, TestShortCircuitedRequests, TestInfoStreamLogging, LeaderElectionIntegrationTest, DefaultValueUpdateProcessorTest, HardAutoCommitTest, HdfsChaosMonkeySafeLeaderTest, TestQuerySenderListener, DistributedFacetPivotLongTailTest, PolyFieldTest, OverseerCollectionProcessorTest, TestRemoteStreaming, HdfsBasicDistributedZk2Test, TestCharFilters, TestLuceneMatchVersion, TestHighlightDedupGrouping, PingRequestHandlerTest, EnumFieldTest, TestSuggestSpellingConverter, TestIndexingPerformance, RAMDirectoryFactoryTest, TestStandardQParsers, ZkNodePropsTest, DocValuesTest, BadCopyFieldTest, AliasIntegrationTest, TestUpdate, TestDocBasedVersionConstraints, TestJmxMonitoredMap, BasicFunctionalityTest, TestUniqueKeyFieldResource, TestOverriddenPrefixQueryForCustomFieldType, TestStressLucene, BasicDistributedZk2Test, TestDistributedSearch, TestSortingResponseWriter, RecoveryZkTest, TestReplicationHandler]
   [junit4] Completed on J2 in 1198.40s, 14 tests, 1 failure <<< FAILURES!

[...truncated 327 lines...]
BUILD FAILED
/usr/home/jenkins/jenkins-slave/workspace/Lucene-Solr-NightlyTests-trunk/build.xml:531: The following error occurred while executing this line:
/usr/home/jenkins/jenkins-slave/workspace/Lucene-Solr-NightlyTests-trunk/build.xml:472: The following error occurred while executing this line:
/usr/home/jenkins/jenkins-slave/workspace/Lucene-Solr-NightlyTests-trunk/build.xml:61: The following error occurred while executing this line:
/usr/home/jenkins/jenkins-slave/workspace/Lucene-Solr-NightlyTests-trunk/extra-targets.xml:39: The following error occurred while executing this line:
/usr/home/jenkins/jenkins-slave/workspace/Lucene-Solr-NightlyTests-trunk/solr/build.xml:189: The following error occurred while executing this line:
/usr/home/jenkins/jenkins-slave/workspace/Lucene-Solr-NightlyTests-trunk/solr/common-build.xml:496: The following error occurred while executing this line:
/usr/home/jenkins/jenkins-slave/workspace/Lucene-Solr-NightlyTests-trunk/lucene/common-build.xml:1359: The following error occurred while executing this line:
/usr/home/jenkins/jenkins-slave/workspace/Lucene-Solr-NightlyTests-trunk/lucene/common-build.xml:961: There were test failures: 437 suites, 1784 tests, 3 errors, 1 failure, 53 ignored (9 assumptions)

Total time: 216 minutes 30 seconds
Build step 'Invoke Ant' marked build as failure
Archiving artifacts
Sending artifact delta relative to Lucene-Solr-NightlyTests-trunk #657
Archived 5 artifacts
Archive block size is 32768
Received 0 blocks and 649855611 bytes
Compression is 0.0%
Took 1 min 51 sec
Recording test results
Email was triggered for: Failure
Sending email for trigger: Failure