You are viewing a plain text version of this content. The canonical link for it is here.
Posted to yarn-dev@hadoop.apache.org by Apache Jenkins Server <je...@builds.apache.org> on 2015/05/13 04:29:46 UTC
Failed: YARN-3628 PreCommit Build #7907
Jira: https://issues.apache.org/jira/browse/YARN-3628
Build: https://builds.apache.org/job/PreCommit-YARN-Build/7907/
###################################################################################
########################## LAST 60 LINES OF THE CONSOLE ###########################
[...truncated 274 lines...]
| | | | issues.
| -1 | whitespace | 0m 0s | The patch has 1 line(s) that end in
| | | | whitespace. Use git apply
| | | | --whitespace=fix.
| +1 | install | 1m 33s | mvn install still works.
| +1 | eclipse:eclipse | 0m 33s | The patch built with
| | | | eclipse:eclipse.
| +1 | findbugs | 2m 23s | The patch does not introduce any
| | | | new Findbugs (version 2.0.3)
| | | | warnings.
| +1 | yarn tests | 0m 25s | Tests passed in hadoop-yarn-api.
| +1 | yarn tests | 6m 1s | Tests passed in
| | | | hadoop-yarn-server-nodemanager.
| | | 44m 49s |
|| Subsystem || Report/Notes ||
============================================================================
| Patch URL | http://issues.apache.org/jira/secure/attachment/12732440/YARN-3628.000.patch |
| Optional Tests | javadoc javac unit findbugs checkstyle |
| git revision | trunk / f24452d |
| whitespace | /home/jenkins/jenkins-slave/workspace/PreCommit-YARN-Build/patchprocess/whitespace.txt |
| hadoop-yarn-api test log | /home/jenkins/jenkins-slave/workspace/PreCommit-YARN-Build/patchprocess/testrun_hadoop-yarn-api.txt |
| hadoop-yarn-server-nodemanager test log | /home/jenkins/jenkins-slave/workspace/PreCommit-YARN-Build/patchprocess/testrun_hadoop-yarn-server-nodemanager.txt |
| Test Results | https://builds.apache.org/job/PreCommit-YARN-Build/7907/testReport/ |
| Java | 1.7.0_55 |
| uname | Linux asf907.gq1.ygridcore.net 3.13.0-36-lowlatency #63-Ubuntu SMP PREEMPT Wed Sep 3 21:56:12 UTC 2014 x86_64 x86_64 x86_64 GNU/Linux |
============================================================================
============================================================================
Adding comment to JIRA
============================================================================
============================================================================
Comment added.
b30f2847ed99e6bad4b788afe191443b626d6837 logged out
============================================================================
============================================================================
Finished build.
============================================================================
============================================================================
Build step 'Execute shell' marked build as failure
Archiving artifacts
Sending artifact delta relative to PreCommit-YARN-Build #7904
Archived 33 artifacts
Archive block size is 32768
Received 67 blocks and 27185236 bytes
Compression is 7.5%
Took 9.1 sec
Description set: MAPREDUCE-6251
Recording test results
Email was triggered for: Failure
Sending email for trigger: Failure
###################################################################################
############################## FAILED TESTS (if any) ##############################
All tests passed
Success: YARN-3628 PreCommit Build #7911
Posted by Apache Jenkins Server <je...@builds.apache.org>.
Jira: https://issues.apache.org/jira/browse/YARN-3628
Build: https://builds.apache.org/job/PreCommit-YARN-Build/7911/
###################################################################################
########################## LAST 60 LINES OF THE CONSOLE ###########################
[...truncated 274 lines...]
| | | | the total number of release audit
| | | | warnings.
| +1 | checkstyle | 1m 35s | There were no new checkstyle
| | | | issues.
| +1 | whitespace | 0m 0s | The patch has no lines that end in
| | | | whitespace.
| +1 | install | 1m 33s | mvn install still works.
| +1 | eclipse:eclipse | 0m 33s | The patch built with
| | | | eclipse:eclipse.
| +1 | findbugs | 2m 23s | The patch does not introduce any
| | | | new Findbugs (version 2.0.3)
| | | | warnings.
| +1 | yarn tests | 0m 23s | Tests passed in hadoop-yarn-api.
| +1 | yarn tests | 5m 59s | Tests passed in
| | | | hadoop-yarn-server-nodemanager.
| | | 44m 44s |
|| Subsystem || Report/Notes ||
============================================================================
| Patch URL | http://issues.apache.org/jira/secure/attachment/12732484/YARN-3628.000.patch |
| Optional Tests | javadoc javac unit findbugs checkstyle |
| git revision | trunk / fcd0702 |
| hadoop-yarn-api test log | /home/jenkins/jenkins-slave/workspace/PreCommit-YARN-Build/patchprocess/testrun_hadoop-yarn-api.txt |
| hadoop-yarn-server-nodemanager test log | /home/jenkins/jenkins-slave/workspace/PreCommit-YARN-Build/patchprocess/testrun_hadoop-yarn-server-nodemanager.txt |
| Test Results | https://builds.apache.org/job/PreCommit-YARN-Build/7911/testReport/ |
| Java | 1.7.0_55 |
| uname | Linux asf901.gq1.ygridcore.net 3.13.0-36-lowlatency #63-Ubuntu SMP PREEMPT Wed Sep 3 21:56:12 UTC 2014 x86_64 x86_64 x86_64 GNU/Linux |
============================================================================
============================================================================
Adding comment to JIRA
============================================================================
============================================================================
Comment added.
f33c530113e73dc39c20bcf90cc63e79c68e951e logged out
============================================================================
============================================================================
Finished build.
============================================================================
============================================================================
Archiving artifacts
Sending artifact delta relative to PreCommit-YARN-Build #7904
Archived 33 artifacts
Archive block size is 32768
Received 65 blocks and 27260483 bytes
Compression is 7.2%
Took 10 sec
Description set: YARN-3628
Recording test results
Email was triggered for: Success
Sending email for trigger: Success
###################################################################################
############################## FAILED TESTS (if any) ##############################
All tests passed
Failed: YARN-3579 PreCommit Build #7910
Posted by Apache Jenkins Server <je...@builds.apache.org>.
Jira: https://issues.apache.org/jira/browse/YARN-3579
Build: https://builds.apache.org/job/PreCommit-YARN-Build/7910/
###################################################################################
########################## LAST 60 LINES OF THE CONSOLE ###########################
[...truncated 149 lines...]
/home/jenkins/tools/maven/latest/bin/mvn clean test -DskipTests -DhadoopPatchProcess -Pnative -Ptest-patch > /home/jenkins/jenkins-slave/workspace/PreCommit-YARN-Build/patchprocess/patchJavacWarnings.txt 2>&1
Elapsed time: 3m 19s
-1 overall
| Vote | Subsystem | Runtime | Comment
============================================================================
| 0 | pre-patch | 14m 42s | Pre-patch trunk compilation is
| | | | healthy.
| +1 | @author | 0m 0s | The patch does not contain any
| | | | @author tags.
| +1 | tests included | 0m 0s | The patch appears to include 2 new
| | | | or modified test files.
| -1 | javac | 3m 19s | The patch appears to cause the build
| | | | to fail.
|| Subsystem || Report/Notes ||
============================================================================
| Patch URL | http://issues.apache.org/jira/secure/attachment/12732460/0003-YARN-3579.patch |
| Optional Tests | javadoc javac unit findbugs checkstyle |
| git revision | trunk / 2463666 |
============================================================================
============================================================================
Adding comment to JIRA
============================================================================
============================================================================
Comment added.
949f654921e957b03815260ce5aa357700f95ab8 logged out
============================================================================
============================================================================
Finished build.
============================================================================
============================================================================
Build step 'Execute shell' marked build as failure
Archiving artifacts
Sending artifact delta relative to PreCommit-YARN-Build #7904
Archived 9 artifacts
Archive block size is 32768
Received 20 blocks and 3984635 bytes
Compression is 14.1%
Took 4.5 sec
[description-setter] Could not determine description.
Recording test results
Email was triggered for: Failure
Sending email for trigger: Failure
###################################################################################
############################## FAILED TESTS (if any) ##############################
No tests ran.
Failed: YARN-2408 PreCommit Build #7909
Posted by Apache Jenkins Server <je...@builds.apache.org>.
Jira: https://issues.apache.org/jira/browse/YARN-2408
Build: https://builds.apache.org/job/PreCommit-YARN-Build/7909/
###################################################################################
########################## LAST 60 LINES OF THE CONSOLE ###########################
[...truncated 68 lines...]
============================================================================
============================================================================
Applying patch
============================================================================
============================================================================
The patch does not appear to apply with p0 to p2
PATCH APPLICATION FAILED
Elapsed time: 0m 4s
-1 overall
| Vote | Subsystem | Runtime | Comment
============================================================================
| -1 | patch | 0m 4s | The patch command could not apply the
| | | | patch.
|| Subsystem || Report/Notes ||
============================================================================
| Patch URL | http://issues.apache.org/jira/secure/attachment/12732466/YARN-2408-5.patch |
| Optional Tests | shellcheck site javadoc javac unit findbugs checkstyle |
| git revision | trunk / 2463666 |
============================================================================
============================================================================
Adding comment to JIRA
============================================================================
============================================================================
Comment added.
b16674c7a586833bd6150bb1f05488698252b183 logged out
============================================================================
============================================================================
Finished build.
============================================================================
============================================================================
Build step 'Execute shell' marked build as failure
Archiving artifacts
Sending artifact delta relative to PreCommit-YARN-Build #7904
Archived 3 artifacts
Archive block size is 32768
Received 0 blocks and 937439 bytes
Compression is 0.0%
Took 4.6 sec
[description-setter] Could not determine description.
Recording test results
Email was triggered for: Failure
Sending email for trigger: Failure
###################################################################################
############################## FAILED TESTS (if any) ##############################
No tests ran.
Failed: YARN-3539 PreCommit Build #7908
Posted by Apache Jenkins Server <je...@builds.apache.org>.
Jira: https://issues.apache.org/jira/browse/YARN-3539
Build: https://builds.apache.org/job/PreCommit-YARN-Build/7908/
###################################################################################
########################## LAST 60 LINES OF THE CONSOLE ###########################
[...truncated 423 lines...]
| +1 | install | 1m 34s | mvn install still works.
| +1 | eclipse:eclipse | 0m 32s | The patch built with
| | | | eclipse:eclipse.
| +1 | findbugs | 5m 14s | The patch does not introduce any
| | | | new Findbugs (version 2.0.3)
| | | | warnings.
| +1 | common tests | 22m 11s | Tests passed in hadoop-common.
| +1 | yarn tests | 0m 25s | Tests passed in hadoop-yarn-api.
| +1 | yarn tests | 1m 56s | Tests passed in hadoop-yarn-common.
| +1 | yarn tests | 0m 24s | Tests passed in
| | | | hadoop-yarn-server-common.
| | | 75m 46s |
|| Subsystem || Report/Notes ||
============================================================================
| Patch URL | http://issues.apache.org/jira/secure/attachment/12732431/YARN-3539.11.patch |
| Optional Tests | site javadoc javac unit findbugs checkstyle |
| git revision | trunk / f24452d |
| whitespace | /home/jenkins/jenkins-slave/workspace/PreCommit-YARN-Build/patchprocess/whitespace.txt |
| hadoop-common test log | /home/jenkins/jenkins-slave/workspace/PreCommit-YARN-Build/patchprocess/testrun_hadoop-common.txt |
| hadoop-yarn-api test log | /home/jenkins/jenkins-slave/workspace/PreCommit-YARN-Build/patchprocess/testrun_hadoop-yarn-api.txt |
| hadoop-yarn-common test log | /home/jenkins/jenkins-slave/workspace/PreCommit-YARN-Build/patchprocess/testrun_hadoop-yarn-common.txt |
| hadoop-yarn-server-common test log | /home/jenkins/jenkins-slave/workspace/PreCommit-YARN-Build/patchprocess/testrun_hadoop-yarn-server-common.txt |
| Test Results | https://builds.apache.org/job/PreCommit-YARN-Build/7908/testReport/ |
| Java | 1.7.0_55 |
| uname | Linux asf901.gq1.ygridcore.net 3.13.0-36-lowlatency #63-Ubuntu SMP PREEMPT Wed Sep 3 21:56:12 UTC 2014 x86_64 x86_64 x86_64 GNU/Linux |
============================================================================
============================================================================
Adding comment to JIRA
============================================================================
============================================================================
Comment added.
628cac39a4caebf871aaa1003d677eb63cca9d61 logged out
============================================================================
============================================================================
Finished build.
============================================================================
============================================================================
Build step 'Execute shell' marked build as failure
Archiving artifacts
Sending artifact delta relative to PreCommit-YARN-Build #7904
Archived 53 artifacts
Archive block size is 32768
Received 229 blocks and 36220177 bytes
Compression is 17.2%
Took 9.5 sec
Description set: MAPREDUCE-6251
Recording test results
Email was triggered for: Failure
Sending email for trigger: Failure
###################################################################################
############################## FAILED TESTS (if any) ##############################
All tests passed