You are viewing a plain text version of this content. The canonical link for it is here.
Posted to builds@beam.apache.org by Apache Jenkins Server <je...@builds.apache.org> on 2023/09/29 17:53:55 UTC
Build failed in Jenkins: beam_PostCommit_XVR_Direct #4658
See <https://ci-beam.apache.org/job/beam_PostCommit_XVR_Direct/4658/display/redirect?page=changes>
Changes:
[noreply] Add Load Tests CoGBK Flink Batch Go workflow (#28660)
------------------------------------------
[...truncated 1.57 MB...]
INFO apache_beam.utils.subprocess_server:subprocess_server.py:126 Registered SchemaTransformProviders:
INFO apache_beam.utils.subprocess_server:subprocess_server.py:126 beam:schematransform:org.apache.beam:spanner_cdc_read:v1
INFO apache_beam.utils.subprocess_server:subprocess_server.py:126 beam:schematransform:org.apache.beam:bigtable_write:v1
INFO apache_beam.utils.subprocess_server:subprocess_server.py:126 beam:schematransform:org.apache.beam:spanner_write:v1
INFO apache_beam.utils.subprocess_server:subprocess_server.py:126 beam:schematransform:org.apache.beam:pubsublite_read:v1
INFO apache_beam.utils.subprocess_server:subprocess_server.py:126 beam:schematransform:org.apache.beam:bigquery_storage_read:v1
INFO apache_beam.utils.subprocess_server:subprocess_server.py:126 beam:schematransform:org.apache.beam:bigquery_fileloads_write:v1
INFO apache_beam.utils.subprocess_server:subprocess_server.py:126 beam:schematransform:org.apache.beam:bigquery_export_read:v1
INFO apache_beam.utils.subprocess_server:subprocess_server.py:126 beam:schematransform:org.apache.beam:kafka_read:v1
INFO apache_beam.utils.subprocess_server:subprocess_server.py:126 beam:schematransform:org.apache.beam:kafka_write:v1
INFO apache_beam.utils.subprocess_server:subprocess_server.py:126 beam:schematransform:org.apache.beam:bigquery_storage_write:v2
INFO apache_beam.utils.subprocess_server:subprocess_server.py:126 schematransform:org.apache.beam:sql_transform:v1
INFO apache_beam.utils.subprocess_server:subprocess_server.py:126 beam:schematransform:org.apache.beam:pubsub_read:v1
INFO apache_beam.utils.subprocess_server:subprocess_server.py:126 beam:schematransform:org.apache.beam:pubsub_write:v1
INFO apache_beam.utils.subprocess_server:subprocess_server.py:126 beam:schematransform:org.apache.beam:bigtable_read:v1
INFO apache_beam.utils.subprocess_server:subprocess_server.py:126 beam:schematransform:org.apache.beam:pubsublite_write:v1
INFO apache_beam.utils.subprocess_server:subprocess_server.py:126 Sep 29, 2023 5:52:53 PM org.apache.beam.sdk.expansion.service.ExpansionService expand
INFO apache_beam.utils.subprocess_server:subprocess_server.py:126 INFO: Expanding 'SqlTransform(beam:external:java:sql:v1)' with URN 'beam:external:java:sql:v1'
INFO apache_beam.utils.subprocess_server:subprocess_server.py:126 Dependencies list: {}
INFO apache_beam.utils.subprocess_server:subprocess_server.py:126 Sep 29, 2023 5:52:53 PM org.apache.beam.sdk.expansion.service.ExpansionService$ExternalTransformRegistrarLoader payloadToConfig
INFO apache_beam.utils.subprocess_server:subprocess_server.py:126 WARNING: Configuration class 'org.apache.beam.sdk.extensions.sql.expansion.ExternalSqlTransformRegistrar$Configuration' has no schema registered. Attempting to construct with setter approach.
INFO apache_beam.utils.subprocess_server:subprocess_server.py:126 Sep 29, 2023 5:52:54 PM org.apache.beam.sdk.expansion.service.ExpansionService$ExternalTransformRegistrarLoader payloadToConfig
INFO apache_beam.utils.subprocess_server:subprocess_server.py:126 WARNING: Configuration class 'org.apache.beam.sdk.extensions.sql.expansion.ExternalSqlTransformRegistrar$Configuration' has no schema registered. Attempting to construct with setter approach.
INFO apache_beam.utils.subprocess_server:subprocess_server.py:126 Sep 29, 2023 5:52:56 PM org.apache.beam.sdk.extensions.sql.impl.CalciteQueryPlanner convertToBeamRel
INFO apache_beam.utils.subprocess_server:subprocess_server.py:126 INFO: SQL:
INFO apache_beam.utils.subprocess_server:subprocess_server.py:126 SELECT COUNT(*) AS `count`
INFO apache_beam.utils.subprocess_server:subprocess_server.py:126 FROM `beam`.`PCOLLECTION` AS `PCOLLECTION`
INFO apache_beam.utils.subprocess_server:subprocess_server.py:126 Sep 29, 2023 5:52:56 PM org.apache.beam.sdk.extensions.sql.impl.CalciteQueryPlanner convertToBeamRel
INFO apache_beam.utils.subprocess_server:subprocess_server.py:126 INFO: SQLPlan>
INFO apache_beam.utils.subprocess_server:subprocess_server.py:126 LogicalAggregate(group=[{}], count=[COUNT()])
INFO apache_beam.utils.subprocess_server:subprocess_server.py:126 BeamIOSourceRel(table=[[beam, PCOLLECTION]])
INFO apache_beam.utils.subprocess_server:subprocess_server.py:126
INFO apache_beam.utils.subprocess_server:subprocess_server.py:126 Sep 29, 2023 5:52:56 PM org.apache.beam.sdk.extensions.sql.impl.CalciteQueryPlanner convertToBeamRel
INFO apache_beam.utils.subprocess_server:subprocess_server.py:126 INFO: BEAMPlan>
INFO apache_beam.utils.subprocess_server:subprocess_server.py:126 BeamAggregationRel(group=[{}], count=[COUNT()])
INFO apache_beam.utils.subprocess_server:subprocess_server.py:126 BeamIOSourceRel(table=[[beam, PCOLLECTION]])
INFO apache_beam.utils.subprocess_server:subprocess_server.py:126
INFO root:environments.py:317 No image given, using default Python SDK image
INFO root:environments.py:320 Python SDK container image set to "apache/beam_python3.8_sdk:2.52.0.dev" for Docker environment
INFO apache_beam.runners.portability.fn_api_runner.translations:translations.py:712 ==================== <function pack_combiners at 0x7fd6986fe160> ====================
INFO apache_beam.runners.portability.fn_api_runner.translations:translations.py:712 ==================== <function lift_combiners at 0x7fd6986fe1f0> ====================
INFO apache_beam.runners.portability.fn_api_runner.translations:translations.py:712 ==================== <function sort_stages at 0x7fd6986fe940> ====================
INFO apache_beam.runners.portability.portable_runner:portable_runner.py:549 Job state changed to STOPPED
INFO apache_beam.runners.portability.portable_runner:portable_runner.py:549 Job state changed to STARTING
INFO apache_beam.runners.portability.portable_runner:portable_runner.py:549 Job state changed to RUNNING
INFO root:portable_runner.py:542 ==================== <function annotate_downstream_side_inputs at 0x7f1a58423ca0> ====================
INFO root:portable_runner.py:542 ==================== <function fix_side_input_pcoll_coders at 0x7f1a58423dc0> ====================
INFO root:portable_runner.py:542 ==================== <function pack_combiners at 0x7f1a58427310> ====================
INFO root:portable_runner.py:542 ==================== <function lift_combiners at 0x7f1a584273a0> ====================
INFO root:portable_runner.py:542 ==================== <function expand_sdf at 0x7f1a58427550> ====================
INFO root:portable_runner.py:542 ==================== <function expand_gbk at 0x7f1a584275e0> ====================
INFO root:portable_runner.py:542 ==================== <function sink_flattens at 0x7f1a58427700> ====================
INFO root:portable_runner.py:542 ==================== <function greedily_fuse at 0x7f1a58427790> ====================
INFO root:portable_runner.py:542 ==================== <function read_to_impulse at 0x7f1a58427820> ====================
INFO root:portable_runner.py:542 ==================== <function impulse_to_input at 0x7f1a584278b0> ====================
INFO root:portable_runner.py:542 ==================== <function sort_stages at 0x7f1a58427af0> ====================
INFO root:portable_runner.py:542 ==================== <function add_impulse_to_dangling_transforms at 0x7f1a58427c10> ====================
INFO root:portable_runner.py:542 ==================== <function setup_timer_mapping at 0x7f1a58427a60> ====================
INFO root:portable_runner.py:542 ==================== <function populate_data_channel_coders at 0x7f1a58427b80> ====================
INFO root:portable_runner.py:542 starting control server on port 37091
INFO root:portable_runner.py:542 starting data server on port 43041
INFO root:portable_runner.py:542 starting state server on port 35621
INFO root:portable_runner.py:542 starting logging server on port 45757
INFO root:portable_runner.py:542 Created Worker handler <apache_beam.runners.portability.fn_api_runner.worker_handlers.DockerSdkWorkerHandler object at 0x7f1a542aa670> for environment ref_Environment_default_environment_2 (beam:env:docker:v1, b'\n$apache/beam_python3.8_sdk:2.52.0.dev')
INFO root:portable_runner.py:542 Attempting to pull image apache/beam_python3.8_sdk:2.52.0.dev
INFO root:portable_runner.py:542 Unable to pull image apache/beam_python3.8_sdk:2.52.0.dev, defaulting to local image if it exists
INFO root:portable_runner.py:542 Waiting for docker to start up. Current status is running
INFO root:portable_runner.py:542 Docker container is running. container_id = b'06135e06141d77610ee9cd127b7a522902eb0dc0bbc10b618e79d4a755fb3c44', worker_id = worker_85
INFO root:portable_runner.py:542 Created Worker handler <apache_beam.runners.portability.fn_api_runner.worker_handlers.DockerSdkWorkerHandler object at 0x7f1a8e09a3d0> for environment external_8beam:env:docker:v1 (beam:env:docker:v1, b'\n apache/beam_java8_sdk:2.52.0.dev')
INFO root:portable_runner.py:542 Attempting to pull image apache/beam_java8_sdk:2.52.0.dev
INFO root:portable_runner.py:542 Unable to pull image apache/beam_java8_sdk:2.52.0.dev, defaulting to local image if it exists
INFO root:portable_runner.py:542 Waiting for docker to start up. Current status is running
INFO root:portable_runner.py:542 Docker container is running. container_id = b'7fae234f75e56570922b64a84940218bff911dfc72cf3a6c6b7c992f14e131a9', worker_id = worker_86
INFO root:portable_runner.py:542 Completed job in 15.900356769561768 seconds with state DONE.
INFO apache_beam.runners.portability.portable_runner:portable_runner.py:549 Job state changed to DONE
PASSED [ 88%]
apache_beam/transforms/sql_test.py::SqlTransformTest::test_zetasql_generate_data
-------------------------------- live log call ---------------------------------
INFO apache_beam.utils.subprocess_server:subprocess_server.py:239 Using pre-built snapshot at <https://ci-beam.apache.org/job/beam_PostCommit_XVR_Direct/ws/src/sdks/java/extensions/sql/expansion-service/build/libs/beam-sdks-java-extensions-sql-expansion-service-2.52.0-SNAPSHOT.jar>
INFO root:external.py:978 Starting a JAR-based expansion service from JAR <https://ci-beam.apache.org/job/beam_PostCommit_XVR_Direct/ws/src/sdks/java/extensions/sql/expansion-service/build/libs/beam-sdks-java-extensions-sql-expansion-service-2.52.0-SNAPSHOT.jar>
INFO apache_beam.utils.subprocess_server:subprocess_server.py:116 Starting service with ['java' '-jar' '<https://ci-beam.apache.org/job/beam_PostCommit_XVR_Direct/ws/src/sdks/java/extensions/sql/expansion-service/build/libs/beam-sdks-java-extensions-sql-expansion-service-2.52.0-SNAPSHOT.jar'> '37397' '--filesToStage=<https://ci-beam.apache.org/job/beam_PostCommit_XVR_Direct/ws/src/sdks/java/extensions/sql/expansion-service/build/libs/beam-sdks-java-extensions-sql-expansion-service-2.52.0-SNAPSHOT.jar']>
INFO apache_beam.utils.subprocess_server:subprocess_server.py:126 Starting expansion service at localhost:37397
INFO apache_beam.utils.subprocess_server:subprocess_server.py:126 Sep 29, 2023 5:53:21 PM org.apache.beam.sdk.expansion.service.ExpansionService loadRegisteredTransforms
INFO apache_beam.utils.subprocess_server:subprocess_server.py:126 INFO: Registering external transforms: [beam:external:java:sql:v1, beam:transform:org.apache.beam:pubsub_read:v1, beam:transform:org.apache.beam:pubsub_write:v1, beam:transform:org.apache.beam:pubsublite_write:v1, beam:transform:org.apache.beam:pubsublite_read:v1, beam:transform:org.apache.beam:spanner_insert:v1, beam:transform:org.apache.beam:spanner_update:v1, beam:transform:org.apache.beam:spanner_replace:v1, beam:transform:org.apache.beam:spanner_insert_or_update:v1, beam:transform:org.apache.beam:spanner_delete:v1, beam:transform:org.apache.beam:spanner_read:v1, beam:transform:org.apache.beam:kafka_read_with_metadata:v1, beam:transform:org.apache.beam:kafka_read_without_metadata:v1, beam:transform:org.apache.beam:kafka_write:v1, beam:external:java:generate_sequence:v1, beam:transform:pubsub_read:v1, beam:transform:pubsub_write:v1, beam:transform:pubsub_write:v2, beam:transform:combine_globally:v1, beam:transform:combine_grouped_values:v1, beam:transform:combine_per_key:v1, beam:transform:create_view:v1, beam:transform:flatten:v1, beam:transform:group_by_key:v1, beam:transform:group_into_batches:v1, beam:transform:group_into_batches_with_sharded_key:v1, beam:transform:impulse:v1, beam:transform:reshuffle:v1, beam:transform:sdf_process_keyed_elements:v1, beam:transform:teststream:v1, beam:transform:window_into:v1, beam:transform:write_files:v1]
INFO apache_beam.utils.subprocess_server:subprocess_server.py:126
INFO apache_beam.utils.subprocess_server:subprocess_server.py:126 Registered transforms:
INFO apache_beam.utils.subprocess_server:subprocess_server.py:126 beam:external:java:sql:v1: org.apache.beam.sdk.expansion.service.ExpansionService$ExternalTransformRegistrarLoader$1@7ee8290b
INFO apache_beam.utils.subprocess_server:subprocess_server.py:126 beam:transform:org.apache.beam:pubsub_read:v1: org.apache.beam.sdk.expansion.service.ExpansionService$ExternalTransformRegistrarLoader$1@1f59a598
INFO apache_beam.utils.subprocess_server:subprocess_server.py:126 beam:transform:org.apache.beam:pubsub_write:v1: org.apache.beam.sdk.expansion.service.ExpansionService$ExternalTransformRegistrarLoader$1@1e178745
INFO apache_beam.utils.subprocess_server:subprocess_server.py:126 beam:transform:org.apache.beam:pubsublite_write:v1: org.apache.beam.sdk.expansion.service.ExpansionService$ExternalTransformRegistrarLoader$1@192c3f1e
INFO apache_beam.utils.subprocess_server:subprocess_server.py:126 beam:transform:org.apache.beam:pubsublite_read:v1: org.apache.beam.sdk.expansion.service.ExpansionService$ExternalTransformRegistrarLoader$1@26b3fd41
INFO apache_beam.utils.subprocess_server:subprocess_server.py:126 beam:transform:org.apache.beam:spanner_insert:v1: org.apache.beam.sdk.expansion.service.ExpansionService$ExternalTransformRegistrarLoader$1@7494f96a
INFO apache_beam.utils.subprocess_server:subprocess_server.py:126 beam:transform:org.apache.beam:spanner_update:v1: org.apache.beam.sdk.expansion.service.ExpansionService$ExternalTransformRegistrarLoader$1@561b6512
INFO apache_beam.utils.subprocess_server:subprocess_server.py:126 beam:transform:org.apache.beam:spanner_replace:v1: org.apache.beam.sdk.expansion.service.ExpansionService$ExternalTransformRegistrarLoader$1@2e377400
INFO apache_beam.utils.subprocess_server:subprocess_server.py:126 beam:transform:org.apache.beam:spanner_insert_or_update:v1: org.apache.beam.sdk.expansion.service.ExpansionService$ExternalTransformRegistrarLoader$1@1757cd72
INFO apache_beam.utils.subprocess_server:subprocess_server.py:126 beam:transform:org.apache.beam:spanner_delete:v1: org.apache.beam.sdk.expansion.service.ExpansionService$ExternalTransformRegistrarLoader$1@445b295b
INFO apache_beam.utils.subprocess_server:subprocess_server.py:126 beam:transform:org.apache.beam:spanner_read:v1: org.apache.beam.sdk.expansion.service.ExpansionService$ExternalTransformRegistrarLoader$1@49e5f737
INFO apache_beam.utils.subprocess_server:subprocess_server.py:126 beam:transform:org.apache.beam:kafka_read_with_metadata:v1: org.apache.beam.sdk.expansion.service.ExpansionService$ExternalTransformRegistrarLoader$1@5c671d7f
INFO apache_beam.utils.subprocess_server:subprocess_server.py:126 beam:transform:org.apache.beam:kafka_read_without_metadata:v1: org.apache.beam.sdk.expansion.service.ExpansionService$ExternalTransformRegistrarLoader$1@757277dc
INFO apache_beam.utils.subprocess_server:subprocess_server.py:126 beam:transform:org.apache.beam:kafka_write:v1: org.apache.beam.sdk.expansion.service.ExpansionService$ExternalTransformRegistrarLoader$1@687e99d8
INFO apache_beam.utils.subprocess_server:subprocess_server.py:126 beam:external:java:generate_sequence:v1: org.apache.beam.sdk.expansion.service.ExpansionService$ExternalTransformRegistrarLoader$1@e4487af
INFO apache_beam.utils.subprocess_server:subprocess_server.py:126 beam:transform:pubsub_read:v1: org.apache.beam.sdk.expansion.service.ExpansionService$ExternalTransformRegistrarLoader$$Lambda$82/1153447573@6aaceffd
INFO apache_beam.utils.subprocess_server:subprocess_server.py:126 beam:transform:pubsub_write:v1: org.apache.beam.sdk.expansion.service.ExpansionService$ExternalTransformRegistrarLoader$$Lambda$82/1153447573@c86b9e3
INFO apache_beam.utils.subprocess_server:subprocess_server.py:126 beam:transform:pubsub_write:v2: org.apache.beam.sdk.expansion.service.ExpansionService$ExternalTransformRegistrarLoader$$Lambda$82/1153447573@10aa41f2
INFO apache_beam.utils.subprocess_server:subprocess_server.py:126 beam:transform:combine_globally:v1: org.apache.beam.sdk.expansion.service.ExpansionService$ExternalTransformRegistrarLoader$$Lambda$82/1153447573@3af9c5b7
INFO apache_beam.utils.subprocess_server:subprocess_server.py:126 beam:transform:combine_grouped_values:v1: org.apache.beam.sdk.expansion.service.ExpansionService$ExternalTransformRegistrarLoader$$Lambda$82/1153447573@37271612
INFO apache_beam.utils.subprocess_server:subprocess_server.py:126 beam:transform:combine_per_key:v1: org.apache.beam.sdk.expansion.service.ExpansionService$ExternalTransformRegistrarLoader$$Lambda$82/1153447573@ed7f8b4
INFO apache_beam.utils.subprocess_server:subprocess_server.py:126 beam:transform:create_view:v1: org.apache.beam.sdk.expansion.service.ExpansionService$ExternalTransformRegistrarLoader$$Lambda$82/1153447573@4c309d4d
INFO apache_beam.utils.subprocess_server:subprocess_server.py:126 beam:transform:flatten:v1: org.apache.beam.sdk.expansion.service.ExpansionService$ExternalTransformRegistrarLoader$$Lambda$82/1153447573@38102d01
INFO apache_beam.utils.subprocess_server:subprocess_server.py:126 beam:transform:group_by_key:v1: org.apache.beam.sdk.expansion.service.ExpansionService$ExternalTransformRegistrarLoader$$Lambda$82/1153447573@37883b97
INFO apache_beam.utils.subprocess_server:subprocess_server.py:126 beam:transform:group_into_batches:v1: org.apache.beam.sdk.expansion.service.ExpansionService$ExternalTransformRegistrarLoader$$Lambda$82/1153447573@6ab778a
INFO apache_beam.utils.subprocess_server:subprocess_server.py:126 beam:transform:group_into_batches_with_sharded_key:v1: org.apache.beam.sdk.expansion.service.ExpansionService$ExternalTransformRegistrarLoader$$Lambda$82/1153447573@4e3958e7
INFO apache_beam.utils.subprocess_server:subprocess_server.py:126 beam:transform:impulse:v1: org.apache.beam.sdk.expansion.service.ExpansionService$ExternalTransformRegistrarLoader$$Lambda$82/1153447573@77f80c04
INFO apache_beam.utils.subprocess_server:subprocess_server.py:126 beam:transform:reshuffle:v1: org.apache.beam.sdk.expansion.service.ExpansionService$ExternalTransformRegistrarLoader$$Lambda$82/1153447573@1dac5ef
INFO apache_beam.utils.subprocess_server:subprocess_server.py:126 beam:transform:sdf_process_keyed_elements:v1: org.apache.beam.sdk.expansion.service.ExpansionService$ExternalTransformRegistrarLoader$$Lambda$82/1153447573@5c90e579
INFO apache_beam.utils.subprocess_server:subprocess_server.py:126 beam:transform:teststream:v1: org.apache.beam.sdk.expansion.service.ExpansionService$ExternalTransformRegistrarLoader$$Lambda$82/1153447573@58ea606c
INFO apache_beam.utils.subprocess_server:subprocess_server.py:126 beam:transform:window_into:v1: org.apache.beam.sdk.expansion.service.ExpansionService$ExternalTransformRegistrarLoader$$Lambda$82/1153447573@6f45df59
INFO apache_beam.utils.subprocess_server:subprocess_server.py:126 beam:transform:write_files:v1: org.apache.beam.sdk.expansion.service.ExpansionService$ExternalTransformRegistrarLoader$$Lambda$82/1153447573@38e79ae3
INFO apache_beam.utils.subprocess_server:subprocess_server.py:126
INFO apache_beam.utils.subprocess_server:subprocess_server.py:126 Registered SchemaTransformProviders:
INFO apache_beam.utils.subprocess_server:subprocess_server.py:126 beam:schematransform:org.apache.beam:spanner_cdc_read:v1
INFO apache_beam.utils.subprocess_server:subprocess_server.py:126 beam:schematransform:org.apache.beam:bigtable_write:v1
INFO apache_beam.utils.subprocess_server:subprocess_server.py:126 beam:schematransform:org.apache.beam:spanner_write:v1
INFO apache_beam.utils.subprocess_server:subprocess_server.py:126 beam:schematransform:org.apache.beam:pubsublite_read:v1
INFO apache_beam.utils.subprocess_server:subprocess_server.py:126 beam:schematransform:org.apache.beam:bigquery_storage_read:v1
INFO apache_beam.utils.subprocess_server:subprocess_server.py:126 beam:schematransform:org.apache.beam:bigquery_fileloads_write:v1
INFO apache_beam.utils.subprocess_server:subprocess_server.py:126 beam:schematransform:org.apache.beam:bigquery_export_read:v1
INFO apache_beam.utils.subprocess_server:subprocess_server.py:126 beam:schematransform:org.apache.beam:kafka_read:v1
INFO apache_beam.utils.subprocess_server:subprocess_server.py:126 beam:schematransform:org.apache.beam:kafka_write:v1
INFO apache_beam.utils.subprocess_server:subprocess_server.py:126 beam:schematransform:org.apache.beam:bigquery_storage_write:v2
INFO apache_beam.utils.subprocess_server:subprocess_server.py:126 schematransform:org.apache.beam:sql_transform:v1
INFO apache_beam.utils.subprocess_server:subprocess_server.py:126 beam:schematransform:org.apache.beam:pubsub_read:v1
INFO apache_beam.utils.subprocess_server:subprocess_server.py:126 beam:schematransform:org.apache.beam:pubsub_write:v1
INFO apache_beam.utils.subprocess_server:subprocess_server.py:126 beam:schematransform:org.apache.beam:bigtable_read:v1
INFO apache_beam.utils.subprocess_server:subprocess_server.py:126 beam:schematransform:org.apache.beam:pubsublite_write:v1
INFO apache_beam.utils.subprocess_server:subprocess_server.py:126 Sep 29, 2023 5:53:22 PM org.apache.beam.sdk.expansion.service.ExpansionService expand
INFO apache_beam.utils.subprocess_server:subprocess_server.py:126 INFO: Expanding 'SqlTransform(beam:external:java:sql:v1)' with URN 'beam:external:java:sql:v1'
INFO apache_beam.utils.subprocess_server:subprocess_server.py:126 Dependencies list: {}
INFO apache_beam.utils.subprocess_server:subprocess_server.py:126 Sep 29, 2023 5:53:22 PM org.apache.beam.sdk.expansion.service.ExpansionService$ExternalTransformRegistrarLoader payloadToConfig
INFO apache_beam.utils.subprocess_server:subprocess_server.py:126 WARNING: Configuration class 'org.apache.beam.sdk.extensions.sql.expansion.ExternalSqlTransformRegistrar$Configuration' has no schema registered. Attempting to construct with setter approach.
INFO apache_beam.utils.subprocess_server:subprocess_server.py:126 Sep 29, 2023 5:53:22 PM org.apache.beam.sdk.expansion.service.ExpansionService$ExternalTransformRegistrarLoader payloadToConfig
INFO apache_beam.utils.subprocess_server:subprocess_server.py:126 WARNING: Configuration class 'org.apache.beam.sdk.extensions.sql.expansion.ExternalSqlTransformRegistrar$Configuration' has no schema registered. Attempting to construct with setter approach.
INFO apache_beam.utils.subprocess_server:subprocess_server.py:126 Sep 29, 2023 5:53:24 PM com.google.zetasql.io.grpc.NameResolverRegistry getDefaultRegistry
INFO apache_beam.utils.subprocess_server:subprocess_server.py:126 WARNING: No NameResolverProviders found via ServiceLoader, including for DNS. This is probably due to a broken build. If using ProGuard, check your configuration
INFO apache_beam.utils.subprocess_server:subprocess_server.py:126 Sep 29, 2023 5:53:26 PM org.apache.beam.sdk.extensions.sql.zetasql.ZetaSQLQueryPlanner convertToBeamRelInternal
INFO apache_beam.utils.subprocess_server:subprocess_server.py:126 INFO: BEAMPlan>
INFO apache_beam.utils.subprocess_server:subprocess_server.py:126 BeamZetaSqlCalcRel(expr#0=[{inputs}], expr#1=[1:BIGINT], expr#2=['foo':VARCHAR], expr#3=[3.1400000000000001243E0:DOUBLE], int=[$t1], str=[$t2], flt=[$t3])
INFO apache_beam.utils.subprocess_server:subprocess_server.py:126 BeamValuesRel(tuples=[[{ 0 }]])
INFO apache_beam.utils.subprocess_server:subprocess_server.py:126
INFO root:environments.py:317 No image given, using default Python SDK image
INFO root:environments.py:320 Python SDK container image set to "apache/beam_python3.8_sdk:2.52.0.dev" for Docker environment
INFO apache_beam.runners.portability.fn_api_runner.translations:translations.py:712 ==================== <function pack_combiners at 0x7fd6986fe160> ====================
INFO apache_beam.runners.portability.fn_api_runner.translations:translations.py:712 ==================== <function lift_combiners at 0x7fd6986fe1f0> ====================
INFO apache_beam.runners.portability.fn_api_runner.translations:translations.py:712 ==================== <function sort_stages at 0x7fd6986fe940> ====================
INFO apache_beam.runners.portability.portable_runner:portable_runner.py:549 Job state changed to STOPPED
INFO apache_beam.runners.portability.portable_runner:portable_runner.py:549 Job state changed to STARTING
INFO apache_beam.runners.portability.portable_runner:portable_runner.py:549 Job state changed to RUNNING
INFO root:portable_runner.py:542 ==================== <function annotate_downstream_side_inputs at 0x7f1a58423ca0> ====================
INFO root:portable_runner.py:542 ==================== <function fix_side_input_pcoll_coders at 0x7f1a58423dc0> ====================
INFO root:portable_runner.py:542 ==================== <function pack_combiners at 0x7f1a58427310> ====================
INFO root:portable_runner.py:542 ==================== <function lift_combiners at 0x7f1a584273a0> ====================
INFO root:portable_runner.py:542 ==================== <function expand_sdf at 0x7f1a58427550> ====================
INFO root:portable_runner.py:542 ==================== <function expand_gbk at 0x7f1a584275e0> ====================
INFO root:portable_runner.py:542 ==================== <function sink_flattens at 0x7f1a58427700> ====================
INFO root:portable_runner.py:542 ==================== <function greedily_fuse at 0x7f1a58427790> ====================
INFO root:portable_runner.py:542 ==================== <function read_to_impulse at 0x7f1a58427820> ====================
INFO root:portable_runner.py:542 ==================== <function impulse_to_input at 0x7f1a584278b0> ====================
INFO root:portable_runner.py:542 ==================== <function sort_stages at 0x7f1a58427af0> ====================
INFO root:portable_runner.py:542 ==================== <function add_impulse_to_dangling_transforms at 0x7f1a58427c10> ====================
INFO root:portable_runner.py:542 ==================== <function setup_timer_mapping at 0x7f1a58427a60> ====================
INFO root:portable_runner.py:542 ==================== <function populate_data_channel_coders at 0x7f1a58427b80> ====================
INFO root:portable_runner.py:542 starting control server on port 45075
INFO root:portable_runner.py:542 starting data server on port 38209
INFO root:portable_runner.py:542 starting state server on port 34481
INFO root:portable_runner.py:542 starting logging server on port 45231
INFO root:portable_runner.py:542 Created Worker handler <apache_beam.runners.portability.fn_api_runner.worker_handlers.DockerSdkWorkerHandler object at 0x7f1a8e0dff40> for environment external_9beam:env:docker:v1 (beam:env:docker:v1, b'\n apache/beam_java8_sdk:2.52.0.dev')
INFO root:portable_runner.py:542 Attempting to pull image apache/beam_java8_sdk:2.52.0.dev
INFO root:portable_runner.py:542 Unable to pull image apache/beam_java8_sdk:2.52.0.dev, defaulting to local image if it exists
INFO root:portable_runner.py:542 Waiting for docker to start up. Current status is running
INFO root:portable_runner.py:542 Docker container is running. container_id = b'0c4ebd054323c474a6a5be47b8c40719f31b2f7782afdea6e4fa938dc7fd06f8', worker_id = worker_87
INFO root:portable_runner.py:542 Created Worker handler <apache_beam.runners.portability.fn_api_runner.worker_handlers.DockerSdkWorkerHandler object at 0x7f1a8e0fb5b0> for environment ref_Environment_default_environment_2 (beam:env:docker:v1, b'\n$apache/beam_python3.8_sdk:2.52.0.dev')
INFO root:portable_runner.py:542 Attempting to pull image apache/beam_python3.8_sdk:2.52.0.dev
INFO root:portable_runner.py:542 Unable to pull image apache/beam_python3.8_sdk:2.52.0.dev, defaulting to local image if it exists
INFO root:portable_runner.py:542 Waiting for docker to start up. Current status is running
INFO root:portable_runner.py:542 Docker container is running. container_id = b'8d6830ad6f68cd7567325d4b01d2486fba8cd952ccf17a0ca1b704f702ec3237', worker_id = worker_88
INFO root:portable_runner.py:542 Completed job in 15.974418878555298 seconds with state DONE.
INFO apache_beam.runners.portability.portable_runner:portable_runner.py:549 Job state changed to DONE
PASSED [100%]
=============================== warnings summary ===============================
../../build/gradleenv/1922375555/lib/python3.8/site-packages/hdfs/config.py:28
<https://ci-beam.apache.org/job/beam_PostCommit_XVR_Direct/ws/src/build/gradleenv/1922375555/lib/python3.8/site-packages/hdfs/config.py>:28: DeprecationWarning: the imp module is deprecated in favour of importlib; see the module's documentation for alternative uses
from imp import load_source
apache_beam/transforms/sql_test.py::SqlTransformTest::test_agg
apache_beam/transforms/sql_test.py::SqlTransformTest::test_filter
apache_beam/transforms/sql_test.py::SqlTransformTest::test_generate_data
apache_beam/transforms/sql_test.py::SqlTransformTest::test_map
apache_beam/transforms/sql_test.py::SqlTransformTest::test_project
apache_beam/transforms/sql_test.py::SqlTransformTest::test_row
apache_beam/transforms/sql_test.py::SqlTransformTest::test_tagged_join
apache_beam/transforms/sql_test.py::SqlTransformTest::test_windowing_before_sql
apache_beam/transforms/sql_test.py::SqlTransformTest::test_zetasql_generate_data
<https://ci-beam.apache.org/job/beam_PostCommit_XVR_Direct/ws/src/sdks/python/apache_beam/transforms/external.py>:725: BeamDeprecationWarning: options is deprecated since First stable release. References to <pipeline>.options will not be supported
self._expansion_service, pipeline.options)
-- Docs: https://docs.pytest.org/en/stable/how-to/capture-warnings.html
- generated xml file: <https://ci-beam.apache.org/job/beam_PostCommit_XVR_Direct/ws/src/sdks/python/pytest_xlangSqlValidateRunner.xml> -
=== 9 passed, 17 skipped, 7194 deselected, 10 warnings in 255.68s (0:04:15) ====
> Task :sdks:python:test-suites:direct:xlang:fnApiJobServerCleanup
Killing process at 3322869
> Task :sdks:python:test-suites:direct:xlang:validatesCrossLanguageRunnerCleanup
Stopping expansion service pid: 3331457.
Stopping expansion service pid: 3331458.
FAILURE: Build failed with an exception.
* Where:
Build file '<https://ci-beam.apache.org/job/beam_PostCommit_XVR_Direct/ws/src/sdks/go/test/build.gradle'> line: 235
* What went wrong:
Execution failed for task ':sdks:python:test-suites:direct:xlang:validatesCrossLanguageRunnerGoUsingJava'.
> Process 'command 'sh'' finished with non-zero exit value 1
* Try:
> Run with --stacktrace option to get the stack trace.
> Run with --info or --debug option to get more log output.
* Get more help at https://help.gradle.org
Deprecated Gradle features were used in this build, making it incompatible with Gradle 8.0.
You can use '--warning-mode all' to show the individual deprecation warnings and determine if they come from your own scripts or plugins.
See https://docs.gradle.org/7.6.2/userguide/command_line_interface.html#sec:command_line_warnings
Execution optimizations have been disabled for 1 invalid unit(s) of work during this build to ensure correctness.
Please consult deprecation warnings for more details.
BUILD FAILED in 33m 30s
259 actionable tasks: 172 executed, 75 from cache, 12 up-to-date
Publishing build scan...
https://ge.apache.org/s/q67thvo6kkeru
Build step 'Invoke Gradle script' changed build result to FAILURE
Build step 'Invoke Gradle script' marked build as failure
---------------------------------------------------------------------
To unsubscribe, e-mail: builds-unsubscribe@beam.apache.org
For additional commands, e-mail: builds-help@beam.apache.org
Jenkins build is back to normal : beam_PostCommit_XVR_Direct #4660
Posted by Apache Jenkins Server <je...@builds.apache.org>.
See <https://ci-beam.apache.org/job/beam_PostCommit_XVR_Direct/4660/display/redirect?page=changes>
---------------------------------------------------------------------
To unsubscribe, e-mail: builds-unsubscribe@beam.apache.org
For additional commands, e-mail: builds-help@beam.apache.org
Build failed in Jenkins: beam_PostCommit_XVR_Direct #4659
Posted by Apache Jenkins Server <je...@builds.apache.org>.
See <https://ci-beam.apache.org/job/beam_PostCommit_XVR_Direct/4659/display/redirect>
Changes:
------------------------------------------
[...truncated 1.37 MB...]
urn: "beam:coder:iterable:v1"
>
component_coder_ids: "pdJXvOgImhTimestampedValueCoder"
>
>
coders: <
key: "pdJXvOgImhKvCoder"
value: <
spec: <
urn: "beam:coder:kv:v1"
>
component_coder_ids: "pdJXvOgImhVarIntCoder"
component_coder_ids: "pdJXvOgImhRowCoder"
>
>
coders: <
key: "pdJXvOgImhKvCoder1"
value: <
spec: <
urn: "beam:coder:kv:v1"
>
component_coder_ids: "pdJXvOgImhVarIntCoder"
component_coder_ids: "pdJXvOgImhTimestampedValueCoder"
>
>
coders: <
key: "pdJXvOgImhKvCoder2"
value: <
spec: <
urn: "beam:coder:kv:v1"
>
component_coder_ids: "pdJXvOgImhVarIntCoder"
component_coder_ids: "pdJXvOgImhIterableCoder"
>
>
coders: <
key: "pdJXvOgImhRowCoder"
value: <
spec: <
urn: "beam:coder:row:v1"
payload: "\n\r\n\007role_id\032\002\020\004\022$36977f19-6fa9-4949-9063-a882bd263f8a"
>
>
>
coders: <
key: "pdJXvOgImhTimestampedValueCoder"
value: <
spec: <
urn: "beam:coders:javasdk:0.1"
payload: "\202SNAPPY\000\000\000\000\001\000\000\000\001\000\000\006`\325\026\270\254\355\000\005sr\000Aorg.apache.beam.sdk.values.TimestampedV\001\022\000$>\021\000HCoder\364\376\202p\274iX-\002\000\001L\000\n\005;\005\030\034t\000\"Lorg/\t]\000/\001]\024/sdk/c\0015\004s/\005$\020;xr\000*N\202\000\t%(.Structured\005/8s\277\022\016\325\3246\021\002\000\000xr\000 j9\000\005/\034C\335\325\211\256\274~\370\001/\020psr\000#j1\000\010Row\0054\034\254\236\213\244M\203\363\250\0014\010r\000'N2\000 schemas.S\005\010\0056|\023\226L\354\244P\260l\002\000\004L\000\017fromRowFunctiont\0005R\t\001Xtransforms/Serializable\0217\014;L\000\006\tk\010t\000$RA\000\t\036\004s/\t\211\024;L\000\rto\035x`q\000~\000\007L\000\016typeDescriptort\000+RM\000%\271\010s/T2-\000!\240\000&N\004\001-\240\024Custom%\003\034j\260\010\235\013;\035\013!9\001z\020\003sr\000=N;\000\031\367\000.N\367\000Ds$Identity\033n\367C9'S\320\001R!\277\000\"NN\000-\004-\215da\253Z\320H\204\232h\002\000\007Z\000\033encodingPosi!\211DsOverriddenI\000\010hash\001\272\010L\000\021B)\000\220t\000\017Ljava/util/Map;L\000\014fieldIndicest\000JL>\335\002 vendor/gu\0019Tv32_1_2_jre/com/google\001\0134mon/collect/Bi\t\\\000\006\005\\\014st\000\020\035w$List;L\000\007op\005\275\010t\000,R\271\001-\002M\006\004$O\t.\034;L\000\004uuid6S\000(UUID;xp\000\321\014\231!\240\000\021\001\344\000.\001\344\360L.HashMap\005\007\332\301\303\026`\321\003\000\002F\000\nloadFactorI\000\tthresholdxp?@\000\000\000\000\000\014w\010\000\000\000\020\000\000\000\001t\000\007role_idsr\000\tWdlang.Integer\022\342\240\244\367\201\2078\002\000\001I\000\005Ek\014xr\000\020\005\177\005(4Number\206\254\225\035\013\224\340\213%\362\001b\014xsr\000\001\3652\242\004)h\000.%h\000.=h\020.com.)h\001\013\014mon.-h\000.\001\336%l\001U\001\001(\003\000\000xpw\004\000\000\000\001A\255\000\027\001\005\000\032\001n\000\023\005\224%\023\020Array!\205 x\201\322\035\231\307a\235\003\001\276\024\004sizex\001I\000\001\t@\014sr\0002n\232\002\020AutoV\241?\000_i\250\004_FAH\034\303\343i\345\363l$\364\2052\004\013dm\237\205.\000\022I\004!\030\030/String!\315\014name\001\246\010 L\000Q\022\001\017\014\022L\000\004a\341\010t\000.!)Bn\005:\036\002\005|a\344a\332\000(n\267\000\t\255\t1\034\263\021\225\3324!\217\246%\230\010t\000\000\001y\004\027sZ\273\005\rr\021A\000OI\220\034\367\031\n\2336X\271\227\305&.\301\000\014\017xps\001P\004\025?IU\004\000wQU%\376\0006n\244\000V[\001\001\33749\304m\364S\243\227P\002\000\010L\000\025M\007$ionElement\001#\001u(!L\000\013logical\001\023\010t\0000\216E\001\000L\0312$;L\000\nmapKey\001@\rS\014\014map%\362\035\024 \010metadata\001$\034\017L\000\010null\241\357\010t\000\023=\3604Boolean;L\000\trow)\204\0012\014\010L\000\010!\347\030Namet\000-\216\246\000\001}\001/!\352\000,nF\001\tf)\352\0015\034\013PLl[\357\3103%\356\001\001\014sr\000\036y\027\000C\211\274Lions$EmptyMapY6\024\205Z\334\347\265\253\235\002\r\3224\315 r\200\325\234\372\356\002\000\001Z\000\005\211\002\030p\000p~r\000+\212\234\000\001\227\001\314a\273\001\001\000\022\022\001\010\000\016\005\225a(\020.Enum\001\031\001\001\001\035$pt\000\005INT64xE]\000%\005\006Zc\002\tGe\363\241 x\274\231\003\367\230m\205/\002\000\002J\000\014leastSigBitsJ\000\013mo\025\016Dxp\274%\354!\221\204\353\013\371R1\267\213xIs\005e\014\014sr\000Ro\001\005\364\004s.\001\313\371\216(s$9z\2164\213\005/\271\347!o\010r\000)N\016\001R;\000\034\022\210\327\037Z\244\342\260eR \005tokent\000NB\032\002\251.\222\226\006\010ref\305\226\001\243\000T\001P\000;\345x\000\\>\223\000\tS\222\201\005\rS\005\366\005S\030$Simple\025c!\261\001\001\t\376\001\276\336\354\005Bk\000\0342{#\261\276\3768|%!\030\013runtim\005y\010t\000\030}s\r8\005\366\030;xpvr\000\036>\361\000*\024\013(Row\032Q\006\2060\230\247\034\005X4\006schemaq\000~\000\010xp"
>
>
>
coders: <
key: "pdJXvOgImhVarIntCoder"
value: <
spec: <
urn: "beam:coders:javasdk:0.1"
payload: "\202SNAPPY\000\000\000\000\001\000\000\000\001\000\000\000\210\330\001\350\254\355\000\005sr\000&org.apache.beam.sdk.coders.VarIntCoder\300K2\332\251KVh\002\000\000xrr5\000\024Atomic\0055 \307\354\265\314\205tPF\002\0055\000*jj\000$Structured\0059\034s\277\022\016\325\3246\021\t9\000 j9\000\005/0C\335\325\211\256\274~\370\002\000\000xp"
>
>
>
coders: <
key: "pdJXvOgImhVoidCoder"
value: <
spec: <
urn: "beam:coders:javasdk:0.1"
payload: "\202SNAPPY\000\000\000\000\001\000\000\000\001\000\000\000\210\326\001\350\254\355\000\005sr\000$org.apache.beam.sdk.coders.VoidCoder\271\277U\233\350\r\257U\002\000\000xr\000&j3\000\024Atomic\0055 \307\354\265\314\205tPF\002\0055\000*j5\000$Structured\0059\034s\277\022\016\325\3246\021\t9\000 j9\000\005/0C\335\325\211\256\274~\370\002\000\000xp"
>
>
>
environments: <
key: "go"
value: <
urn: "beam:env:docker:v1"
payload: "\n\026apache/beam_go_sdk:dev"
capabilities: "beam:protocol:progress_reporting:v1"
capabilities: "beam:protocol:multi_core_bundle_processing:v1"
capabilities: "beam:transform:sdf_truncate_sized_restrictions:v1"
capabilities: "beam:protocol:worker_status:v1"
capabilities: "beam:protocol:monitoring_info_short_ids:v1"
capabilities: "beam:version:sdk_base:go:apache/beam_go_sdk:2.52.0.dev"
capabilities: "beam:transform:to_string:v1"
capabilities: "beam:coder:bytes:v1"
capabilities: "beam:coder:bool:v1"
capabilities: "beam:coder:varint:v1"
capabilities: "beam:coder:double:v1"
capabilities: "beam:coder:string_utf8:v1"
capabilities: "beam:coder:length_prefix:v1"
capabilities: "beam:coder:kv:v1"
capabilities: "beam:coder:iterable:v1"
capabilities: "beam:coder:state_backed_iterable:v1"
capabilities: "beam:coder:windowed_value:v1"
capabilities: "beam:coder:global_window:v1"
capabilities: "beam:coder:interval_window:v1"
capabilities: "beam:coder:row:v1"
capabilities: "beam:coder:nullable:v1"
capabilities: "beam:coder:timer:v1"
dependencies: <
type_urn: "beam:artifact:type:file:v1"
role_urn: "beam:artifact:role:go_worker_binary:v1"
>
>
>
environments: <
key: "pdJXvOgImhbeam:env:docker:v1"
value: <
urn: "beam:env:docker:v1"
payload: "\n apache/beam_java8_sdk:2.52.0.dev"
capabilities: "beam:coder:bytes:v1"
capabilities: "beam:coder:bool:v1"
capabilities: "beam:coder:varint:v1"
capabilities: "beam:coder:string_utf8:v1"
capabilities: "beam:coder:iterable:v1"
capabilities: "beam:coder:timer:v1"
capabilities: "beam:coder:kv:v1"
capabilities: "beam:coder:length_prefix:v1"
capabilities: "beam:coder:global_window:v1"
capabilities: "beam:coder:interval_window:v1"
capabilities: "beam:coder:custom_window:v1"
capabilities: "beam:coder:windowed_value:v1"
capabilities: "beam:coder:double:v1"
capabilities: "beam:coder:row:v1"
capabilities: "beam:coder:param_windowed_value:v1"
capabilities: "beam:coder:state_backed_iterable:v1"
capabilities: "beam:coder:sharded_key:v1"
capabilities: "beam:coder:nullable:v1"
capabilities: "beam:protocol:multi_core_bundle_processing:v1"
capabilities: "beam:protocol:progress_reporting:v1"
capabilities: "beam:protocol:harness_monitoring_infos:v1"
capabilities: "beam:protocol:control_request_elements_embedding:v1"
capabilities: "beam:protocol:state_caching:v1"
capabilities: "beam:version:sdk_base:apache/beam_java8_sdk:2.52.0.dev"
capabilities: "beam:transform:sdf_truncate_sized_restrictions:v1"
capabilities: "beam:transform:to_string:v1"
capabilities: "beam:protocol:data_sampling:v1"
dependencies: <
type_urn: "beam:artifact:type:file:v1"
type_payload: "\n\203\001/tmp/artifacts/beam-sdks-java-extensions-schemaio-expansion-service-2.52.0-SNAPSHOT-LfIeD2zDxt5WSr9CQgfYQ3len-1dzKSJ-Lrr8smkaNY.jar\022@2df21e0f6cc3c6de564abf424207d843795e9fed5dcca489f8baebf2c9a468d6"
role_urn: "beam:artifact:role:staging_to:v1"
role_payload: "\ntbeam-sdks-java-extensions-schemaio-expansion-service-2.52.0-SNAPSHOT-LfIeD2zDxt5WSr9CQgfYQ3len-1dzKSJ-Lrr8smkaNY.jar"
>
>
>
>
root_transform_ids: "s1"
root_transform_ids: "e2"
root_transform_ids: "e3"
root_transform_ids: "s3"
2023/09/29 23:22:09 Cross-compiling <https://ci-beam.apache.org/job/beam_PostCommit_XVR_Direct/ws/src/sdks/go/test/integration/io/xlang/jdbc/jdbc_test.go> with GOOS=linux GOARCH=amd64 CGO_ENABLED=0 as /tmp/worker-4-1696029729638124250
2023/09/29 23:22:12 Prepared job with id: go-testjdbcio_postgresreadwrite-350-0cf2d83b-18bc-42e6-acf9-9412ede06996 and staging token: go-testjdbcio_postgresreadwrite-350-0cf2d83b-18bc-42e6-acf9-9412ede06996
2023/09/29 23:22:12 Staged binary artifact with token: go-testjdbcio_postgresreadwrite-350-0cf2d83b-18bc-42e6-acf9-9412ede06996
2023/09/29 23:22:12 Submitted job: go-testjdbcio_postgresreadwrite-350-0cf2d83b-18bc-42e6-acf9-9412ede06996
2023/09/29 23:22:12 Job[go-testjdbcio_postgresreadwrite-350-0cf2d83b-18bc-42e6-acf9-9412ede06996] state: STOPPED
2023/09/29 23:22:12 Job[go-testjdbcio_postgresreadwrite-350-0cf2d83b-18bc-42e6-acf9-9412ede06996] state: STARTING
2023/09/29 23:22:12 Job[go-testjdbcio_postgresreadwrite-350-0cf2d83b-18bc-42e6-acf9-9412ede06996] state: RUNNING
2023/09/29 23:22:12 2023-09-29 23:22:12. (1): ==================== <function annotate_downstream_side_inputs at 0x7f7a2e4caca0> ====================
2023/09/29 23:22:12 2023-09-29 23:22:12. (2): ==================== <function fix_side_input_pcoll_coders at 0x7f7a2e4cadc0> ====================
2023/09/29 23:22:12 2023-09-29 23:22:12. (3): ==================== <function pack_combiners at 0x7f7a2e4c9310> ====================
2023/09/29 23:22:12 2023-09-29 23:22:12. (4): ==================== <function lift_combiners at 0x7f7a2e4c93a0> ====================
2023/09/29 23:22:12 2023-09-29 23:22:12. (5): ==================== <function expand_sdf at 0x7f7a2e4c9550> ====================
2023/09/29 23:22:12 2023-09-29 23:22:12. (6): ==================== <function expand_gbk at 0x7f7a2e4c95e0> ====================
2023/09/29 23:22:12 2023-09-29 23:22:12. (7): ==================== <function sink_flattens at 0x7f7a2e4c9700> ====================
2023/09/29 23:22:12 2023-09-29 23:22:12. (8): ==================== <function greedily_fuse at 0x7f7a2e4c9790> ====================
2023/09/29 23:22:12 2023-09-29 23:22:12. (9): ==================== <function read_to_impulse at 0x7f7a2e4c9820> ====================
2023/09/29 23:22:12 2023-09-29 23:22:12. (10): ==================== <function impulse_to_input at 0x7f7a2e4c98b0> ====================
2023/09/29 23:22:12 2023-09-29 23:22:12. (11): ==================== <function sort_stages at 0x7f7a2e4c9af0> ====================
2023/09/29 23:22:12 2023-09-29 23:22:12. (12): ==================== <function add_impulse_to_dangling_transforms at 0x7f7a2e4c9c10> ====================
2023/09/29 23:22:12 2023-09-29 23:22:12. (13): ==================== <function setup_timer_mapping at 0x7f7a2e4c9a60> ====================
2023/09/29 23:22:12 2023-09-29 23:22:12. (14): ==================== <function populate_data_channel_coders at 0x7f7a2e4c9b80> ====================
2023/09/29 23:22:12 2023-09-29 23:22:12. (15): starting control server on port 46667
2023/09/29 23:22:12 2023-09-29 23:22:12. (16): starting data server on port 39503
2023/09/29 23:22:12 2023-09-29 23:22:12. (17): starting state server on port 46163
2023/09/29 23:22:12 2023-09-29 23:22:12. (18): starting logging server on port 41487
2023/09/29 23:22:12 2023-09-29 23:22:12. (19): Created Worker handler <apache_beam.runners.portability.fn_api_runner.worker_handlers.DockerSdkWorkerHandler object at 0x7f7a63b88d30> for environment pdJXvOgImhbeam:env:docker:v1 (beam:env:docker:v1, b'\n apache/beam_java8_sdk:2.52.0.dev')
2023/09/29 23:22:15 2023-09-29 23:22:15. (20): Attempting to pull image apache/beam_java8_sdk:2.52.0.dev
2023/09/29 23:22:16 2023-09-29 23:22:16. (21): Unable to pull image apache/beam_java8_sdk:2.52.0.dev, defaulting to local image if it exists
2023/09/29 23:22:17 2023-09-29 23:22:17. (22): Waiting for docker to start up. Current status is running
2023/09/29 23:22:17 2023-09-29 23:22:17. (23): Docker container is running. container_id = b'729559e8619b91101ffab827e1eb54095270e5adf1d5500079d23d31f1f81e8e', worker_id = worker_15
2023/09/29 23:22:18 2023-09-29 23:22:18. (24): Created Worker handler <apache_beam.runners.portability.fn_api_runner.worker_handlers.DockerSdkWorkerHandler object at 0x7f7a63bf4640> for environment go (beam:env:docker:v1, b'\n\x16apache/beam_go_sdk:dev')
2023/09/29 23:22:20 2023-09-29 23:22:20. (25): Attempting to pull image apache/beam_go_sdk:dev
2023/09/29 23:22:21 2023-09-29 23:22:21. (26): Unable to pull image apache/beam_go_sdk:dev, defaulting to local image if it exists
2023/09/29 23:22:22 2023-09-29 23:22:22. (27): Waiting for docker to start up. Current status is running
2023/09/29 23:22:22 2023-09-29 23:22:22. (28): Docker container is running. container_id = b'9fce8ce65030203ee413afc71c03baef2d2e54755ce6450899a0d11ccb0d0fd4', worker_id = worker_17
2023/09/29 23:22:25 2023-09-29 23:22:25. (29): Completed job in 13.401489973068237 seconds with state DONE.
2023/09/29 23:22:25 Job[go-testjdbcio_postgresreadwrite-350-0cf2d83b-18bc-42e6-acf9-9412ede06996] state: DONE
2023/09/29 23:22:25 🐳 Terminating container: 80dd1157e586
2023/09/29 23:22:26 🚫 Container terminated: 80dd1157e586
--- PASS: TestJDBCIO_PostgresReadWrite (41.84s)
FAIL
FAIL github.com/apache/beam/sdks/v2/go/test/integration/io/xlang/jdbc 125.696s
=== RUN TestKafkaIO_BasicReadWrite
integration.go:364: Test TestKafkaIO_BasicReadWrite is currently filtered for runner portable
--- SKIP: TestKafkaIO_BasicReadWrite (0.00s)
PASS
ok github.com/apache/beam/sdks/v2/go/test/integration/io/xlang/kafka 6.055s
FAIL
> Task :sdks:python:test-suites:direct:xlang:validatesCrossLanguageRunnerGoUsingJava FAILED
> Task :sdks:python:test-suites:direct:xlang:validatesCrossLanguageRunnerJavaUsingPython
INFO:root:No image given, using default Python SDK image
INFO:root:Python SDK container image set to "apache/beam_python3.8_sdk:2.50.0" for Docker environment
INFO:__main__:Listening for expansion requests at 43929
INFO:root:Missing pipeline option (runner). Executing pipeline using the default runner: DirectRunner.
INFO:__main__:Shutting down expansion service.
INFO:apache_beam.runners.portability.stager:Executing command: ['/home/jenkins/.apache_beam/cache/venvs/py-3.8-beam-2.50.0-743bdccef67087512a7a190820e727aab7bdcb14/bin/python', '-m', 'pip', 'download', '--dest', '/tmp/dataflow-requirements-cache', '-r', '/tmp/tmpa77xfl56/tmp_requirements.txt', '--exists-action', 'i', '--no-deps', '--implementation', 'cp', '--abi', 'cp38', '--platform', 'manylinux2014_x86_64']
INFO:root:No image given, using default Python SDK image
INFO:root:Python SDK container image set to "apache/beam_python3.8_sdk:2.50.0" for Docker environment
INFO:__main__:Listening for expansion requests at 37401
INFO:root:Missing pipeline option (runner). Executing pipeline using the default runner: DirectRunner.
INFO:__main__:Shutting down expansion service.
> Task :sdks:python:test-suites:direct:xlang:validatesCrossLanguageRunnerPythonUsingJava
> Task :sdks:python:test-suites:direct:xlang:validatesCrossLanguageRunnerPythonUsingSql
> Task :sdks:python:test-suites:direct:xlang:fnApiJobServerCleanup
> Task :sdks:python:test-suites:direct:xlang:validatesCrossLanguageRunnerCleanup
FAILURE: Build failed with an exception.
* Where:
Build file '<https://ci-beam.apache.org/job/beam_PostCommit_XVR_Direct/ws/src/sdks/go/test/build.gradle'> line: 235
* What went wrong:
Execution failed for task ':sdks:python:test-suites:direct:xlang:validatesCrossLanguageRunnerGoUsingJava'.
> Process 'command 'sh'' finished with non-zero exit value 1
* Try:
> Run with --stacktrace option to get the stack trace.
> Run with --info or --debug option to get more log output.
* Get more help at https://help.gradle.org
Deprecated Gradle features were used in this build, making it incompatible with Gradle 8.0.
You can use '--warning-mode all' to show the individual deprecation warnings and determine if they come from your own scripts or plugins.
See https://docs.gradle.org/7.6.2/userguide/command_line_interface.html#sec:command_line_warnings
Execution optimizations have been disabled for 1 invalid unit(s) of work during this build to ensure correctness.
Please consult deprecation warnings for more details.
BUILD FAILED in 35m 1s
259 actionable tasks: 169 executed, 78 from cache, 12 up-to-date
Publishing build scan...
https://ge.apache.org/s/5henerh6c3tle
Build step 'Invoke Gradle script' changed build result to FAILURE
Build step 'Invoke Gradle script' marked build as failure
---------------------------------------------------------------------
To unsubscribe, e-mail: builds-unsubscribe@beam.apache.org
For additional commands, e-mail: builds-help@beam.apache.org