You are viewing a plain text version of this content. The canonical link for it is here.
Posted to notifications@qpid.apache.org by Apache Jenkins Server <je...@builds.apache.org> on 2016/12/04 13:44:42 UTC
Build failed in Jenkins: Qpid-Java-JoramJMSTest » JDK 1.7 (latest),Ubuntu,qpid-jms-client #890
See <https://builds.apache.org/job/Qpid-Java-JoramJMSTest/jdk=JDK%201.7%20(latest),label=Ubuntu,qpid.joramtests=qpid-jms-client/890/changes>
Changes:
[rgodfrey] QPID-7568 : Update support for delayed delivery in AMQP 1.0
[rgodfrey] QPID-7572 : Parameterize consumer with the consumer target type
------------------------------------------
[...truncated 34771 lines...]
[echo] [profile.virtualhostnode.type] Memory
[echo] [profile.virtualhostnode.context.blueprint] {"type":"ProvidedStore","globalAddressDomains":"${qpid.globalAddressDomains}"}
[echo] [profile.test_receive_timeout] 1000
[INFO] Executed tasks
[INFO]
[INFO] --- maven-enforcer-plugin:1.3.1:enforce (enforce-minimum-versions) @ qpid-java-doc-jms-client-0-8 ---
[INFO]
[INFO] --- maven-enforcer-plugin:1.3.1:enforce (enforce-versions-standard-properties) @ qpid-java-doc-jms-client-0-8 ---
[INFO]
[INFO] --- jacoco-maven-plugin:0.7.5.201505241946:prepare-agent (default-prepare-agent) @ qpid-java-doc-jms-client-0-8 ---
[INFO] argLine set to "-javaagent:/home/jenkins/.m2/repository/org/jacoco/org.jacoco.agent/0.7.5.201505241946/org.jacoco.agent-0.7.5.201505241946-runtime.jar=destfile=<https://builds.apache.org/job/Qpid-Java-JoramJMSTest/jdk=JDK%201.7%20(latest),label=Ubuntu,qpid.joramtests=qpid-jms-client/ws/trunk/doc/jms-client-0-8/target/jacoco.exec"> -Xmx512m
[INFO]
[INFO] --- maven-resources-plugin:2.6:copy-resources (filter-docbook-sources) @ qpid-java-doc-jms-client-0-8 ---
[INFO] Using 'UTF-8' encoding to copy filtered resources.
[INFO] Copying 17 resources
[INFO]
[INFO] --- maven-remote-resources-plugin:1.5:process (default) @ qpid-java-doc-jms-client-0-8 ---
[INFO]
[INFO] --- maven-resources-plugin:2.6:resources (default-resources) @ qpid-java-doc-jms-client-0-8 ---
[INFO] Using 'UTF-8' encoding to copy filtered resources.
[INFO] Copying 17 resources
[INFO]
[INFO] --- maven-compiler-plugin:3.1:compile (default-compile) @ qpid-java-doc-jms-client-0-8 ---
[INFO] No sources to compile
[INFO]
[INFO] --- maven-resources-plugin:2.6:testResources (default-testResources) @ qpid-java-doc-jms-client-0-8 ---
[INFO] Using 'UTF-8' encoding to copy filtered resources.
[INFO] Copying 17 resources
[INFO]
[INFO] --- maven-compiler-plugin:3.1:testCompile (default-testCompile) @ qpid-java-doc-jms-client-0-8 ---
[INFO] No sources to compile
[INFO]
[INFO] --- maven-surefire-plugin:2.17:test (default-test) @ qpid-java-doc-jms-client-0-8 ---
[INFO] Tests are skipped.
[INFO]
[INFO] --- maven-jar-plugin:2.5:jar (default-jar) @ qpid-java-doc-jms-client-0-8 ---
[INFO] Skipping packaging of the jar
[INFO]
[INFO] --- maven-site-plugin:3.4:attach-descriptor (attach-descriptor) @ qpid-java-doc-jms-client-0-8 ---
[INFO]
[INFO] --- maven-assembly-plugin:2.4.1:single (default) @ qpid-java-doc-jms-client-0-8 ---
[INFO] Assemblies have been skipped per configuration of the skipAssembly parameter.
[INFO]
[INFO] ------------------------------------------------------------------------
[INFO] Building Apache Qpid JMS Client for AMQP 0-10 Docbook 6.2.0-SNAPSHOT
[INFO] ------------------------------------------------------------------------
[INFO]
[INFO] --- maven-clean-plugin:2.5:clean (default-clean) @ qpid-java-doc-jms-client-0-10 ---
[INFO]
[INFO] --- maven-antrun-plugin:1.7:run (output-test-properties) @ qpid-java-doc-jms-client-0-10 ---
[INFO] Executing tasks
main:
[echo] Qpid Test Profile Properties
[echo] [profile] java-mms.0-10
[echo] [profile.broker.language] java
[echo] [profile.broker.type] internal
[echo] [profile.broker.command] "<https://builds.apache.org/job/Qpid-Java-JoramJMSTest/jdk=JDK%201.7%20(latest),label=Ubuntu,qpid.joramtests=qpid-jms-client/ws/trunk/doc/jms-client-0-10/bin/qpid-server"> -sp "@STORE_PATH" -st @STORE_TYPE -prop test.port=@PORT -prop "qpid.work_dir=@QPID_WORK"
[echo] [profile.specific.excludes] JavaTransientExcludes Java010Excludes
[echo] [profile.test.excludes] Excludes JavaExcludes java-mms.0-10.excludes JavaTransientExcludes Java010Excludes
[echo] [profile.broker.version] v0_10
[echo] [profile.test.amqp_port_protocols] ["AMQP_0_8","AMQP_0_9","AMQP_0_9_1","AMQP_0_10"]
[echo] [profile.broker.persistent] false
[echo] [profile.virtualhostnode.type] Memory
[echo] [profile.virtualhostnode.context.blueprint] {"type":"ProvidedStore","globalAddressDomains":"${qpid.globalAddressDomains}"}
[echo] [profile.test_receive_timeout] 1000
[INFO] Executed tasks
[INFO]
[INFO] --- maven-enforcer-plugin:1.3.1:enforce (enforce-minimum-versions) @ qpid-java-doc-jms-client-0-10 ---
[INFO]
[INFO] --- maven-enforcer-plugin:1.3.1:enforce (enforce-versions-standard-properties) @ qpid-java-doc-jms-client-0-10 ---
[INFO]
[INFO] --- jacoco-maven-plugin:0.7.5.201505241946:prepare-agent (default-prepare-agent) @ qpid-java-doc-jms-client-0-10 ---
[INFO] argLine set to "-javaagent:/home/jenkins/.m2/repository/org/jacoco/org.jacoco.agent/0.7.5.201505241946/org.jacoco.agent-0.7.5.201505241946-runtime.jar=destfile=<https://builds.apache.org/job/Qpid-Java-JoramJMSTest/jdk=JDK%201.7%20(latest),label=Ubuntu,qpid.joramtests=qpid-jms-client/ws/trunk/doc/jms-client-0-10/target/jacoco.exec"> -Xmx512m
[INFO]
[INFO] --- maven-resources-plugin:2.6:copy-resources (filter-docbook-sources) @ qpid-java-doc-jms-client-0-10 ---
[INFO] Using 'UTF-8' encoding to copy filtered resources.
[INFO] Copying 1 resource
[INFO]
[INFO] --- maven-remote-resources-plugin:1.5:process (default) @ qpid-java-doc-jms-client-0-10 ---
[INFO]
[INFO] --- maven-resources-plugin:2.6:resources (default-resources) @ qpid-java-doc-jms-client-0-10 ---
[INFO] Using 'UTF-8' encoding to copy filtered resources.
[INFO] Copying 1 resource
[INFO]
[INFO] --- maven-compiler-plugin:3.1:compile (default-compile) @ qpid-java-doc-jms-client-0-10 ---
[INFO] No sources to compile
[INFO]
[INFO] --- maven-resources-plugin:2.6:testResources (default-testResources) @ qpid-java-doc-jms-client-0-10 ---
[INFO] Using 'UTF-8' encoding to copy filtered resources.
[INFO] Copying 1 resource
[INFO]
[INFO] --- maven-compiler-plugin:3.1:testCompile (default-testCompile) @ qpid-java-doc-jms-client-0-10 ---
[INFO] No sources to compile
[INFO]
[INFO] --- maven-surefire-plugin:2.17:test (default-test) @ qpid-java-doc-jms-client-0-10 ---
[INFO] Tests are skipped.
[INFO]
[INFO] --- maven-jar-plugin:2.5:jar (default-jar) @ qpid-java-doc-jms-client-0-10 ---
[INFO] Skipping packaging of the jar
[INFO]
[INFO] --- maven-site-plugin:3.4:attach-descriptor (attach-descriptor) @ qpid-java-doc-jms-client-0-10 ---
[INFO]
[INFO] --- maven-assembly-plugin:2.4.1:single (default) @ qpid-java-doc-jms-client-0-10 ---
[INFO] Assemblies have been skipped per configuration of the skipAssembly parameter.
[INFO]
[INFO] ------------------------------------------------------------------------
[INFO] Building Apache Qpid Performance Test Docbook 6.2.0-SNAPSHOT
[INFO] ------------------------------------------------------------------------
[INFO]
[INFO] --- maven-clean-plugin:2.5:clean (default-clean) @ qpid-java-doc-perftests ---
[INFO]
[INFO] --- maven-antrun-plugin:1.7:run (output-test-properties) @ qpid-java-doc-perftests ---
[INFO] Executing tasks
main:
[echo] Qpid Test Profile Properties
[echo] [profile] java-mms.0-10
[echo] [profile.broker.language] java
[echo] [profile.broker.type] internal
[echo] [profile.broker.command] "<https://builds.apache.org/job/Qpid-Java-JoramJMSTest/jdk=JDK%201.7%20(latest),label=Ubuntu,qpid.joramtests=qpid-jms-client/ws/trunk/doc/java-perftests/bin/qpid-server"> -sp "@STORE_PATH" -st @STORE_TYPE -prop test.port=@PORT -prop "qpid.work_dir=@QPID_WORK"
[echo] [profile.specific.excludes] JavaTransientExcludes Java010Excludes
[echo] [profile.test.excludes] Excludes JavaExcludes java-mms.0-10.excludes JavaTransientExcludes Java010Excludes
[echo] [profile.broker.version] v0_10
[echo] [profile.test.amqp_port_protocols] ["AMQP_0_8","AMQP_0_9","AMQP_0_9_1","AMQP_0_10"]
[echo] [profile.broker.persistent] false
[echo] [profile.virtualhostnode.type] Memory
[echo] [profile.virtualhostnode.context.blueprint] {"type":"ProvidedStore","globalAddressDomains":"${qpid.globalAddressDomains}"}
[echo] [profile.test_receive_timeout] 1000
[INFO] Executed tasks
[INFO]
[INFO] --- maven-enforcer-plugin:1.3.1:enforce (enforce-minimum-versions) @ qpid-java-doc-perftests ---
[INFO]
[INFO] --- maven-enforcer-plugin:1.3.1:enforce (enforce-versions-standard-properties) @ qpid-java-doc-perftests ---
[INFO]
[INFO] --- jacoco-maven-plugin:0.7.5.201505241946:prepare-agent (default-prepare-agent) @ qpid-java-doc-perftests ---
[INFO] argLine set to "-javaagent:/home/jenkins/.m2/repository/org/jacoco/org.jacoco.agent/0.7.5.201505241946/org.jacoco.agent-0.7.5.201505241946-runtime.jar=destfile=<https://builds.apache.org/job/Qpid-Java-JoramJMSTest/jdk=JDK%201.7%20(latest),label=Ubuntu,qpid.joramtests=qpid-jms-client/ws/trunk/doc/java-perftests/target/jacoco.exec"> -Xmx512m
[INFO]
[INFO] --- maven-resources-plugin:2.6:copy-resources (filter-docbook-sources) @ qpid-java-doc-perftests ---
[INFO] Using 'UTF-8' encoding to copy filtered resources.
[INFO] Copying 1 resource
[INFO]
[INFO] --- maven-remote-resources-plugin:1.5:process (default) @ qpid-java-doc-perftests ---
[INFO]
[INFO] --- maven-resources-plugin:2.6:resources (default-resources) @ qpid-java-doc-perftests ---
[INFO] Using 'UTF-8' encoding to copy filtered resources.
[INFO] Copying 1 resource
[INFO]
[INFO] --- maven-compiler-plugin:3.1:compile (default-compile) @ qpid-java-doc-perftests ---
[INFO] No sources to compile
[INFO]
[INFO] --- maven-resources-plugin:2.6:testResources (default-testResources) @ qpid-java-doc-perftests ---
[INFO] Using 'UTF-8' encoding to copy filtered resources.
[INFO] Copying 1 resource
[INFO]
[INFO] --- maven-compiler-plugin:3.1:testCompile (default-testCompile) @ qpid-java-doc-perftests ---
[INFO] No sources to compile
[INFO]
[INFO] --- maven-surefire-plugin:2.17:test (default-test) @ qpid-java-doc-perftests ---
[INFO] Tests are skipped.
[INFO]
[INFO] --- maven-jar-plugin:2.5:jar (default-jar) @ qpid-java-doc-perftests ---
[INFO] Skipping packaging of the jar
[INFO]
[INFO] --- maven-site-plugin:3.4:attach-descriptor (attach-descriptor) @ qpid-java-doc-perftests ---
[INFO]
[INFO] --- maven-assembly-plugin:2.4.1:single (default) @ qpid-java-doc-perftests ---
[INFO] Assemblies have been skipped per configuration of the skipAssembly parameter.
[INFO] ------------------------------------------------------------------------
[INFO] Reactor Summary:
[INFO]
[INFO] Apache Qpid for Java ............................... SUCCESS [ 15.092 s]
[INFO] Apache Qpid Broker Code Generation ................. SUCCESS [ 2.848 s]
[INFO] Apache Qpid Test Utilities ......................... SUCCESS [ 10.261 s]
[INFO] Apache Qpid Common ................................. SUCCESS [ 12.342 s]
[INFO] Apache Qpid Broker Core ............................ FAILURE [ 33.526 s]
[INFO] Apache Qpid LogBack Logging Broker Plug-in ......... SKIPPED
[INFO] Apache Qpid Access Control Broker Plug-in .......... SKIPPED
[INFO] Apache Qpid AMQP 0-8 Protocol Broker Plug-in ....... SKIPPED
[INFO] Apache Qpid AMQP 0-10 Protocol Plug-in ............. SKIPPED
[INFO] Apache Qpid AMQP 1-0 Protocol Broker Plug-in ....... SKIPPED
[INFO] Apache Qpid AMQP 0-8 to 0-10 Message Conversion Broker Plug-in SKIPPED
[INFO] Apache Qpid AMQP 0-8 to 1-0 Message Conversion Broker Plug-in SKIPPED
[INFO] Apache Qpid AMQP 0-10 to 1-0 Message Conversion Broker Plug-in SKIPPED
[INFO] Apache Qpid Derby Message Store Broker Plug-in ..... SKIPPED
[INFO] Apache Qpid JDBC Message Store Connection Pooling Plug-in SKIPPED
[INFO] Apache Qpid JDBC Message Store Broker Plug-in ...... SKIPPED
[INFO] Apache Qpid HTTP Management Broker Plug-in ......... SKIPPED
[INFO] Apache Qpid AMQP Management Protocol Broker Plug-in SKIPPED
[INFO] Apache Qpid Memory Message Store Broker Plug-in .... SKIPPED
[INFO] Apache Qpid WebSocket Broker Plug-in ............... SKIPPED
[INFO] Apache Qpid JMS Client for AMQP 0-9-1/0-10 ......... SUCCESS [ 2.535 s]
[INFO] Apache Qpid BDB Message Store Broker Plug-in ....... SKIPPED
[INFO] Apache Qpid Broker for Java ........................ SKIPPED
[INFO] Apache Qpid Client for AMQP 0-9-1/0-10 Examples .... SUCCESS [ 0.318 s]
[INFO] Apache Qpid JCA .................................... SUCCESS [ 9.713 s]
[INFO] Apache Qpid Resource Adaptor ....................... SUCCESS [ 0.657 s]
[INFO] Apache Qpid Tools .................................. SUCCESS [ 0.445 s]
[INFO] Apache Qpid System Test Parent ..................... SUCCESS [ 3.040 s]
[INFO] Apache Qpid System Tests ........................... SKIPPED
[INFO] Apache Qpid Performance Tests ...................... SUCCESS [ 11.962 s]
[INFO] Apache Qpid Performance Test System Tests .......... SKIPPED
[INFO] Apache Qpid Performance Tests Visualisation JFC .... SUCCESS [ 4.763 s]
[INFO] Apache Qpid BDB Store System Tests ................. SKIPPED
[INFO] Apache Qpid Joram JMS Tests ........................ SUCCESS [ 3.728 s]
[INFO] Apache Qpid JMS TCK Configuration .................. SUCCESS [ 0.270 s]
[INFO] Apache Qpid for Java Docbook ....................... SUCCESS [ 0.085 s]
[INFO] Apache Qpid Broker for Java Docbook ................ SUCCESS [ 0.544 s]
[INFO] Apache Qpid JMS Client for AMQP 0-8, 0-9 and 0-9-1 Docbook SUCCESS [ 0.192 s]
[INFO] Apache Qpid JMS Client for AMQP 0-10 Docbook ....... SUCCESS [ 0.161 s]
[INFO] Apache Qpid Performance Test Docbook ............... SUCCESS [ 0.106 s]
[INFO] ------------------------------------------------------------------------
[INFO] BUILD FAILURE
[INFO] ------------------------------------------------------------------------
[INFO] Total time: 01:55 min
[INFO] Finished at: 2016-12-04T13:44:16+00:00
[INFO] Final Memory: 60M/431M
[INFO] ------------------------------------------------------------------------
[ERROR] Failed to execute goal org.apache.maven.plugins:maven-compiler-plugin:3.1:testCompile (default-testCompile) on project qpid-broker-core: Compilation failure
[ERROR] <https://builds.apache.org/job/Qpid-Java-JoramJMSTest/jdk=JDK%201.7%20(latest),label=Ubuntu,qpid.joramtests=qpid-jms-client/ws/trunk/broker-core/src/test/java/org/apache/qpid/server/message/AbstractServerMessageTest.java>:[35,20] org.apache.qpid.server.message.AbstractServerMessageTest.TestMessage is not abstract and does not override abstract method isResourceAcceptable(org.apache.qpid.server.store.TransactionLogResource) in org.apache.qpid.server.message.ServerMessage
[ERROR] -> [Help 1]
[ERROR]
[ERROR] To see the full stack trace of the errors, re-run Maven with the -e switch.
[ERROR] Re-run Maven using the -X switch to enable full debug logging.
[ERROR]
[ERROR] For more information about the errors and possible solutions, please read the following articles:
[ERROR] [Help 1] http://cwiki.apache.org/confluence/display/MAVEN/MojoFailureException
[ERROR]
[ERROR] After correcting the problems, you can resume the build with the command
[ERROR] mvn <goals> -rf :qpid-broker-core
Build step 'Invoke top-level Maven targets' marked build as failure
Performing Post build task...
Match found for : : True
Logical operation result is TRUE
Running script : #!/bin/bash -x
if [[ "${BROKER_PID}" ]]
then
echo Killing broker "${BROKER_PID}"
kill -15 "${BROKER_PID}"
fi
[qpid-jms-client] $ /bin/bash -x /tmp/hudson28464223061962923.sh
+ [[ -n '' ]]
POST BUILD TASK : SUCCESS
END OF POST BUILD TASK : 0
Archiving artifacts
Recording test results
ERROR: Step ‘Publish JUnit test result report’ failed: No test report files were found. Configuration error?