You are viewing a plain text version of this content. The canonical link for it is here.
Posted to reviews@mesos.apache.org by Gaston Kleiman <ga...@mesosphere.io> on 2017/12/12 01:48:11 UTC
Review Request 64522: WIP: try to make tests pass on Windows.
-----------------------------------------------------------
This is an automatically generated e-mail. To reply, visit:
https://reviews.apache.org/r/64522/
-----------------------------------------------------------
Review request for mesos.
Repository: mesos
Description
-------
WIP: try to make tests pass on Windows.
Diffs
-----
src/tests/offer_operation_status_update_manager_tests.cpp a5327d3d070a390f2ceb918dc53a024fbfe8777e
Diff: https://reviews.apache.org/r/64522/diff/1/
Testing
-------
Thanks,
Gaston Kleiman
Re: Review Request 64522: WIP: try to make tests pass on Windows.
Posted by Mesos Reviewbot Windows <re...@mesos.apache.org>.
-----------------------------------------------------------
This is an automatically generated e-mail. To reply, visit:
https://reviews.apache.org/r/64522/#review193834
-----------------------------------------------------------
FAIL: Some Mesos tests failed.
Reviews applied: `['64522']`
Failed command: `D:\DCOS\mesos\src\mesos-tests.exe --verbose`
All the build artifacts available at: http://dcos-win.westus.cloudapp.azure.com/mesos-build/review/64522
Relevant logs:
- [mesos-tests-stdout.log](http://dcos-win.westus.cloudapp.azure.com/mesos-build/review/64522/logs/mesos-tests-stdout.log):
```
[ RUN ] MasterSlaveReconciliationTest.SlaveReregisterTerminatedExecutor
[ OK ] MasterSlaveReconciliationTest.SlaveReregisterTerminatedExecutor (236 ms)
[ RUN ] MasterSlaveReconciliationTest.ReconcileLostTask
[ OK ] MasterSlaveReconciliationTest.ReconcileLostTask (312 ms)
[ RUN ] MasterSlaveReconciliationTest.ReconcileDroppedTask
[ OK ] MasterSlaveReconciliationTest.ReconcileDroppedTask (294 ms)
[ RUN ] MasterSlaveReconciliationTest.ReconcileRace
[ OK ] MasterSlaveReconciliationTest.ReconcileRace (274 ms)
[ RUN ] MasterSlaveReconciliationTest.SlaveReregisterPendingTask
[ OK ] MasterSlaveReconciliationTest.SlaveReregisterPendingTask (207 ms)
[ RUN ] MasterSlaveReconciliationTest.SlaveReregisterTerminalTask
[ OK ] MasterSlaveReconciliationTest.SlaveReregisterTerminalTask (247 ms)
[ RUN ] MasterSlaveReconciliationTest.SlaveReregisterFrameworks
[ OK ] MasterSlaveReconciliationTest.SlaveReregisterFrameworks (245 ms)
[ RUN ] MasterSlaveReconciliationTest.SlaveReregisterTaskExecutorIds
[ OK ] MasterSlaveReconciliationTest.SlaveReregisterTaskExecutorIds (3487 ms)
[----------] 8 tests from MasterSlaveReconciliationTest (5438 ms total)
[----------] 16 tests from OfferOperationStatusUpdateManagerTest
[ RUN ] OfferOperationStatusUpdateManagerTest.UpdateAndAck
[ OK ] OfferOperationStatusUpdateManagerTest.UpdateAndAck (18 ms)
[ RUN ] OfferOperationStatusUpdateManagerTest.UpdateAndAckNonTerminalUpdate
[ OK ] OfferOperationStatusUpdateManagerTest.UpdateAndAckNonTerminalUpdate (14 ms)
[ RUN ] OfferOperationStatusUpdateManagerTest.ResendUnacknowledged
[ OK ] OfferOperationStatusUpdateManagerTest.ResendUnacknowledged (12 ms)
[ RUN ] OfferOperationStatusUpdateManagerTest.Cleanup
[ OK ] OfferOperationStatusUpdateManagerTest.Cleanup (11 ms)
[ RUN ] OfferOperationStatusUpdateManagerTest.RecoverCheckpointedStream
D:\DCOS\mesos\mesos\src\tests\offer_operation_status_update_manager_tests.cpp(338): error: state->streams.at(operationUuid) is NONE
```
- [mesos-tests-stderr.log](http://dcos-win.westus.cloudapp.azure.com/mesos-build/review/64522/logs/mesos-tests-stderr.log):
```
E1214 19:48:03.520541 5096 offer_operation.cpp:54] !!!!! OfferOperationStatusUpdateManager DESTROYED
E1214 19:48:03.524543 5096 status_update_manager_process.hpp:602] !!! STREAM FILE CLOSED: C:\Users\mesos\AppData\Local\Temp\rofXYK\streams\532a6f29-c449-466a-aad4-4f2d254f797e
I1214 19:48:03.528543 6560 status_update_manager_process.hpp:150] Received offer operation status update OFFER_OPERATION_FINISHED (Status UUID: 4f1c072c-e1ce-41fe-9f23-72b04fdd425f) for operation UUID 090ce34b-c808-454b-8fe8-fe6890703356
E1214 19:48:03.528543 6560 status_update_manager_process.hpp:626] !!! The file 'C:\Users\mesos\AppData\Local\Temp\XhG2sl\streams\090ce34b-c808-454b-8fe8-fe6890703356' doesn't exist
I1214 19:48:03.530519 6560 status_update_manager_process.hpp:939] Checkpointing UPDATE for offer operation status update OFFER_OPERATION_FINISHED (Status UUID: 4f1c072c-e1ce-41fe-9f23-72b04fdd425f) for operation UUID 090ce34b-c808-454b-8fe8-fe6890703356
E1214 19:48:03.530519 6560 status_update_manager_process.hpp:992] !!! Handled update: OFFER_OPERATION_FINISHED (Status UUID: 4f1c072c-e1ce-41fe-9f23-72b04fdd425f) for operation UUID 090ce34b-c808-454b-8fe8-fe6890703356
W1214 19:48:03.531518 3176 status_update_manager_process.hpp:559] Resending offer operation status update OFFER_OPERATION_FINISHED (Status UUID: 4f1c072c-e1ce-41fe-9f23-72b04fdd425f) for operation UUID 090ce34b-c808-454b-8fe8-fe6890703356
I1214 19:48:03.532547 5688 status_update_manager_process.hpp:250] Received offer operation status update acknowledgement (UUID: 4f1c072c-e1ce-41fe-9f23-72b04fdd425f) for stream 090ce34b-c808-454b-8fe8-fe6890703356
I1214 19:48:03.532547 5688 status_update_manager_process.hpp:939] Checkpointing ACK for offer operation status update OFFER_OPERATION_FINISHED (Status UUID: 4f1c072c-e1ce-41fe-9f23-72b04fdd425f) for operation UUID 090ce34b-c808-454b-8fe8-fe6890703356
E1214 19:48:03.533548 5688 status_update_manager_process.hpp:1003] !!! Handled ack: OFFER_OPERATION_FINISHED (Status UUID: 4f1c072c-e1ce-41fe-9f23-72b04fdd425f) for operation UUID 090ce34b-c808-454b-8fe8-fe6890703356
E1214 19:48:03.536541 5688 status_update_manager_process.hpp:602] !!! STREAM FILE CLOSED: C:\Users\mesos\AppData\Local\Temp\XhG2sl\streams\090ce34b-c808-454b-8fe8-fe6890703356
E1214 19:48:03.537544 5096 offer_operation.cpp:54] !!!!! OfferOperationStatusUpdateManager DESTROYED
I1214 19:48:03.542547 1516 status_update_manager_process.hpp:150] Received offer operation status update OFFER_OPERATION_FINISHED (Status UUID: 0956ec98-5a25-46bb-a7ee-20b1e984cdb0) for operation UUID fade3700-201b-4d94-a8c1-6080a775895f of framework 'frameworkId'
E1214 19:48:03.542547 1516 status_update_manager_process.hpp:626] !!! The file 'C:\Users\mesos\AppData\Local\Temp\BJc6QF\streams\fade3700-201b-4d94-a8c1-6080a775895f' doesn't exist
I1214 19:48:03.544541 1516 status_update_manager_process.hpp:939] Checkpointing UPDATE for offer operation status update OFFER_OPERATION_FINISHED (Status UUID: 0956ec98-5a25-46bb-a7ee-20b1e984cdb0) for operation UUID fade3700-201b-4d94-a8c1-6080a775895f of framework 'frameworkId'
E1214 19:48:03.544541 1516 status_update_manager_process.hpp:992] !!! Handled update: OFFER_OPERATION_FINISHED (Status UUID: 0956ec98-5a25-46bb-a7ee-20b1e984cdb0) for operation UUID fade3700-201b-4d94-a8c1-6080a775895f of framework 'frameworkId'
I1214 19:48:03.545547 3176 status_update_manager_process.hpp:364] Closing offer operation status update streams of framework frameworkId
E1214 19:48:03.549516 3176 status_update_manager_process.hpp:602] !!! STREAM FILE CLOSED: C:\Users\mesos\AppData\Local\Temp\BJc6QF\streams\fade3700-201b-4d94-a8c1-6080a775895f
E1214 19:48:03.549516 5096 offer_operation.cpp:54] !!!!! OfferOperationStatusUpdateManager DESTROYED
I1214 19:48:03.554546 6560 status_update_manager_process.hpp:150] Received offer operation status update OFFER_OPERATION_FINISHED (Status UUID: f908f51d-e0ff-4b7a-870e-6e60e92ec91d) for operation UUID 5ea7a4ca-8958-42fc-ba36-240f92312634
E1214 19:48:03.554546 6560 status_update_manager_process.hpp:626] !!! The file 'C:\Users\mesos\AppData\Local\Temp\xRjhsg\streams\5ea7a4ca-8958-42fc-ba36-240f92312634' doesn't exist
I1214 19:48:03.556519 6560 status_update_manager_process.hpp:939] Checkpointing UPDATE for offer operation status update OFFER_OPERATION_FINISHED (Status UUID: f908f51d-e0ff-4b7a-870e-6e60e92ec91d) for operation UUID 5ea7a4ca-8958-42fc-ba36-240f92312634
E1214 19:48:03.556519 6560 status_update_manager_process.hpp:992] !!! Handled update: OFFER_OPERATION_FINISHED (Status UUID: f908f51d-e0ff-4b7a-870e-6e60e92ec91d) for operation UUID 5ea7a4ca-8958-42fc-ba36-240f92312634
E1214 19:48:03.557520 5096 offer_operation.cpp:54] !!!!! OfferOperationStatusUpdateManager DESTROYED
E1214 19:48:03.561542 5096 status_update_manager_process.hpp:602] !!! STREAM FILE CLOSED: C:\Users\mesos\AppData\Local\Temp\xRjhsg\streams\5ea7a4ca-8958-42fc-ba36-240f92312634
I1214 19:48:03.563541 944 status_update_manager_process.hpp:312] Recovering offer operation status update manager
E1214 19:48:03.564546 944 status_update_manager_process.hpp:762] !!! Stream file 'C:\Users\mesos\AppData\Local\Temp\xRjhsg\streams\5ea7a4ca-8958-42fc-ba36-240f92312634' was empty, removing it
E1214 19:48:03.564546 944 status_update_manager_process.hpp:602] !!! STREAM FILE CLOSED: C:\Users\mesos\AppData\Local\Temp\xRjhsg\streams\5ea7a4ca-8958-42fc-ba36-240f92312634
Assertion failed: isSome(), file d:\dcos\mesos\mesos\3rdparty\stout\include\stout\option.hpp, line 118
```
- Mesos Reviewbot Windows
On Dec. 12, 2017, 1:48 a.m., Gaston Kleiman wrote:
>
> -----------------------------------------------------------
> This is an automatically generated e-mail. To reply, visit:
> https://reviews.apache.org/r/64522/
> -----------------------------------------------------------
>
> (Updated Dec. 12, 2017, 1:48 a.m.)
>
>
> Review request for mesos and Gaston Kleiman.
>
>
> Repository: mesos
>
>
> Description
> -------
>
> WIP: try to make tests pass on Windows.
>
>
> Diffs
> -----
>
> src/status_update_manager/offer_operation.cpp 9df4973d5d2d331ce93dc82f9b1dc35ae8ea11b8
> src/status_update_manager/status_update_manager_process.hpp e575d8c31bb6bd63fc26f01e2deec5f44821e01c
> src/tests/offer_operation_status_update_manager_tests.cpp cb71bc10f9a687f12ee4cca4f8fa8614f5ea2d58
>
>
> Diff: https://reviews.apache.org/r/64522/diff/7/
>
>
> Testing
> -------
>
>
> Thanks,
>
> Gaston Kleiman
>
>
Re: Review Request 64522: WIP: try to make tests pass on Windows.
Posted by Mesos Reviewbot Windows <re...@mesos.apache.org>.
-----------------------------------------------------------
This is an automatically generated e-mail. To reply, visit:
https://reviews.apache.org/r/64522/#review193487
-----------------------------------------------------------
Bad review!
Error:
No reviewers specified. Please find a reviewer by asking on JIRA or the mailing list.
- Mesos Reviewbot Windows
On Dec. 11, 2017, 5:48 p.m., Gaston Kleiman wrote:
>
> -----------------------------------------------------------
> This is an automatically generated e-mail. To reply, visit:
> https://reviews.apache.org/r/64522/
> -----------------------------------------------------------
>
> (Updated Dec. 11, 2017, 5:48 p.m.)
>
>
> Review request for mesos.
>
>
> Repository: mesos
>
>
> Description
> -------
>
> WIP: try to make tests pass on Windows.
>
>
> Diffs
> -----
>
> src/tests/offer_operation_status_update_manager_tests.cpp a5327d3d070a390f2ceb918dc53a024fbfe8777e
>
>
> Diff: https://reviews.apache.org/r/64522/diff/1/
>
>
> Testing
> -------
>
>
> Thanks,
>
> Gaston Kleiman
>
>
Re: Review Request 64522: Made OfferOperationStatusUpdateManager
tests pass on Windows.
Posted by Andrew Schwartzmeyer <an...@schwartzmeyer.com>.
-----------------------------------------------------------
This is an automatically generated e-mail. To reply, visit:
https://reviews.apache.org/r/64522/#review193999
-----------------------------------------------------------
Ship it!
Ship It!
- Andrew Schwartzmeyer
On Dec. 15, 2017, 1:25 p.m., Gaston Kleiman wrote:
>
> -----------------------------------------------------------
> This is an automatically generated e-mail. To reply, visit:
> https://reviews.apache.org/r/64522/
> -----------------------------------------------------------
>
> (Updated Dec. 15, 2017, 1:25 p.m.)
>
>
> Review request for mesos, Andrew Schwartzmeyer, Greg Mann, and Jie Yu.
>
>
> Repository: mesos
>
>
> Description
> -------
>
> See the summary.
>
>
> Diffs
> -----
>
> src/status_update_manager/status_update_manager_process.hpp e575d8c31bb6bd63fc26f01e2deec5f44821e01c
> src/tests/offer_operation_status_update_manager_tests.cpp cb71bc10f9a687f12ee4cca4f8fa8614f5ea2d58
>
>
> Diff: https://reviews.apache.org/r/64522/diff/10/
>
>
> Testing
> -------
>
> It took a while, but the Windows reviewbot is now happy =).
>
>
> Thanks,
>
> Gaston Kleiman
>
>
Re: Review Request 64522: Made OfferOperationStatusUpdateManager
tests pass on Windows.
Posted by Andrew Schwartzmeyer <an...@schwartzmeyer.com>.
-----------------------------------------------------------
This is an automatically generated e-mail. To reply, visit:
https://reviews.apache.org/r/64522/#review194000
-----------------------------------------------------------
src/status_update_manager/status_update_manager_process.hpp
Lines 635-637 (patched)
<https://reviews.apache.org/r/64522/#comment272693>
This weird Windows-ism is biting us in a lot of places. We've had to fix it elsewhere previously, and I have a dirty tree with the same fix applied to `net::download`.
We should commit this as-is for now. I will follow up with a patch to `os::open` itself to default to this behavior on Windows, possibly with an optional argument to turn it off if needed. I have a hunch, however, that nothing in Mesos expects or wants the "text mode" of Windows where it translates all your newlines to CRLFs.
- Andrew Schwartzmeyer
On Dec. 15, 2017, 1:25 p.m., Gaston Kleiman wrote:
>
> -----------------------------------------------------------
> This is an automatically generated e-mail. To reply, visit:
> https://reviews.apache.org/r/64522/
> -----------------------------------------------------------
>
> (Updated Dec. 15, 2017, 1:25 p.m.)
>
>
> Review request for mesos, Andrew Schwartzmeyer, Greg Mann, and Jie Yu.
>
>
> Bugs: MESOS-8318
> https://issues.apache.org/jira/browse/MESOS-8318
>
>
> Repository: mesos
>
>
> Description
> -------
>
> See the summary.
>
>
> Diffs
> -----
>
> src/status_update_manager/status_update_manager_process.hpp e575d8c31bb6bd63fc26f01e2deec5f44821e01c
> src/tests/offer_operation_status_update_manager_tests.cpp cb71bc10f9a687f12ee4cca4f8fa8614f5ea2d58
>
>
> Diff: https://reviews.apache.org/r/64522/diff/10/
>
>
> Testing
> -------
>
> It took a while, but the Windows reviewbot is now happy =).
>
>
> Thanks,
>
> Gaston Kleiman
>
>
Re: Review Request 64522: Made OfferOperationStatusUpdateManager
tests pass on Windows.
Posted by Gaston Kleiman <ga...@mesosphere.io>.
-----------------------------------------------------------
This is an automatically generated e-mail. To reply, visit:
https://reviews.apache.org/r/64522/
-----------------------------------------------------------
(Updated Dec. 15, 2017, 1:25 p.m.)
Review request for mesos, Andrew Schwartzmeyer, Greg Mann, and Jie Yu.
Summary (updated)
-----------------
Made OfferOperationStatusUpdateManager tests pass on Windows.
Repository: mesos
Description (updated)
-------
See the summary.
Diffs
-----
src/status_update_manager/status_update_manager_process.hpp e575d8c31bb6bd63fc26f01e2deec5f44821e01c
src/tests/offer_operation_status_update_manager_tests.cpp cb71bc10f9a687f12ee4cca4f8fa8614f5ea2d58
Diff: https://reviews.apache.org/r/64522/diff/10/
Testing (updated)
-------
It took a while, but the Windows reviewbot is now happy =).
Thanks,
Gaston Kleiman
Re: Review Request 64522: WIP: try to make tests pass on Windows.
Posted by Mesos Reviewbot Windows <re...@mesos.apache.org>.
-----------------------------------------------------------
This is an automatically generated e-mail. To reply, visit:
https://reviews.apache.org/r/64522/#review193871
-----------------------------------------------------------
PASS: Mesos patch 64522 was successfully built and tested.
Reviews applied: `['64522']`
All the build artifacts available at: http://dcos-win.westus.cloudapp.azure.com/mesos-build/review/64522
- Mesos Reviewbot Windows
On Dec. 14, 2017, 10:31 p.m., Gaston Kleiman wrote:
>
> -----------------------------------------------------------
> This is an automatically generated e-mail. To reply, visit:
> https://reviews.apache.org/r/64522/
> -----------------------------------------------------------
>
> (Updated Dec. 14, 2017, 10:31 p.m.)
>
>
> Review request for mesos and Gaston Kleiman.
>
>
> Repository: mesos
>
>
> Description
> -------
>
> WIP: try to make tests pass on Windows.
>
>
> Diffs
> -----
>
> src/status_update_manager/offer_operation.cpp 9df4973d5d2d331ce93dc82f9b1dc35ae8ea11b8
> src/status_update_manager/status_update_manager_process.hpp e575d8c31bb6bd63fc26f01e2deec5f44821e01c
> src/tests/offer_operation_status_update_manager_tests.cpp cb71bc10f9a687f12ee4cca4f8fa8614f5ea2d58
>
>
> Diff: https://reviews.apache.org/r/64522/diff/9/
>
>
> Testing
> -------
>
>
> Thanks,
>
> Gaston Kleiman
>
>
Re: Review Request 64522: WIP: try to make tests pass on Windows.
Posted by Mesos Reviewbot Windows <re...@mesos.apache.org>.
-----------------------------------------------------------
This is an automatically generated e-mail. To reply, visit:
https://reviews.apache.org/r/64522/#review193863
-----------------------------------------------------------
FAIL: Some Mesos tests failed.
Reviews applied: `['64522']`
Failed command: `D:\DCOS\mesos\src\mesos-tests.exe --verbose`
All the build artifacts available at: http://dcos-win.westus.cloudapp.azure.com/mesos-build/review/64522
Relevant logs:
- [mesos-tests-stdout.log](http://dcos-win.westus.cloudapp.azure.com/mesos-build/review/64522/logs/mesos-tests-stdout.log):
```
[ RUN ] MasterSlaveReconciliationTest.SlaveReregisterTerminatedExecutor
[ OK ] MasterSlaveReconciliationTest.SlaveReregisterTerminatedExecutor (240 ms)
[ RUN ] MasterSlaveReconciliationTest.ReconcileLostTask
[ OK ] MasterSlaveReconciliationTest.ReconcileLostTask (292 ms)
[ RUN ] MasterSlaveReconciliationTest.ReconcileDroppedTask
[ OK ] MasterSlaveReconciliationTest.ReconcileDroppedTask (306 ms)
[ RUN ] MasterSlaveReconciliationTest.ReconcileRace
[ OK ] MasterSlaveReconciliationTest.ReconcileRace (267 ms)
[ RUN ] MasterSlaveReconciliationTest.SlaveReregisterPendingTask
[ OK ] MasterSlaveReconciliationTest.SlaveReregisterPendingTask (224 ms)
[ RUN ] MasterSlaveReconciliationTest.SlaveReregisterTerminalTask
[ OK ] MasterSlaveReconciliationTest.SlaveReregisterTerminalTask (244 ms)
[ RUN ] MasterSlaveReconciliationTest.SlaveReregisterFrameworks
[ OK ] MasterSlaveReconciliationTest.SlaveReregisterFrameworks (233 ms)
[ RUN ] MasterSlaveReconciliationTest.SlaveReregisterTaskExecutorIds
[ OK ] MasterSlaveReconciliationTest.SlaveReregisterTaskExecutorIds (3542 ms)
[----------] 8 tests from MasterSlaveReconciliationTest (5478 ms total)
[----------] 16 tests from OfferOperationStatusUpdateManagerTest
[ RUN ] OfferOperationStatusUpdateManagerTest.UpdateAndAck
[ OK ] OfferOperationStatusUpdateManagerTest.UpdateAndAck (18 ms)
[ RUN ] OfferOperationStatusUpdateManagerTest.UpdateAndAckNonTerminalUpdate
[ OK ] OfferOperationStatusUpdateManagerTest.UpdateAndAckNonTerminalUpdate (14 ms)
[ RUN ] OfferOperationStatusUpdateManagerTest.ResendUnacknowledged
[ OK ] OfferOperationStatusUpdateManagerTest.ResendUnacknowledged (14 ms)
[ RUN ] OfferOperationStatusUpdateManagerTest.Cleanup
[ OK ] OfferOperationStatusUpdateManagerTest.Cleanup (11 ms)
[ RUN ] OfferOperationStatusUpdateManagerTest.RecoverCheckpointedStream
D:\DCOS\mesos\mesos\src\tests\offer_operation_status_update_manager_tests.cpp(338): error: state->streams.at(operationUuid) is NONE
```
- [mesos-tests-stderr.log](http://dcos-win.westus.cloudapp.azure.com/mesos-build/review/64522/logs/mesos-tests-stderr.log):
```
E1215 00:08:22.370883 1844 status_update_manager_process.hpp:602] !!! STREAM FILE CLOSED: C:\Users\mesos\AppData\Local\Temp\ZZsyy2\streams\b2b7358a-1e92-4b23-bedf-1f21f9f5096f
E1215 00:08:22.370883 1844 offer_operation.cpp:55] !!!!! OfferOperationStatusUpdateManager DESTROYED
I1215 00:08:22.375855 2176 status_update_manager_process.hpp:150] Received offer operation status update OFFER_OPERATION_FINISHED (Status UUID: 2e9a93fc-948d-4e09-b175-b17d735c3351) for operation UUID 25a43a28-90af-44fb-b30b-7543c3dbba3a
E1215 00:08:22.375855 2176 status_update_manager_process.hpp:626] !!! The file 'C:\Users\mesos\AppData\Local\Temp\u38Pf2\streams\25a43a28-90af-44fb-b30b-7543c3dbba3a' doesn't exist
I1215 00:08:22.377856 2176 status_update_manager_process.hpp:939] Checkpointing UPDATE for offer operation status update OFFER_OPERATION_FINISHED (Status UUID: 2e9a93fc-948d-4e09-b175-b17d735c3351) for operation UUID 25a43a28-90af-44fb-b30b-7543c3dbba3a
E1215 00:08:22.377856 2176 status_update_manager_process.hpp:992] !!! Handled update: OFFER_OPERATION_FINISHED (Status UUID: 2e9a93fc-948d-4e09-b175-b17d735c3351) for operation UUID 25a43a28-90af-44fb-b30b-7543c3dbba3a
W1215 00:08:22.378852 5148 status_update_manager_process.hpp:559] Resending offer operation status update OFFER_OPERATION_FINISHED (Status UUID: 2e9a93fc-948d-4e09-b175-b17d735c3351) for operation UUID 25a43a28-90af-44fb-b30b-7543c3dbba3a
I1215 00:08:22.379855 6948 status_update_manager_process.hpp:250] Received offer operation status update acknowledgement (UUID: 2e9a93fc-948d-4e09-b175-b17d735c3351) for stream 25a43a28-90af-44fb-b30b-7543c3dbba3a
I1215 00:08:22.380858 6948 status_update_manager_process.hpp:939] Checkpointing ACK for offer operation status update OFFER_OPERATION_FINISHED (Status UUID: 2e9a93fc-948d-4e09-b175-b17d735c3351) for operation UUID 25a43a28-90af-44fb-b30b-7543c3dbba3a
E1215 00:08:22.380858 6948 status_update_manager_process.hpp:1003] !!! Handled ack: OFFER_OPERATION_FINISHED (Status UUID: 2e9a93fc-948d-4e09-b175-b17d735c3351) for operation UUID 25a43a28-90af-44fb-b30b-7543c3dbba3a
E1215 00:08:22.384883 6948 status_update_manager_process.hpp:602] !!! STREAM FILE CLOSED: C:\Users\mesos\AppData\Local\Temp\u38Pf2\streams\25a43a28-90af-44fb-b30b-7543c3dbba3a
E1215 00:08:22.385852 1844 offer_operation.cpp:55] !!!!! OfferOperationStatusUpdateManager DESTROYED
I1215 00:08:22.389856 1516 status_update_manager_process.hpp:150] Received offer operation status update OFFER_OPERATION_FINISHED (Status UUID: 8b0ba072-4a7a-4970-8575-fab4d9a72325) for operation UUID 8d0c8215-7ec2-457d-96ce-ada71d8d8524 of framework 'frameworkId'
E1215 00:08:22.390866 1516 status_update_manager_process.hpp:626] !!! The file 'C:\Users\mesos\AppData\Local\Temp\BbgHyK\streams\8d0c8215-7ec2-457d-96ce-ada71d8d8524' doesn't exist
I1215 00:08:22.391852 1516 status_update_manager_process.hpp:939] Checkpointing UPDATE for offer operation status update OFFER_OPERATION_FINISHED (Status UUID: 8b0ba072-4a7a-4970-8575-fab4d9a72325) for operation UUID 8d0c8215-7ec2-457d-96ce-ada71d8d8524 of framework 'frameworkId'
E1215 00:08:22.392853 1516 status_update_manager_process.hpp:992] !!! Handled update: OFFER_OPERATION_FINISHED (Status UUID: 8b0ba072-4a7a-4970-8575-fab4d9a72325) for operation UUID 8d0c8215-7ec2-457d-96ce-ada71d8d8524 of framework 'frameworkId'
I1215 00:08:22.392853 5148 status_update_manager_process.hpp:364] Closing offer operation status update streams of framework frameworkId
E1215 00:08:22.396881 5148 status_update_manager_process.hpp:602] !!! STREAM FILE CLOSED: C:\Users\mesos\AppData\Local\Temp\BbgHyK\streams\8d0c8215-7ec2-457d-96ce-ada71d8d8524
E1215 00:08:22.397855 1844 offer_operation.cpp:55] !!!!! OfferOperationStatusUpdateManager DESTROYED
I1215 00:08:22.401877 2176 status_update_manager_process.hpp:150] Received offer operation status update OFFER_OPERATION_FINISHED (Status UUID: 941db5f0-e8e4-4ffd-995e-4b690f8363f7) for operation UUID 08e0afa2-cc84-48b9-9452-ddac5e1e3c7f
E1215 00:08:22.401877 2176 status_update_manager_process.hpp:626] !!! The file 'C:\Users\mesos\AppData\Local\Temp\i0VOtN\streams\08e0afa2-cc84-48b9-9452-ddac5e1e3c7f' doesn't exist
I1215 00:08:22.403853 2176 status_update_manager_process.hpp:939] Checkpointing UPDATE for offer operation status update OFFER_OPERATION_FINISHED (Status UUID: 941db5f0-e8e4-4ffd-995e-4b690f8363f7) for operation UUID 08e0afa2-cc84-48b9-9452-ddac5e1e3c7f
E1215 00:08:22.403853 2176 status_update_manager_process.hpp:992] !!! Handled update: OFFER_OPERATION_FINISHED (Status UUID: 941db5f0-e8e4-4ffd-995e-4b690f8363f7) for operation UUID 08e0afa2-cc84-48b9-9452-ddac5e1e3c7f
E1215 00:08:22.408880 1844 status_update_manager_process.hpp:602] !!! STREAM FILE CLOSED: C:\Users\mesos\AppData\Local\Temp\i0VOtN\streams\08e0afa2-cc84-48b9-9452-ddac5e1e3c7f
E1215 00:08:22.408880 1844 offer_operation.cpp:55] !!!!! OfferOperationStatusUpdateManager DESTROYED
I1215 00:08:22.409850 3308 status_update_manager_process.hpp:312] Recovering offer operation status update manager
E1215 00:08:22.410878 3308 status_update_manager_process.hpp:762] !!! Stream file 'C:\Users\mesos\AppData\Local\Temp\i0VOtN\streams\08e0afa2-cc84-48b9-9452-ddac5e1e3c7f' was empty, removing it
E1215 00:08:22.410878 3308 status_update_manager_process.hpp:602] !!! STREAM FILE CLOSED: C:\Users\mesos\AppData\Local\Temp\i0VOtN\streams\08e0afa2-cc84-48b9-9452-ddac5e1e3c7f
Assertion failed: isSome(), file d:\dcos\mesos\mesos\3rdparty\stout\include\stout\option.hpp, line 118
```
- Mesos Reviewbot Windows
On Dec. 14, 2017, 10:31 p.m., Gaston Kleiman wrote:
>
> -----------------------------------------------------------
> This is an automatically generated e-mail. To reply, visit:
> https://reviews.apache.org/r/64522/
> -----------------------------------------------------------
>
> (Updated Dec. 14, 2017, 10:31 p.m.)
>
>
> Review request for mesos and Gaston Kleiman.
>
>
> Repository: mesos
>
>
> Description
> -------
>
> WIP: try to make tests pass on Windows.
>
>
> Diffs
> -----
>
> src/status_update_manager/offer_operation.cpp 9df4973d5d2d331ce93dc82f9b1dc35ae8ea11b8
> src/status_update_manager/status_update_manager_process.hpp e575d8c31bb6bd63fc26f01e2deec5f44821e01c
> src/tests/offer_operation_status_update_manager_tests.cpp cb71bc10f9a687f12ee4cca4f8fa8614f5ea2d58
>
>
> Diff: https://reviews.apache.org/r/64522/diff/8/
>
>
> Testing
> -------
>
>
> Thanks,
>
> Gaston Kleiman
>
>
Re: Review Request 64522: WIP: try to make tests pass on Windows.
Posted by Mesos Reviewbot Windows <re...@mesos.apache.org>.
-----------------------------------------------------------
This is an automatically generated e-mail. To reply, visit:
https://reviews.apache.org/r/64522/#review193975
-----------------------------------------------------------
PASS: Mesos patch 64522 was successfully built and tested.
Reviews applied: `['64522']`
All the build artifacts available at: http://dcos-win.westus.cloudapp.azure.com/mesos-build/review/64522
- Mesos Reviewbot Windows
On Dec. 14, 2017, 10:31 p.m., Gaston Kleiman wrote:
>
> -----------------------------------------------------------
> This is an automatically generated e-mail. To reply, visit:
> https://reviews.apache.org/r/64522/
> -----------------------------------------------------------
>
> (Updated Dec. 14, 2017, 10:31 p.m.)
>
>
> Review request for mesos and Gaston Kleiman.
>
>
> Repository: mesos
>
>
> Description
> -------
>
> WIP: try to make tests pass on Windows.
>
>
> Diffs
> -----
>
> src/status_update_manager/status_update_manager_process.hpp e575d8c31bb6bd63fc26f01e2deec5f44821e01c
> src/tests/offer_operation_status_update_manager_tests.cpp cb71bc10f9a687f12ee4cca4f8fa8614f5ea2d58
>
>
> Diff: https://reviews.apache.org/r/64522/diff/10/
>
>
> Testing
> -------
>
>
> Thanks,
>
> Gaston Kleiman
>
>
Re: Review Request 64522: WIP: try to make tests pass on Windows.
Posted by Gaston Kleiman <ga...@mesosphere.io>.
-----------------------------------------------------------
This is an automatically generated e-mail. To reply, visit:
https://reviews.apache.org/r/64522/
-----------------------------------------------------------
(Updated Dec. 14, 2017, 2:31 p.m.)
Review request for mesos and Gaston Kleiman.
Repository: mesos
Description
-------
WIP: try to make tests pass on Windows.
Diffs (updated)
-----
src/status_update_manager/offer_operation.cpp 9df4973d5d2d331ce93dc82f9b1dc35ae8ea11b8
src/status_update_manager/status_update_manager_process.hpp e575d8c31bb6bd63fc26f01e2deec5f44821e01c
src/tests/offer_operation_status_update_manager_tests.cpp cb71bc10f9a687f12ee4cca4f8fa8614f5ea2d58
Diff: https://reviews.apache.org/r/64522/diff/8/
Changes: https://reviews.apache.org/r/64522/diff/7-8/
Testing
-------
Thanks,
Gaston Kleiman
Re: Review Request 64522: WIP: try to make tests pass on Windows.
Posted by Mesos Reviewbot Windows <re...@mesos.apache.org>.
-----------------------------------------------------------
This is an automatically generated e-mail. To reply, visit:
https://reviews.apache.org/r/64522/#review193786
-----------------------------------------------------------
FAIL: Some Mesos tests failed.
Reviews applied: `['64522']`
Failed command: `D:\DCOS\mesos\src\mesos-tests.exe --verbose`
All the build artifacts available at: http://dcos-win.westus.cloudapp.azure.com/mesos-build/review/64522
Relevant logs:
- [mesos-tests-stdout.log](http://dcos-win.westus.cloudapp.azure.com/mesos-build/review/64522/logs/mesos-tests-stdout.log):
```
[ RUN ] SlaveTest.RunTaskGroupFailedSecretGeneration
[ OK ] SlaveTest.RunTaskGroupFailedSecretGeneration (239 ms)
[ RUN ] SlaveTest.RunTaskGroupInvalidExecutorSecret
[ OK ] SlaveTest.RunTaskGroupInvalidExecutorSecret (251 ms)
[ RUN ] SlaveTest.RunTaskGroupReferenceTypeSecret
[ OK ] SlaveTest.RunTaskGroupReferenceTypeSecret (237 ms)
[ RUN ] SlaveTest.RunTaskGroupGenerateSecretAfterShutdown
[ OK ] SlaveTest.RunTaskGroupGenerateSecretAfterShutdown (274 ms)
[ RUN ] SlaveTest.KillTaskGroupBetweenRunTaskParts
[ OK ] SlaveTest.KillTaskGroupBetweenRunTaskParts (226 ms)
[ RUN ] SlaveTest.KillQueuedTaskGroup
[ OK ] SlaveTest.KillQueuedTaskGroup (291 ms)
[ RUN ] SlaveTest.MaxCompletedExecutorsPerFrameworkFlag
[ OK ] SlaveTest.MaxCompletedExecutorsPerFrameworkFlag (1026 ms)
[ RUN ] SlaveTest.ShutdownV0ExecutorIfItReregistersWithoutReconnect
[ OK ] SlaveTest.ShutdownV0ExecutorIfItReregistersWithoutReconnect (254 ms)
[ RUN ] SlaveTest.IgnoreV0ExecutorIfItReregistersWithoutReconnect
[ OK ] SlaveTest.IgnoreV0ExecutorIfItReregistersWithoutReconnect (250 ms)
[ RUN ] SlaveTest.BrowseExecutorSandboxByVirtualPath
[ OK ] SlaveTest.BrowseExecutorSandboxByVirtualPath (295 ms)
[ RUN ] SlaveTest.DisconnectedExecutorDropsMessages
[ OK ] SlaveTest.DisconnectedExecutorDropsMessages (294 ms)
[ RUN ] SlaveTest.ResourceProviderSubscribe
[ OK ] SlaveTest.ResourceProviderSubscribe (222 ms)
[ RUN ] SlaveTest.ResourceVersions
[ OK ] SlaveTest.ResourceVersions (177 ms)
[ RUN ] SlaveTest.ReconfigurationPolicy
[ OK ] SlaveTest.ReconfigurationPolicy (265 ms)
[ RUN ] SlaveTest.ResourceProviderReconciliation
```
- [mesos-tests-stderr.log](http://dcos-win.westus.cloudapp.azure.com/mesos-build/review/64522/logs/mesos-tests-stderr.log):
```
@ 00007FF67AA1A3F0 google::LogMessage::SendToLog
@ 00007FF67AA19BD7 google::LogMessage::Flush
@ 00007FF67AA1B711 google::LogMessageFatal::~LogMessageFatal
@ 00007FF67893297C mesos::internal::slave::Slave::handleResourceProviderMessage
@ 00007FF678ADDAA5 ??
@ 00007FF6789CB2B8 std::_Invoker_functor::_Call<<lambda_2c5dd0fb32c5d47ebd14bcab173f55d7>,process::Future<mesos::internal::ResourceProviderMessage>,process::ProcessBase * __ptr64>
@ 00007FF678A50FA8 std::invoke<<lambda_2c5dd0fb32c5d47ebd14bcab173f55d7>,process::Future<mesos::internal::ResourceProviderMessage>,process::ProcessBase * __ptr64>
@ 00007FF678A611AB lambda::internal::Partial<<lambda_2c5dd0fb32c5d47ebd14bcab173f55d7>,process::Future<mesos::internal::ResourceProviderMessage>,std::_Ph<1> >::invoke_expand<<lambda_2c5dd0fb32c5d47ebd14bcab173f55d7>,std::tuple<process::Future<mesos::internal::ResourceProvi
@ 00007FF6789A750A )<process::ProcessBase * __ptr64
@ 00007FF6789D190C std::_Invoker_functor::_Call<lambda::internal::Partial<<lambda_2c5dd0fb32c5d47ebd14bcab173f55d7>,process::Future<mesos::internal::ResourceProviderMessage>,std::_Ph<1> >,process::ProcessBase * __ptr64>
@ 00007FF678A5740C std::invoke<lambda::internal::Partial<<lambda_2c5dd0fb32c5d47ebd14bcab173f55d7>,process::Future<mesos::internal::ResourceProviderMessage>,std::_Ph<1> >,process::ProcessBase * __ptr64>
@ 00007FF6789AF471 )<lambda::internal::Partial<<lambda_2c5dd0fb32c5d47ebd14bcab173f55d7>,process::Future<mesos::internal::ResourceProviderMessage>,std::_Ph<1> >,process::ProcessBase * __ptr64
@ 00007FF678AEB9C6 process::ProcessBase * __ptr64)>::CallableFn<lambda::internal::Partial<<lambda_2c5dd0fb32c5d47ebd14bcab173f55d7>,process::Future<mesos::internal::ResourceProviderMessage>,std::_Ph<1> > >::operator(
@ 00007FF67A509E2D process::ProcessBase * __ptr64)>::operator(
@ 00007FF67A3E2F09 process::ProcessBase::consume
@ 00007FF67A55DF8A process::DispatchEvent::consume
@ 00007FF6769A43D7 process::ProcessBase::serve
@ 00007FF67A3F0BEB process::ProcessManager::resume
@ 00007FF67A4FA651 ??
@ 00007FF67A439130 std::_Invoker_functor::_Call<<lambda_124422ac022fa041208b80c1460630d7> >
@ 00007FF67A48EAD0 std::invoke<<lambda_124422ac022fa041208b80c1460630d7> >
@ 00007FF67A447EEC std::_LaunchPad<std::unique_ptr<std::tuple<<lambda_124422ac022fa041208b80c1460630d7> >,std::default_delete<std::tuple<<lambda_124422ac022fa041208b80c1460630d7> > > > >::_Execute<0>
@ 00007FF67A545F8A std::_LaunchPad<std::unique_ptr<std::tuple<<lambda_124422ac022fa041208b80c1460630d7> >,std::default_delete<std::tuple<<lambda_124422ac022fa041208b80c1460630d7> > > > >::_Run
@ 00007FF67A532A18 std::_LaunchPad<std::unique_ptr<std::tuple<<lambda_124422ac022fa041208b80c1460630d7> >,std::default_delete<std::tuple<<lambda_124422ac022fa041208b80c1460630d7> > > > >::_Go
@ 00007FF67A51A6FD std::_Pad::_Call_func
@ 00007FF67B6BC4B8 invoke_thread_procedure
@ 00007FF67B6BBF61 __cdecl*)(void * __ptr64)
@ 00007FFB34601FE4 BaseThreadInitThunk
@ 00007FFB3532EF91 RtlUserThreadStart
```
- Mesos Reviewbot Windows
On Dec. 12, 2017, 1:48 a.m., Gaston Kleiman wrote:
>
> -----------------------------------------------------------
> This is an automatically generated e-mail. To reply, visit:
> https://reviews.apache.org/r/64522/
> -----------------------------------------------------------
>
> (Updated Dec. 12, 2017, 1:48 a.m.)
>
>
> Review request for mesos and Gaston Kleiman.
>
>
> Repository: mesos
>
>
> Description
> -------
>
> WIP: try to make tests pass on Windows.
>
>
> Diffs
> -----
>
> src/status_update_manager/offer_operation.cpp f66690eadc0d7b16cc7de1b518904db2cab7ef82
> src/status_update_manager/status_update_manager_process.hpp 1ac64410594134ce3e709d396d0a74a3d0aa2007
> src/tests/offer_operation_status_update_manager_tests.cpp a5327d3d070a390f2ceb918dc53a024fbfe8777e
>
>
> Diff: https://reviews.apache.org/r/64522/diff/6/
>
>
> Testing
> -------
>
>
> Thanks,
>
> Gaston Kleiman
>
>
Re: Review Request 64522: WIP: try to make tests pass on Windows.
Posted by Mesos Reviewbot Windows <re...@mesos.apache.org>.
-----------------------------------------------------------
This is an automatically generated e-mail. To reply, visit:
https://reviews.apache.org/r/64522/#review193604
-----------------------------------------------------------
FAIL: Some Mesos tests failed.
Reviews applied: `['64517', '64472', '64473', '64509', '64521', '64522']`
Failed command: `D:\DCOS\mesos\src\mesos-tests.exe --verbose`
All the build artifacts available at: http://dcos-win.westus.cloudapp.azure.com/mesos-build/review/64522
Relevant logs:
- [mesos-tests-stdout.log](http://dcos-win.westus.cloudapp.azure.com/mesos-build/review/64522/logs/mesos-tests-stdout.log):
```
[----------] 1 test from IsolationFlag/CpuIsolatorTest
[ RUN ] IsolationFlag/CpuIsolatorTest.ROOT_UserCpuUsage/0
[ OK ] IsolationFlag/CpuIsolatorTest.ROOT_UserCpuUsage/0 (2359 ms)
[----------] 1 test from IsolationFlag/CpuIsolatorTest (2387 ms total)
[----------] 1 test from IsolationFlag/MemoryIsolatorTest
[ RUN ] IsolationFlag/MemoryIsolatorTest.ROOT_MemUsage/0
[ OK ] IsolationFlag/MemoryIsolatorTest.ROOT_MemUsage/0 (2367 ms)
[----------] 1 test from IsolationFlag/MemoryIsolatorTest (2392 ms total)
[----------] Global test environment tear-down
[==========] 830 tests from 84 test cases ran. (323756 ms total)
[ PASSED ] 819 tests.
[ FAILED ] 11 tests, listed below:
[ FAILED ] OfferOperationStatusUpdateManagerTest.UpdateAndAckNonTerminalUpdate
[ FAILED ] OfferOperationStatusUpdateManagerTest.RecoverCheckpointedStream
[ FAILED ] OfferOperationStatusUpdateManagerTest.RecoverEmptyFile
[ FAILED ] OfferOperationStatusUpdateManagerTest.RecoverTerminatedStream
[ FAILED ] OfferOperationStatusUpdateManagerTest.IgnoreDuplicateUpdate
[ FAILED ] OfferOperationStatusUpdateManagerTest.IgnoreDuplicateUpdateAfterRecover
[ FAILED ] OfferOperationStatusUpdateManagerTest.RejectDuplicateAck
[ FAILED ] OfferOperationStatusUpdateManagerTest.RejectDuplicateAckAfterRecover
[ FAILED ] OfferOperationStatusUpdateManagerTest.NonStrictRecoveryCorruptedFile
[ FAILED ] OfferOperationStatusUpdateManagerTest.UpdateLatestWhenResending
[ FAILED ] SlaveTest.ResourceProviderPublishAll
11 FAILED TESTS
YOU HAVE 201 DISABLED TESTS
```
- [mesos-tests-stderr.log](http://dcos-win.westus.cloudapp.azure.com/mesos-build/review/64522/logs/mesos-tests-stderr.log):
```
I1212 20:41:19.765161 2624 exec.cpp:237] Executor registered on agent a2ed4f13-8018-4f90-820a-ffac2ca4629f-S0
I1212 20:41:19.768159 3512 executor.cpp:171] Received SUBSCRIBED event
I1212 20:41:19.772159 3512 executor.cpp:175] Subscribed executor on build-srv-03.zq4gs31qjdiunm1ryi1452nvnh.dx.internal.cloudapp.net
I1212 20:41:19.772159 3512 executor.cpp:171] Received LAUNCH event
I1212 20:41:19.776159 3512 executor.cpp:637] Starting task 9ffa43e5-8542-437a-a550-43b31f2e4d99
I1212 20:41:19.856178 3512 executor.cpp:477] Running 'D:\DCOS\mesos\src\mesos-containerizer.exe launch <POSSIBLY-SENSITIVE-DATA>'
I1212 20:41:20.427151 3512 executor.cpp:650] Forked command at 1944
I1212 20:41:20.453151 5912 exec.cpp:435] Executor asked to shutdown
I1212 20:41:20.454150 3512 executor.cpp:171] Received SHUTDOWN event
I1212 20:41:20.454150 3512 executor.cpp:747] Shutting down
I1212 20:41:20.454150 3512 executor.cpp:854] Sending SIGTERM to process tree at pid 1erarchical.cpp:405] Deactivated framework a2ed4f13-8018-4f90-820a-ffac2ca4629f-0000
I1212 20:41:20.451151 796 master.cpp:10146] Updating the state of task 9ffa43e5-8542-437a-a550-43b31f2e4d99 of framework a2ed4f13-8018-4f90-820a-ffac2ca4629f-0000 (latest state: TASK_KILLED, status update state: TASK_KILLED)
I1212 20:41:20.451151 10068 slave.cpp:3400] Shutting down framework a2ed4f13-8018-4f90-820a-ffac2ca4629f-0000
I1212 20:41:20.452152 10068 slave.cpp:6091] Shutting down executor '9ffa43e5-8542-437a-a550-43b31f2e4d99' of framework a2ed4f13-8018-4f90-820a-ffac2ca4629f-0000 at executor(1)@10.3.1.11:53409
I1212 20:41:20.453151 10068 slave.cpp:909] Agent terminating
W1212 20:41:20.453151 10068 slave.cpp:3396] Ignoring shutdown framework a2ed4f13-8018-4f90-820a-ffac2ca4629f-0000 because it is terminating
I1212 20:41:20.454150 796 master.cpp:10252] Removing task 9ffa43e5-8542-437a-a550-43b31f2e4d99 with resources cpus(allocated: *):4; mem(allocated: *):2048; disk(allocated: *):1024; ports(allocated: *):[31000-32000] of framework a2ed4f13-8018-4f90-820a-ffac2ca4629f-0000 on agent a2ed4f13-8018-4f90-820a-ffac2ca4629f-S0 at slave(326)@10.3.1.11:53388 (build-srv-03.zq4gs31qjdiunm1ryi1452nvnh.dx.internal.cloudapp.net)
I1212 20:41:20.455150 5636 containerizer.cpp:2328] Destroying container d711ad02-00d5-49c2-a2be-46d32d37bf3b in RUNNING state
I1212 20:41:20.456151 5636 containerizer.cpp:2930] Transitioning the state of container d711ad02-00d5-49c2-a2be-46d32d37bf3b from RUNNING to DESTROYING
I1212 20:41:20.456151 5636 launcher.cpp:156] Asked to destroy container d711ad02-00d5-49c2-a2be-46d32d37bf3b
I1212 20:41:20.457150 796 master.cpp:1305] Agent a2ed4f13-8018-4f90-820a-ffac2ca4629f-S0 at slave(326)@10.3.1.11:53388 (build-srv-03.zq4gs31qjdiunm1ryi1452nvnh.dx.internal.cloudapp.net) disconnected
I1212 20:41:20.457150 796 master.cpp:3364] Disconnecting agent a2ed4f13-8018-4f90-820a-ffac2ca4629f-S0 at slave(326)@10.3.1.11:53388 (build-srv-03.zq4gs31qjdiunm1ryi1452nvnh.dx.internal.cloudapp.net)
I1212 20:41:20.457150 796 master.cpp:3383] Deactivating agent a2ed4f13-8018-4f90-820a-ffac2ca4629f-S0 at slave(326)@10.3.1.11:53388 (build-srv-03.zq4gs31qjdiunm1ryi1452nvnh.dx.internal.cloudapp.net)
I1212 20:41:20.457150 3364 hierarchical.cpp:344] Removed framework a2ed4f13-8018-4f90-820a-ffac2ca4629f-0000
I1212 20:41:20.458150 8644 hierarchical.cpp:766] Agent a2ed4f13-8018-4f90-820a-ffac2ca4629f-S0 deactivated
I1212 20:41:20.471194 10068 containerizer.cpp:2779] Container d711ad02-00d5-49c2-a2be-46d32d37bf3b has exited
I1212 20:41:20.500277 2328 master.cpp:1147] Master terminating
I1212 20:41:20.502239 3364 hierarchical.cpp:609] Removed agent a2ed4f13-8018-4f90-820a-ffac2ca4629f-S0
I1212 20:41:20.826263 4124 process.cpp:887] Failed to accept socket: future discarded
```
- Mesos Reviewbot Windows
On Dec. 11, 2017, 5:48 p.m., Gaston Kleiman wrote:
>
> -----------------------------------------------------------
> This is an automatically generated e-mail. To reply, visit:
> https://reviews.apache.org/r/64522/
> -----------------------------------------------------------
>
> (Updated Dec. 11, 2017, 5:48 p.m.)
>
>
> Review request for mesos and Gaston Kleiman.
>
>
> Repository: mesos
>
>
> Description
> -------
>
> WIP: try to make tests pass on Windows.
>
>
> Diffs
> -----
>
> src/tests/offer_operation_status_update_manager_tests.cpp a5327d3d070a390f2ceb918dc53a024fbfe8777e
>
>
> Diff: https://reviews.apache.org/r/64522/diff/2/
>
>
> Testing
> -------
>
>
> Thanks,
>
> Gaston Kleiman
>
>
Re: Review Request 64522: WIP: try to make tests pass on Windows.
Posted by Mesos Reviewbot Windows <re...@mesos.apache.org>.
-----------------------------------------------------------
This is an automatically generated e-mail. To reply, visit:
https://reviews.apache.org/r/64522/#review193622
-----------------------------------------------------------
FAIL: Some Mesos tests failed.
Reviews applied: `['64517', '64472', '64473', '64509', '64521', '64522']`
Failed command: `D:\DCOS\mesos\src\mesos-tests.exe --verbose`
All the build artifacts available at: http://dcos-win.westus.cloudapp.azure.com/mesos-build/review/64522
Relevant logs:
- [mesos-tests-stdout.log](http://dcos-win.westus.cloudapp.azure.com/mesos-build/review/64522/logs/mesos-tests-stdout.log):
```
[ RUN ] ContainerizerType/DefaultContainerDNSFlagTest.ValidateFlag/1
[ OK ] ContainerizerType/DefaultContainerDNSFlagTest.ValidateFlag/1 (37 ms)
[----------] 2 tests from ContainerizerType/DefaultContainerDNSFlagTest (69 ms total)
[----------] 1 test from IsolationFlag/CpuIsolatorTest
[ RUN ] IsolationFlag/CpuIsolatorTest.ROOT_UserCpuUsage/0
[ OK ] IsolationFlag/CpuIsolatorTest.ROOT_UserCpuUsage/0 (2300 ms)
[----------] 1 test from IsolationFlag/CpuIsolatorTest (2322 ms total)
[----------] 1 test from IsolationFlag/MemoryIsolatorTest
[ RUN ] IsolationFlag/MemoryIsolatorTest.ROOT_MemUsage/0
[ OK ] IsolationFlag/MemoryIsolatorTest.ROOT_MemUsage/0 (2270 ms)
[----------] 1 test from IsolationFlag/MemoryIsolatorTest (2299 ms total)
[----------] Global test environment tear-down
[==========] 830 tests from 84 test cases ran. (309613 ms total)
[ PASSED ] 823 tests.
[ FAILED ] 7 tests, listed below:
[ FAILED ] OfferOperationStatusUpdateManagerTest.RecoverCheckpointedStream
[ FAILED ] OfferOperationStatusUpdateManagerTest.RecoverEmptyFile
[ FAILED ] OfferOperationStatusUpdateManagerTest.RecoverTerminatedStream
[ FAILED ] OfferOperationStatusUpdateManagerTest.IgnoreDuplicateUpdateAfterRecover
[ FAILED ] OfferOperationStatusUpdateManagerTest.RejectDuplicateAckAfterRecover
[ FAILED ] OfferOperationStatusUpdateManagerTest.NonStrictRecoveryCorruptedFile
[ FAILED ] SlaveTest.ResourceProviderPublishAll
7 FAILED TESTS
YOU HAVE 204 DISABLED TESTS
```
- [mesos-tests-stderr.log](http://dcos-win.westus.cloudapp.azure.com/mesos-build/review/64522/logs/mesos-tests-stderr.log):
```
I1212 23:07:08.811098 8412 slave.cpp:3400] Shutting down framework 9d5c56a2-97da-4850-82c4-850eb9436c2d-0000
I1212 23:07:08.811098 8412 slave.cpp:6091] Shutting down executor '453234f7-65a1-483e-a46f-bcd8816085c9' of framework 9d5c56a2-97da-4850-82c4-850eb9436c2d-0000 at executor(1)@10.3.1.5:52424
I1212 23:07:08.811098 1652 master.cpp:10146] Updating the state of task 453234f7-65a1-483e-a46f-bcd8816085c9 of framework 9d5c56a2-97da-4850-82c4-850eb9436c2d-0000 (latest state: TASK_KILLED, status update state: TAI1212 23:07:08.148102 4416 exec.cpp:162] Version: 1.5.0
I1212 23:07:08.172078 8400 exec.cpp:237] Executor registered on agent 9d5c56a2-97da-4850-82c4-850eb9436c2d-S0
I1212 23:07:08.174113 3388 executor.cpp:171] Received SUBSCRIBED event
I1212 23:07:08.179103 3388 executor.cpp:175] Subscribed executor on build-srv-04.zq4gs31qjdiunm1ryi1452nvnh.dx.internal.cloudapp.net
I1212 23:07:08.179103 3388 executor.cpp:171] Received LAUNCH event
I1212 23:07:08.183106 3388 executor.cpp:637] Starting task 453234f7-65a1-483e-a46f-bcd8816085c9
I1212 23:07:08.257084 3388 executor.cpp:477] Running 'D:\DCOS\mesos\src\mesos-containerizer.exe launch <POSSIBLY-SENSITIVE-DATA>'
I1212 23:07:08.786097 3388 executor.cpp:650] Forked command at 5976
I1212 23:07:08.812098 4108 exec.cpp:435] Executor asked to shutdown
I1212 23:07:08.813099 7580 executor.cpp:171] Received SHUTDOWN event
I1212 23:07:08.813099 7580 executor.cpp:747] Shutting down
I1212 23:07:08.813099 7580 executor.cpp:854] Sending SIGTERM to process tree at pid 5SK_KILLED)
I1212 23:07:08.812098 8412 slave.cpp:909] Agent terminating
W1212 23:07:08.812098 8412 slave.cpp:3396] Ignoring shutdown framework 9d5c56a2-97da-4850-82c4-850eb9436c2d-0000 because it is terminating
I1212 23:07:08.814098 1652 master.cpp:10252] Removing task 453234f7-65a1-483e-a46f-bcd8816085c9 with resources cpus(allocated: *):4; mem(allocated: *):2048; disk(allocated: *):1024; ports(allocated: *):[31000-32000] of framework 9d5c56a2-97da-4850-82c4-850eb9436c2d-0000 on agent 9d5c56a2-97da-4850-82c4-850eb9436c2d-S0 at slave(326)@10.3.1.5:52403 (build-srv-04.zq4gs31qjdiunm1ryi1452nvnh.dx.internal.cloudapp.net)
I1212 23:07:08.815099 7796 containerizer.cpp:2328] Destroying container afbb257d-c221-4f84-8319-0bc5fe8ad210 in RUNNING state
I1212 23:07:08.815099 7796 containerizer.cpp:2930] Transitioning the state of container afbb257d-c221-4f84-8319-0bc5fe8ad210 from RUNNING to DESTROYING
I1212 23:07:08.816099 7796 launcher.cpp:156] Asked to destroy container afbb257d-c221-4f84-8319-0bc5fe8ad210
I1212 23:07:08.816099 1652 master.cpp:1305] Agent 9d5c56a2-97da-4850-82c4-850eb9436c2d-S0 at slave(326)@10.3.1.5:52403 (build-srv-04.zq4gs31qjdiunm1ryi1452nvnh.dx.internal.cloudapp.net) disconnected
I1212 23:07:08.817098 1552 hierarchical.cpp:344] Removed framework 9d5c56a2-97da-4850-82c4-850eb9436c2d-0000
I1212 23:07:08.817098 1652 master.cpp:3364] Disconnecting agent 9d5c56a2-97da-4850-82c4-850eb9436c2d-S0 at slave(326)@10.3.1.5:52403 (build-srv-04.zq4gs31qjdiunm1ryi1452nvnh.dx.internal.cloudapp.net)
I1212 23:07:08.817098 1652 master.cpp:3383] Deactivating agent 9d5c56a2-97da-4850-82c4-850eb9436c2d-S0 at slave(326)@10.3.1.5:52403 (build-srv-04.zq4gs31qjdiunm1ryi1452nvnh.dx.internal.cloudapp.net)
I1212 23:07:08.818099 8260 hierarchical.cpp:766] Agent 9d5c56a2-97da-4850-82c4-850eb9436c2d-S0 deactivated
I1212 23:07:08.848124 7720 containerizer.cpp:2779] Container afbb257d-c221-4f84-8319-0bc5fe8ad210 has exited
I1212 23:07:08.877125 5420 master.cpp:1147] Master terminating
I1212 23:07:08.879102 7796 hierarchical.cpp:609] Removed agent 9d5c56a2-97da-4850-82c4-850eb9436c2d-S0
I1212 23:07:09.203110 6120 process.cpp:887] Failed to accept socket: future discarded
```
- Mesos Reviewbot Windows
On Dec. 12, 2017, 1:48 a.m., Gaston Kleiman wrote:
>
> -----------------------------------------------------------
> This is an automatically generated e-mail. To reply, visit:
> https://reviews.apache.org/r/64522/
> -----------------------------------------------------------
>
> (Updated Dec. 12, 2017, 1:48 a.m.)
>
>
> Review request for mesos and Gaston Kleiman.
>
>
> Repository: mesos
>
>
> Description
> -------
>
> WIP: try to make tests pass on Windows.
>
>
> Diffs
> -----
>
> src/tests/offer_operation_status_update_manager_tests.cpp a5327d3d070a390f2ceb918dc53a024fbfe8777e
>
>
> Diff: https://reviews.apache.org/r/64522/diff/3/
>
>
> Testing
> -------
>
>
> Thanks,
>
> Gaston Kleiman
>
>