You are viewing a plain text version of this content. The canonical link for it is here.
Posted to builds@cassandra.apache.org by Apache Jenkins Server <je...@builds.apache.org> on 2022/06/01 02:11:46 UTC

Build complete: Cassandra-4.1 #46 [UNSTABLE] a4196cfb30363b5a05d1ca54a5191f82e4ad64bd

-------------------------------------------------------------------------------
Build Cassandra-4.1 #46 Still Unstable
URL: https://ci-cassandra.apache.org/job/Cassandra-4.1/46/
-------------------------------------------------------------------------------
Changes:
[a.penya.garcia] Split compact storage upgrade tests to prevent OOM


-------------------------------------------------------------------------------
Failed Tests:
10 tests failed.
FAILED:  dtest-novnode.bootstrap_test.TestBootstrap.test_bootstrap_with_reset_bootstrap_state
FAILED:  dtest.cqlsh_tests.test_cqlsh.TestCqlsh.test_describe_describes_non_default_compaction_parameters
FAILED:  org.apache.cassandra.distributed.upgrade.CompactStoragePagingTest.testPagingWithCompactStorage
FAILED:  org.apache.cassandra.distributed.upgrade.MixedModeAvailabilityV3XTest.testAvailability
FAILED:  org.apache.cassandra.distributed.test.SchemaTest.readRepairWithCompaction
FAILED:  org.apache.cassandra.distributed.test.SchemaTest.readRepair
FAILED:  org.apache.cassandra.net.ConnectionTest.testTimeout-compression
FAILED:  org.apache.cassandra.db.SinglePartitionSliceCommandTest.testPartitionDeletionRowDeletionTie-compression
FAILED:  org.apache.cassandra.cql3.validation.entities.TupleTypeTest.testNestedTuple
FAILED:  org.apache.cassandra.db.commitlog.GroupCommitLogTest.testExceedRecordLimitWithMultiplePartitions[3]

-------------------------------------------------------------------------------
For complete test report and logs see https://nightlies.apache.org/cassandra/Cassandra-4.1/46/