You are viewing a plain text version of this content. The canonical link for it is here.
Posted to dev@lucene.apache.org by Policeman Jenkins Server <je...@thetaphi.de> on 2016/09/20 04:57:45 UTC

[JENKINS] Lucene-Solr-6.x-Windows (32bit/jdk1.8.0_102) - Build # 463 - Still Unstable!

Build: http://jenkins.thetaphi.de/job/Lucene-Solr-6.x-Windows/463/
Java: 32bit/jdk1.8.0_102 -server -XX:+UseParallelGC

2 tests failed.
FAILED:  junit.framework.TestSuite.org.apache.solr.schema.TestManagedSchemaAPI

Error Message:
ObjectTracker found 10 object(s) that were not released!!! [MockDirectoryWrapper, MDCAwareThreadPoolExecutor, TransactionLog, MockDirectoryWrapper, MockDirectoryWrapper, MockDirectoryWrapper, MockDirectoryWrapper, MDCAwareThreadPoolExecutor, MockDirectoryWrapper, TransactionLog]

Stack Trace:
java.lang.AssertionError: ObjectTracker found 10 object(s) that were not released!!! [MockDirectoryWrapper, MDCAwareThreadPoolExecutor, TransactionLog, MockDirectoryWrapper, MockDirectoryWrapper, MockDirectoryWrapper, MockDirectoryWrapper, MDCAwareThreadPoolExecutor, MockDirectoryWrapper, TransactionLog]
	at __randomizedtesting.SeedInfo.seed([89CE62CE0521968B]:0)
	at org.junit.Assert.fail(Assert.java:93)
	at org.junit.Assert.assertTrue(Assert.java:43)
	at org.junit.Assert.assertNull(Assert.java:551)
	at org.apache.solr.SolrTestCaseJ4.teardownTestCases(SolrTestCaseJ4.java:257)
	at sun.reflect.NativeMethodAccessorImpl.invoke0(Native Method)
	at sun.reflect.NativeMethodAccessorImpl.invoke(NativeMethodAccessorImpl.java:62)
	at sun.reflect.DelegatingMethodAccessorImpl.invoke(DelegatingMethodAccessorImpl.java:43)
	at java.lang.reflect.Method.invoke(Method.java:498)
	at com.carrotsearch.randomizedtesting.RandomizedRunner.invoke(RandomizedRunner.java:1764)
	at com.carrotsearch.randomizedtesting.RandomizedRunner$7.evaluate(RandomizedRunner.java:834)
	at com.carrotsearch.randomizedtesting.rules.StatementAdapter.evaluate(StatementAdapter.java:36)
	at com.carrotsearch.randomizedtesting.rules.SystemPropertiesRestoreRule$1.evaluate(SystemPropertiesRestoreRule.java:57)
	at org.apache.lucene.util.AbstractBeforeAfterRule$1.evaluate(AbstractBeforeAfterRule.java:45)
	at com.carrotsearch.randomizedtesting.rules.StatementAdapter.evaluate(StatementAdapter.java:36)
	at org.apache.lucene.util.TestRuleStoreClassName$1.evaluate(TestRuleStoreClassName.java:41)
	at com.carrotsearch.randomizedtesting.rules.NoShadowingOrOverridesOnMethodsRule$1.evaluate(NoShadowingOrOverridesOnMethodsRule.java:40)
	at com.carrotsearch.randomizedtesting.rules.NoShadowingOrOverridesOnMethodsRule$1.evaluate(NoShadowingOrOverridesOnMethodsRule.java:40)
	at com.carrotsearch.randomizedtesting.rules.StatementAdapter.evaluate(StatementAdapter.java:36)
	at com.carrotsearch.randomizedtesting.rules.StatementAdapter.evaluate(StatementAdapter.java:36)
	at com.carrotsearch.randomizedtesting.rules.StatementAdapter.evaluate(StatementAdapter.java:36)
	at org.apache.lucene.util.TestRuleAssertionsRequired$1.evaluate(TestRuleAssertionsRequired.java:53)
	at org.apache.lucene.util.TestRuleMarkFailure$1.evaluate(TestRuleMarkFailure.java:47)
	at org.apache.lucene.util.TestRuleIgnoreAfterMaxFailures$1.evaluate(TestRuleIgnoreAfterMaxFailures.java:64)
	at org.apache.lucene.util.TestRuleIgnoreTestSuites$1.evaluate(TestRuleIgnoreTestSuites.java:54)
	at com.carrotsearch.randomizedtesting.rules.StatementAdapter.evaluate(StatementAdapter.java:36)
	at com.carrotsearch.randomizedtesting.ThreadLeakControl$StatementRunner.run(ThreadLeakControl.java:367)
	at java.lang.Thread.run(Thread.java:745)


FAILED:  junit.framework.TestSuite.org.apache.solr.schema.TestManagedSchemaAPI

Error Message:
Could not remove the following files (in the order of attempts):    C:\Users\jenkins\workspace\Lucene-Solr-6.x-Windows\solr\build\solr-core\test\J1\temp\solr.schema.TestManagedSchemaAPI_89CE62CE0521968B-001\tempDir-001\node1\testschemaapi_shard1_replica2\data\tlog\tlog.0000000000000000001: java.nio.file.FileSystemException: C:\Users\jenkins\workspace\Lucene-Solr-6.x-Windows\solr\build\solr-core\test\J1\temp\solr.schema.TestManagedSchemaAPI_89CE62CE0521968B-001\tempDir-001\node1\testschemaapi_shard1_replica2\data\tlog\tlog.0000000000000000001: The process cannot access the file because it is being used by another process.     C:\Users\jenkins\workspace\Lucene-Solr-6.x-Windows\solr\build\solr-core\test\J1\temp\solr.schema.TestManagedSchemaAPI_89CE62CE0521968B-001\tempDir-001\node1\testschemaapi_shard1_replica2\data\tlog: java.nio.file.DirectoryNotEmptyException: C:\Users\jenkins\workspace\Lucene-Solr-6.x-Windows\solr\build\solr-core\test\J1\temp\solr.schema.TestManagedSchemaAPI_89CE62CE0521968B-001\tempDir-001\node1\testschemaapi_shard1_replica2\data\tlog    C:\Users\jenkins\workspace\Lucene-Solr-6.x-Windows\solr\build\solr-core\test\J1\temp\solr.schema.TestManagedSchemaAPI_89CE62CE0521968B-001\tempDir-001\node1\testschemaapi_shard1_replica2\data: java.nio.file.DirectoryNotEmptyException: C:\Users\jenkins\workspace\Lucene-Solr-6.x-Windows\solr\build\solr-core\test\J1\temp\solr.schema.TestManagedSchemaAPI_89CE62CE0521968B-001\tempDir-001\node1\testschemaapi_shard1_replica2\data    C:\Users\jenkins\workspace\Lucene-Solr-6.x-Windows\solr\build\solr-core\test\J1\temp\solr.schema.TestManagedSchemaAPI_89CE62CE0521968B-001\tempDir-001\node1\testschemaapi_shard1_replica2: java.nio.file.DirectoryNotEmptyException: C:\Users\jenkins\workspace\Lucene-Solr-6.x-Windows\solr\build\solr-core\test\J1\temp\solr.schema.TestManagedSchemaAPI_89CE62CE0521968B-001\tempDir-001\node1\testschemaapi_shard1_replica2    C:\Users\jenkins\workspace\Lucene-Solr-6.x-Windows\solr\build\solr-core\test\J1\temp\solr.schema.TestManagedSchemaAPI_89CE62CE0521968B-001\tempDir-001\node1: java.nio.file.DirectoryNotEmptyException: C:\Users\jenkins\workspace\Lucene-Solr-6.x-Windows\solr\build\solr-core\test\J1\temp\solr.schema.TestManagedSchemaAPI_89CE62CE0521968B-001\tempDir-001\node1    C:\Users\jenkins\workspace\Lucene-Solr-6.x-Windows\solr\build\solr-core\test\J1\temp\solr.schema.TestManagedSchemaAPI_89CE62CE0521968B-001\tempDir-001\node2\testschemaapi_shard1_replica1\data\tlog\tlog.0000000000000000000: java.nio.file.FileSystemException: C:\Users\jenkins\workspace\Lucene-Solr-6.x-Windows\solr\build\solr-core\test\J1\temp\solr.schema.TestManagedSchemaAPI_89CE62CE0521968B-001\tempDir-001\node2\testschemaapi_shard1_replica1\data\tlog\tlog.0000000000000000000: The process cannot access the file because it is being used by another process.     C:\Users\jenkins\workspace\Lucene-Solr-6.x-Windows\solr\build\solr-core\test\J1\temp\solr.schema.TestManagedSchemaAPI_89CE62CE0521968B-001\tempDir-001\node2\testschemaapi_shard1_replica1\data\tlog: java.nio.file.DirectoryNotEmptyException: C:\Users\jenkins\workspace\Lucene-Solr-6.x-Windows\solr\build\solr-core\test\J1\temp\solr.schema.TestManagedSchemaAPI_89CE62CE0521968B-001\tempDir-001\node2\testschemaapi_shard1_replica1\data\tlog    C:\Users\jenkins\workspace\Lucene-Solr-6.x-Windows\solr\build\solr-core\test\J1\temp\solr.schema.TestManagedSchemaAPI_89CE62CE0521968B-001\tempDir-001\node2\testschemaapi_shard1_replica1\data: java.nio.file.DirectoryNotEmptyException: C:\Users\jenkins\workspace\Lucene-Solr-6.x-Windows\solr\build\solr-core\test\J1\temp\solr.schema.TestManagedSchemaAPI_89CE62CE0521968B-001\tempDir-001\node2\testschemaapi_shard1_replica1\data    C:\Users\jenkins\workspace\Lucene-Solr-6.x-Windows\solr\build\solr-core\test\J1\temp\solr.schema.TestManagedSchemaAPI_89CE62CE0521968B-001\tempDir-001\node2\testschemaapi_shard1_replica1: java.nio.file.DirectoryNotEmptyException: C:\Users\jenkins\workspace\Lucene-Solr-6.x-Windows\solr\build\solr-core\test\J1\temp\solr.schema.TestManagedSchemaAPI_89CE62CE0521968B-001\tempDir-001\node2\testschemaapi_shard1_replica1    C:\Users\jenkins\workspace\Lucene-Solr-6.x-Windows\solr\build\solr-core\test\J1\temp\solr.schema.TestManagedSchemaAPI_89CE62CE0521968B-001\tempDir-001\node2: java.nio.file.DirectoryNotEmptyException: C:\Users\jenkins\workspace\Lucene-Solr-6.x-Windows\solr\build\solr-core\test\J1\temp\solr.schema.TestManagedSchemaAPI_89CE62CE0521968B-001\tempDir-001\node2    C:\Users\jenkins\workspace\Lucene-Solr-6.x-Windows\solr\build\solr-core\test\J1\temp\solr.schema.TestManagedSchemaAPI_89CE62CE0521968B-001\tempDir-001: java.nio.file.DirectoryNotEmptyException: C:\Users\jenkins\workspace\Lucene-Solr-6.x-Windows\solr\build\solr-core\test\J1\temp\solr.schema.TestManagedSchemaAPI_89CE62CE0521968B-001\tempDir-001    C:\Users\jenkins\workspace\Lucene-Solr-6.x-Windows\solr\build\solr-core\test\J1\temp\solr.schema.TestManagedSchemaAPI_89CE62CE0521968B-001: java.nio.file.DirectoryNotEmptyException: C:\Users\jenkins\workspace\Lucene-Solr-6.x-Windows\solr\build\solr-core\test\J1\temp\solr.schema.TestManagedSchemaAPI_89CE62CE0521968B-001 

Stack Trace:
java.io.IOException: Could not remove the following files (in the order of attempts):
   C:\Users\jenkins\workspace\Lucene-Solr-6.x-Windows\solr\build\solr-core\test\J1\temp\solr.schema.TestManagedSchemaAPI_89CE62CE0521968B-001\tempDir-001\node1\testschemaapi_shard1_replica2\data\tlog\tlog.0000000000000000001: java.nio.file.FileSystemException: C:\Users\jenkins\workspace\Lucene-Solr-6.x-Windows\solr\build\solr-core\test\J1\temp\solr.schema.TestManagedSchemaAPI_89CE62CE0521968B-001\tempDir-001\node1\testschemaapi_shard1_replica2\data\tlog\tlog.0000000000000000001: The process cannot access the file because it is being used by another process.

   C:\Users\jenkins\workspace\Lucene-Solr-6.x-Windows\solr\build\solr-core\test\J1\temp\solr.schema.TestManagedSchemaAPI_89CE62CE0521968B-001\tempDir-001\node1\testschemaapi_shard1_replica2\data\tlog: java.nio.file.DirectoryNotEmptyException: C:\Users\jenkins\workspace\Lucene-Solr-6.x-Windows\solr\build\solr-core\test\J1\temp\solr.schema.TestManagedSchemaAPI_89CE62CE0521968B-001\tempDir-001\node1\testschemaapi_shard1_replica2\data\tlog
   C:\Users\jenkins\workspace\Lucene-Solr-6.x-Windows\solr\build\solr-core\test\J1\temp\solr.schema.TestManagedSchemaAPI_89CE62CE0521968B-001\tempDir-001\node1\testschemaapi_shard1_replica2\data: java.nio.file.DirectoryNotEmptyException: C:\Users\jenkins\workspace\Lucene-Solr-6.x-Windows\solr\build\solr-core\test\J1\temp\solr.schema.TestManagedSchemaAPI_89CE62CE0521968B-001\tempDir-001\node1\testschemaapi_shard1_replica2\data
   C:\Users\jenkins\workspace\Lucene-Solr-6.x-Windows\solr\build\solr-core\test\J1\temp\solr.schema.TestManagedSchemaAPI_89CE62CE0521968B-001\tempDir-001\node1\testschemaapi_shard1_replica2: java.nio.file.DirectoryNotEmptyException: C:\Users\jenkins\workspace\Lucene-Solr-6.x-Windows\solr\build\solr-core\test\J1\temp\solr.schema.TestManagedSchemaAPI_89CE62CE0521968B-001\tempDir-001\node1\testschemaapi_shard1_replica2
   C:\Users\jenkins\workspace\Lucene-Solr-6.x-Windows\solr\build\solr-core\test\J1\temp\solr.schema.TestManagedSchemaAPI_89CE62CE0521968B-001\tempDir-001\node1: java.nio.file.DirectoryNotEmptyException: C:\Users\jenkins\workspace\Lucene-Solr-6.x-Windows\solr\build\solr-core\test\J1\temp\solr.schema.TestManagedSchemaAPI_89CE62CE0521968B-001\tempDir-001\node1
   C:\Users\jenkins\workspace\Lucene-Solr-6.x-Windows\solr\build\solr-core\test\J1\temp\solr.schema.TestManagedSchemaAPI_89CE62CE0521968B-001\tempDir-001\node2\testschemaapi_shard1_replica1\data\tlog\tlog.0000000000000000000: java.nio.file.FileSystemException: C:\Users\jenkins\workspace\Lucene-Solr-6.x-Windows\solr\build\solr-core\test\J1\temp\solr.schema.TestManagedSchemaAPI_89CE62CE0521968B-001\tempDir-001\node2\testschemaapi_shard1_replica1\data\tlog\tlog.0000000000000000000: The process cannot access the file because it is being used by another process.

   C:\Users\jenkins\workspace\Lucene-Solr-6.x-Windows\solr\build\solr-core\test\J1\temp\solr.schema.TestManagedSchemaAPI_89CE62CE0521968B-001\tempDir-001\node2\testschemaapi_shard1_replica1\data\tlog: java.nio.file.DirectoryNotEmptyException: C:\Users\jenkins\workspace\Lucene-Solr-6.x-Windows\solr\build\solr-core\test\J1\temp\solr.schema.TestManagedSchemaAPI_89CE62CE0521968B-001\tempDir-001\node2\testschemaapi_shard1_replica1\data\tlog
   C:\Users\jenkins\workspace\Lucene-Solr-6.x-Windows\solr\build\solr-core\test\J1\temp\solr.schema.TestManagedSchemaAPI_89CE62CE0521968B-001\tempDir-001\node2\testschemaapi_shard1_replica1\data: java.nio.file.DirectoryNotEmptyException: C:\Users\jenkins\workspace\Lucene-Solr-6.x-Windows\solr\build\solr-core\test\J1\temp\solr.schema.TestManagedSchemaAPI_89CE62CE0521968B-001\tempDir-001\node2\testschemaapi_shard1_replica1\data
   C:\Users\jenkins\workspace\Lucene-Solr-6.x-Windows\solr\build\solr-core\test\J1\temp\solr.schema.TestManagedSchemaAPI_89CE62CE0521968B-001\tempDir-001\node2\testschemaapi_shard1_replica1: java.nio.file.DirectoryNotEmptyException: C:\Users\jenkins\workspace\Lucene-Solr-6.x-Windows\solr\build\solr-core\test\J1\temp\solr.schema.TestManagedSchemaAPI_89CE62CE0521968B-001\tempDir-001\node2\testschemaapi_shard1_replica1
   C:\Users\jenkins\workspace\Lucene-Solr-6.x-Windows\solr\build\solr-core\test\J1\temp\solr.schema.TestManagedSchemaAPI_89CE62CE0521968B-001\tempDir-001\node2: java.nio.file.DirectoryNotEmptyException: C:\Users\jenkins\workspace\Lucene-Solr-6.x-Windows\solr\build\solr-core\test\J1\temp\solr.schema.TestManagedSchemaAPI_89CE62CE0521968B-001\tempDir-001\node2
   C:\Users\jenkins\workspace\Lucene-Solr-6.x-Windows\solr\build\solr-core\test\J1\temp\solr.schema.TestManagedSchemaAPI_89CE62CE0521968B-001\tempDir-001: java.nio.file.DirectoryNotEmptyException: C:\Users\jenkins\workspace\Lucene-Solr-6.x-Windows\solr\build\solr-core\test\J1\temp\solr.schema.TestManagedSchemaAPI_89CE62CE0521968B-001\tempDir-001
   C:\Users\jenkins\workspace\Lucene-Solr-6.x-Windows\solr\build\solr-core\test\J1\temp\solr.schema.TestManagedSchemaAPI_89CE62CE0521968B-001: java.nio.file.DirectoryNotEmptyException: C:\Users\jenkins\workspace\Lucene-Solr-6.x-Windows\solr\build\solr-core\test\J1\temp\solr.schema.TestManagedSchemaAPI_89CE62CE0521968B-001

	at org.apache.lucene.util.IOUtils.rm(IOUtils.java:323)
	at org.apache.lucene.util.TestRuleTemporaryFilesCleanup.afterAlways(TestRuleTemporaryFilesCleanup.java:216)
	at com.carrotsearch.randomizedtesting.rules.TestRuleAdapter$1.afterAlways(TestRuleAdapter.java:31)
	at com.carrotsearch.randomizedtesting.rules.StatementAdapter.evaluate(StatementAdapter.java:43)
	at com.carrotsearch.randomizedtesting.rules.StatementAdapter.evaluate(StatementAdapter.java:36)
	at org.apache.lucene.util.TestRuleAssertionsRequired$1.evaluate(TestRuleAssertionsRequired.java:53)
	at org.apache.lucene.util.TestRuleMarkFailure$1.evaluate(TestRuleMarkFailure.java:47)
	at org.apache.lucene.util.TestRuleIgnoreAfterMaxFailures$1.evaluate(TestRuleIgnoreAfterMaxFailures.java:64)
	at org.apache.lucene.util.TestRuleIgnoreTestSuites$1.evaluate(TestRuleIgnoreTestSuites.java:54)
	at com.carrotsearch.randomizedtesting.rules.StatementAdapter.evaluate(StatementAdapter.java:36)
	at com.carrotsearch.randomizedtesting.ThreadLeakControl$StatementRunner.run(ThreadLeakControl.java:367)
	at java.lang.Thread.run(Thread.java:745)




Build Log:
[...truncated 10728 lines...]
   [junit4] Suite: org.apache.solr.schema.TestManagedSchemaAPI
   [junit4]   2> Creating dataDir: C:\Users\jenkins\workspace\Lucene-Solr-6.x-Windows\solr\build\solr-core\test\J1\temp\solr.schema.TestManagedSchemaAPI_89CE62CE0521968B-001\init-core-data-001
   [junit4]   2> 136678 INFO  (SUITE-TestManagedSchemaAPI-seed#[89CE62CE0521968B]-worker) [    ] o.a.s.SolrTestCaseJ4 Randomized ssl (true) and clientAuth (false) via: @org.apache.solr.util.RandomizeSSL(reason=, value=NaN, ssl=NaN, clientAuth=NaN)
   [junit4]   2> 136685 INFO  (SUITE-TestManagedSchemaAPI-seed#[89CE62CE0521968B]-worker) [    ] o.a.s.c.ZkTestServer STARTING ZK TEST SERVER
   [junit4]   2> 136686 INFO  (Thread-184) [    ] o.a.s.c.ZkTestServer client port:0.0.0.0/0.0.0.0:0
   [junit4]   2> 136686 INFO  (Thread-184) [    ] o.a.s.c.ZkTestServer Starting server
   [junit4]   2> 136786 INFO  (SUITE-TestManagedSchemaAPI-seed#[89CE62CE0521968B]-worker) [    ] o.a.s.c.ZkTestServer start zk server on port:61639
   [junit4]   2> 136786 INFO  (SUITE-TestManagedSchemaAPI-seed#[89CE62CE0521968B]-worker) [    ] o.a.s.c.c.SolrZkClient Using default ZkCredentialsProvider
   [junit4]   2> 136788 INFO  (SUITE-TestManagedSchemaAPI-seed#[89CE62CE0521968B]-worker) [    ] o.a.s.c.c.ConnectionManager Waiting for client to connect to ZooKeeper
   [junit4]   2> 136793 INFO  (zkCallback-234-thread-1) [    ] o.a.s.c.c.ConnectionManager Watcher org.apache.solr.common.cloud.ConnectionManager@a8534a name:ZooKeeperConnection Watcher:127.0.0.1:61639 got event WatchedEvent state:SyncConnected type:None path:null path:null type:None
   [junit4]   2> 136793 INFO  (SUITE-TestManagedSchemaAPI-seed#[89CE62CE0521968B]-worker) [    ] o.a.s.c.c.ConnectionManager Client is connected to ZooKeeper
   [junit4]   2> 136794 INFO  (SUITE-TestManagedSchemaAPI-seed#[89CE62CE0521968B]-worker) [    ] o.a.s.c.c.SolrZkClient Using default ZkACLProvider
   [junit4]   2> 136794 INFO  (SUITE-TestManagedSchemaAPI-seed#[89CE62CE0521968B]-worker) [    ] o.a.s.c.c.SolrZkClient makePath: /solr/solr.xml
   [junit4]   2> 136802 INFO  (SUITE-TestManagedSchemaAPI-seed#[89CE62CE0521968B]-worker) [    ] o.a.s.c.c.SolrZkClient makePath: /solr/clusterprops.json
   [junit4]   2> 136856 INFO  (jetty-launcher-233-thread-1) [    ] o.e.j.s.Server jetty-9.3.8.v20160314
   [junit4]   2> 136856 INFO  (jetty-launcher-233-thread-2) [    ] o.e.j.s.Server jetty-9.3.8.v20160314
   [junit4]   2> 136860 INFO  (jetty-launcher-233-thread-1) [    ] o.e.j.s.h.ContextHandler Started o.e.j.s.ServletContextHandler@bd6606{/solr,null,AVAILABLE}
   [junit4]   2> 136864 INFO  (jetty-launcher-233-thread-2) [    ] o.e.j.s.h.ContextHandler Started o.e.j.s.ServletContextHandler@1acee8b{/solr,null,AVAILABLE}
   [junit4]   2> 137077 INFO  (jetty-launcher-233-thread-2) [    ] o.e.j.s.ServerConnector Started ServerConnector@6d68df{SSL,[ssl, http/1.1]}{127.0.0.1:61644}
   [junit4]   2> 137078 INFO  (jetty-launcher-233-thread-2) [    ] o.e.j.s.Server Started @143547ms
   [junit4]   2> 137078 INFO  (jetty-launcher-233-thread-2) [    ] o.a.s.c.s.e.JettySolrRunner Jetty properties: {hostContext=/solr, hostPort=61644}
   [junit4]   2> 137078 INFO  (jetty-launcher-233-thread-2) [    ] o.a.s.s.SolrDispatchFilter SolrDispatchFilter.init(): sun.misc.Launcher$AppClassLoader@1d16e93
   [junit4]   2> 137078 INFO  (jetty-launcher-233-thread-2) [    ] o.a.s.c.SolrResourceLoader new SolrResourceLoader for directory: 'C:\Users\jenkins\workspace\Lucene-Solr-6.x-Windows\solr\build\solr-core\test\J1\temp\solr.schema.TestManagedSchemaAPI_89CE62CE0521968B-001\tempDir-001\node2'
   [junit4]   2> 137079 INFO  (jetty-launcher-233-thread-2) [    ] o.a.s.c.SolrResourceLoader JNDI not configured for solr (NoInitialContextEx)
   [junit4]   2> 137079 INFO  (jetty-launcher-233-thread-2) [    ] o.a.s.c.SolrResourceLoader solr home defaulted to 'solr/' (could not find system property or JNDI)
   [junit4]   2> 137080 INFO  (jetty-launcher-233-thread-2) [    ] o.a.s.c.c.SolrZkClient Using default ZkCredentialsProvider
   [junit4]   2> 137081 INFO  (jetty-launcher-233-thread-1) [    ] o.e.j.s.ServerConnector Started ServerConnector@1ab818{SSL,[ssl, http/1.1]}{127.0.0.1:61643}
   [junit4]   2> 137081 INFO  (jetty-launcher-233-thread-1) [    ] o.e.j.s.Server Started @143550ms
   [junit4]   2> 137081 INFO  (jetty-launcher-233-thread-1) [    ] o.a.s.c.s.e.JettySolrRunner Jetty properties: {hostContext=/solr, hostPort=61643}
   [junit4]   2> 137081 INFO  (jetty-launcher-233-thread-1) [    ] o.a.s.s.SolrDispatchFilter SolrDispatchFilter.init(): sun.misc.Launcher$AppClassLoader@1d16e93
   [junit4]   2> 137081 INFO  (jetty-launcher-233-thread-1) [    ] o.a.s.c.SolrResourceLoader new SolrResourceLoader for directory: 'C:\Users\jenkins\workspace\Lucene-Solr-6.x-Windows\solr\build\solr-core\test\J1\temp\solr.schema.TestManagedSchemaAPI_89CE62CE0521968B-001\tempDir-001\node1'
   [junit4]   2> 137081 INFO  (jetty-launcher-233-thread-1) [    ] o.a.s.c.SolrResourceLoader JNDI not configured for solr (NoInitialContextEx)
   [junit4]   2> 137081 INFO  (jetty-launcher-233-thread-1) [    ] o.a.s.c.SolrResourceLoader solr home defaulted to 'solr/' (could not find system property or JNDI)
   [junit4]   2> 137082 INFO  (jetty-launcher-233-thread-1) [    ] o.a.s.c.c.SolrZkClient Using default ZkCredentialsProvider
   [junit4]   2> 137084 INFO  (jetty-launcher-233-thread-1) [    ] o.a.s.c.c.ConnectionManager Waiting for client to connect to ZooKeeper
   [junit4]   2> 137084 INFO  (jetty-launcher-233-thread-2) [    ] o.a.s.c.c.ConnectionManager Waiting for client to connect to ZooKeeper
   [junit4]   2> 137090 INFO  (zkCallback-235-thread-1) [    ] o.a.s.c.c.ConnectionManager Watcher org.apache.solr.common.cloud.ConnectionManager@7cff1f name:ZooKeeperConnection Watcher:127.0.0.1:61639/solr got event WatchedEvent state:SyncConnected type:None path:null path:null type:None
   [junit4]   2> 137090 INFO  (jetty-launcher-233-thread-2) [    ] o.a.s.c.c.ConnectionManager Client is connected to ZooKeeper
   [junit4]   2> 137090 INFO  (jetty-launcher-233-thread-2) [    ] o.a.s.c.c.SolrZkClient Using default ZkACLProvider
   [junit4]   2> 137092 INFO  (zkCallback-236-thread-1) [    ] o.a.s.c.c.ConnectionManager Watcher org.apache.solr.common.cloud.ConnectionManager@181f1d4 name:ZooKeeperConnection Watcher:127.0.0.1:61639/solr got event WatchedEvent state:SyncConnected type:None path:null path:null type:None
   [junit4]   2> 137092 INFO  (jetty-launcher-233-thread-1) [    ] o.a.s.c.c.ConnectionManager Client is connected to ZooKeeper
   [junit4]   2> 137092 INFO  (jetty-launcher-233-thread-1) [    ] o.a.s.c.c.SolrZkClient Using default ZkACLProvider
   [junit4]   2> 137093 INFO  (jetty-launcher-233-thread-2) [    ] o.a.s.s.SolrDispatchFilter solr.xml found in ZooKeeper. Loading...
   [junit4]   2> 137094 INFO  (jetty-launcher-233-thread-1) [    ] o.a.s.s.SolrDispatchFilter solr.xml found in ZooKeeper. Loading...
   [junit4]   2> 137109 INFO  (jetty-launcher-233-thread-1) [    ] o.a.s.c.CorePropertiesLocator Config-defined core root directory: C:\Users\jenkins\workspace\Lucene-Solr-6.x-Windows\solr\build\solr-core\test\J1\temp\solr.schema.TestManagedSchemaAPI_89CE62CE0521968B-001\tempDir-001\node1\.
   [junit4]   2> 137109 INFO  (jetty-launcher-233-thread-2) [    ] o.a.s.c.CorePropertiesLocator Config-defined core root directory: C:\Users\jenkins\workspace\Lucene-Solr-6.x-Windows\solr\build\solr-core\test\J1\temp\solr.schema.TestManagedSchemaAPI_89CE62CE0521968B-001\tempDir-001\node2\.
   [junit4]   2> 137109 INFO  (jetty-launcher-233-thread-1) [    ] o.a.s.c.CoreContainer New CoreContainer 16359844
   [junit4]   2> 137109 INFO  (jetty-launcher-233-thread-2) [    ] o.a.s.c.CoreContainer New CoreContainer 12860103
   [junit4]   2> 137109 INFO  (jetty-launcher-233-thread-1) [    ] o.a.s.c.CoreContainer Loading cores into CoreContainer [instanceDir=C:\Users\jenkins\workspace\Lucene-Solr-6.x-Windows\solr\build\solr-core\test\J1\temp\solr.schema.TestManagedSchemaAPI_89CE62CE0521968B-001\tempDir-001\node1]
   [junit4]   2> 137109 INFO  (jetty-launcher-233-thread-2) [    ] o.a.s.c.CoreContainer Loading cores into CoreContainer [instanceDir=C:\Users\jenkins\workspace\Lucene-Solr-6.x-Windows\solr\build\solr-core\test\J1\temp\solr.schema.TestManagedSchemaAPI_89CE62CE0521968B-001\tempDir-001\node2]
   [junit4]   2> 137109 WARN  (jetty-launcher-233-thread-2) [    ] o.a.s.c.CoreContainer Couldn't add files from C:\Users\jenkins\workspace\Lucene-Solr-6.x-Windows\solr\build\solr-core\test\J1\temp\solr.schema.TestManagedSchemaAPI_89CE62CE0521968B-001\tempDir-001\node2\lib to classpath: C:\Users\jenkins\workspace\Lucene-Solr-6.x-Windows\solr\build\solr-core\test\J1\temp\solr.schema.TestManagedSchemaAPI_89CE62CE0521968B-001\tempDir-001\node2\lib
   [junit4]   2> 137109 WARN  (jetty-launcher-233-thread-1) [    ] o.a.s.c.CoreContainer Couldn't add files from C:\Users\jenkins\workspace\Lucene-Solr-6.x-Windows\solr\build\solr-core\test\J1\temp\solr.schema.TestManagedSchemaAPI_89CE62CE0521968B-001\tempDir-001\node1\lib to classpath: C:\Users\jenkins\workspace\Lucene-Solr-6.x-Windows\solr\build\solr-core\test\J1\temp\solr.schema.TestManagedSchemaAPI_89CE62CE0521968B-001\tempDir-001\node1\lib
   [junit4]   2> 137110 INFO  (jetty-launcher-233-thread-1) [    ] o.a.s.h.c.HttpShardHandlerFactory created with socketTimeout : 90000,urlScheme : https,connTimeout : 15000,maxConnectionsPerHost : 20,maxConnections : 10000,corePoolSize : 0,maximumPoolSize : 2147483647,maxThreadIdleTime : 5,sizeOfQueue : -1,fairnessPolicy : false,useRetries : false,connectionsEvictorSleepDelay : 5000,maxConnectionIdleTime : 40000,
   [junit4]   2> 137110 INFO  (jetty-launcher-233-thread-2) [    ] o.a.s.h.c.HttpShardHandlerFactory created with socketTimeout : 90000,urlScheme : https,connTimeout : 15000,maxConnectionsPerHost : 20,maxConnections : 10000,corePoolSize : 0,maximumPoolSize : 2147483647,maxThreadIdleTime : 5,sizeOfQueue : -1,fairnessPolicy : false,useRetries : false,connectionsEvictorSleepDelay : 5000,maxConnectionIdleTime : 40000,
   [junit4]   2> 137116 INFO  (jetty-launcher-233-thread-1) [    ] o.a.s.u.UpdateShardHandler Creating UpdateShardHandler HTTP client with params: socketTimeout=340000&connTimeout=45000&retry=true
   [junit4]   2> 137117 INFO  (jetty-launcher-233-thread-2) [    ] o.a.s.u.UpdateShardHandler Creating UpdateShardHandler HTTP client with params: socketTimeout=340000&connTimeout=45000&retry=true
   [junit4]   2> 137118 INFO  (jetty-launcher-233-thread-2) [    ] o.a.s.l.LogWatcher SLF4J impl is org.slf4j.impl.Log4jLoggerFactory
   [junit4]   2> 137118 INFO  (jetty-launcher-233-thread-2) [    ] o.a.s.l.LogWatcher Registering Log Listener [Log4j (org.slf4j.impl.Log4jLoggerFactory)]
   [junit4]   2> 137118 INFO  (jetty-launcher-233-thread-2) [    ] o.a.s.c.ZkContainer Zookeeper client=127.0.0.1:61639/solr
   [junit4]   2> 137118 INFO  (jetty-launcher-233-thread-2) [    ] o.a.s.c.ZkController zkHost includes chroot
   [junit4]   2> 137118 INFO  (jetty-launcher-233-thread-2) [    ] o.a.s.c.c.SolrZkClient Using default ZkCredentialsProvider
   [junit4]   2> 137120 INFO  (jetty-launcher-233-thread-1) [    ] o.a.s.l.LogWatcher SLF4J impl is org.slf4j.impl.Log4jLoggerFactory
   [junit4]   2> 137121 INFO  (jetty-launcher-233-thread-1) [    ] o.a.s.l.LogWatcher Registering Log Listener [Log4j (org.slf4j.impl.Log4jLoggerFactory)]
   [junit4]   2> 137121 INFO  (jetty-launcher-233-thread-1) [    ] o.a.s.c.ZkContainer Zookeeper client=127.0.0.1:61639/solr
   [junit4]   2> 137121 INFO  (jetty-launcher-233-thread-1) [    ] o.a.s.c.ZkController zkHost includes chroot
   [junit4]   2> 137121 INFO  (jetty-launcher-233-thread-1) [    ] o.a.s.c.c.SolrZkClient Using default ZkCredentialsProvider
   [junit4]   2> 137121 INFO  (jetty-launcher-233-thread-2) [    ] o.a.s.c.c.ConnectionManager Waiting for client to connect to ZooKeeper
   [junit4]   2> 137124 INFO  (jetty-launcher-233-thread-1) [    ] o.a.s.c.c.ConnectionManager Waiting for client to connect to ZooKeeper
   [junit4]   2> 137126 INFO  (zkCallback-241-thread-1) [    ] o.a.s.c.c.ConnectionManager Watcher org.apache.solr.common.cloud.ConnectionManager@15dd169 name:ZooKeeperConnection Watcher:127.0.0.1:61639 got event WatchedEvent state:SyncConnected type:None path:null path:null type:None
   [junit4]   2> 137126 INFO  (jetty-launcher-233-thread-2) [    ] o.a.s.c.c.ConnectionManager Client is connected to ZooKeeper
   [junit4]   2> 137127 INFO  (jetty-launcher-233-thread-2) [    ] o.a.s.c.c.SolrZkClient Using default ZkACLProvider
   [junit4]   2> 137129 WARN  (NIOServerCxn.Factory:0.0.0.0/0.0.0.0:0) [    ] o.a.z.s.NIOServerCnxn caught end of stream exception
   [junit4]   2> EndOfStreamException: Unable to read additional data from client sessionid 0x15745aad42c0003, likely client has closed socket
   [junit4]   2> 	at org.apache.zookeeper.server.NIOServerCnxn.doIO(NIOServerCnxn.java:228)
   [junit4]   2> 	at org.apache.zookeeper.server.NIOServerCnxnFactory.run(NIOServerCnxnFactory.java:208)
   [junit4]   2> 	at java.lang.Thread.run(Thread.java:745)
   [junit4]   2> 137129 INFO  (jetty-launcher-233-thread-2) [n:127.0.0.1:61644_solr    ] o.a.s.c.ZkController Added new OnReconnect listener org.apache.solr.cloud.ZkController$$Lambda$10/33131742@9b6f0e
   [junit4]   2> 137129 INFO  (zkCallback-242-thread-1) [    ] o.a.s.c.c.ConnectionManager Watcher org.apache.solr.common.cloud.ConnectionManager@1853b3d name:ZooKeeperConnection Watcher:127.0.0.1:61639 got event WatchedEvent state:SyncConnected type:None path:null path:null type:None
   [junit4]   2> 137129 INFO  (jetty-launcher-233-thread-1) [    ] o.a.s.c.c.ConnectionManager Client is connected to ZooKeeper
   [junit4]   2> 137129 INFO  (jetty-launcher-233-thread-1) [    ] o.a.s.c.c.SolrZkClient Using default ZkACLProvider
   [junit4]   2> 137131 INFO  (jetty-launcher-233-thread-2) [n:127.0.0.1:61644_solr    ] o.a.s.c.c.ConnectionManager Waiting for client to connect to ZooKeeper
   [junit4]   2> 137134 INFO  (jetty-launcher-233-thread-1) [n:127.0.0.1:61643_solr    ] o.a.s.c.ZkController Added new OnReconnect listener org.apache.solr.cloud.ZkController$$Lambda$10/33131742@188ccbd
   [junit4]   2> 137136 INFO  (jetty-launcher-233-thread-1) [n:127.0.0.1:61643_solr    ] o.a.s.c.c.ConnectionManager Waiting for client to connect to ZooKeeper
   [junit4]   2> 137139 INFO  (zkCallback-243-thread-1-processing-n:127.0.0.1:61644_solr) [n:127.0.0.1:61644_solr    ] o.a.s.c.c.ConnectionManager Watcher org.apache.solr.common.cloud.ConnectionManager@13c88f0 name:ZooKeeperConnection Watcher:127.0.0.1:61639/solr got event WatchedEvent state:SyncConnected type:None path:null path:null type:None
   [junit4]   2> 137139 INFO  (jetty-launcher-233-thread-2) [n:127.0.0.1:61644_solr    ] o.a.s.c.c.ConnectionManager Client is connected to ZooKeeper
   [junit4]   2> 137141 INFO  (zkCallback-244-thread-1-processing-n:127.0.0.1:61643_solr) [n:127.0.0.1:61643_solr    ] o.a.s.c.c.ConnectionManager Watcher org.apache.solr.common.cloud.ConnectionManager@d9d6cf name:ZooKeeperConnection Watcher:127.0.0.1:61639/solr got event WatchedEvent state:SyncConnected type:None path:null path:null type:None
   [junit4]   2> 137141 INFO  (jetty-launcher-233-thread-1) [n:127.0.0.1:61643_solr    ] o.a.s.c.c.ConnectionManager Client is connected to ZooKeeper
   [junit4]   2> 137143 INFO  (jetty-launcher-233-thread-1) [n:127.0.0.1:61643_solr    ] o.a.s.c.c.SolrZkClient makePath: /overseer/queue
   [junit4]   2> 137145 INFO  (jetty-launcher-233-thread-2) [n:127.0.0.1:61644_solr    ] o.a.s.c.c.SolrZkClient makePath: /overseer/queue
   [junit4]   2> 137147 INFO  (jetty-launcher-233-thread-1) [n:127.0.0.1:61643_solr    ] o.a.s.c.c.SolrZkClient makePath: /overseer/collection-queue-work
   [junit4]   2> 137154 INFO  (jetty-launcher-233-thread-1) [n:127.0.0.1:61643_solr    ] o.a.s.c.c.SolrZkClient makePath: /overseer/collection-map-running
   [junit4]   2> 137154 INFO  (jetty-launcher-233-thread-2) [n:127.0.0.1:61644_solr    ] o.a.s.c.c.SolrZkClient makePath: /overseer/collection-map-running
   [junit4]   2> 137157 INFO  (jetty-launcher-233-thread-1) [n:127.0.0.1:61643_solr    ] o.a.s.c.c.SolrZkClient makePath: /overseer/collection-map-completed
   [junit4]   2> 137158 INFO  (jetty-launcher-233-thread-2) [n:127.0.0.1:61644_solr    ] o.a.s.c.c.SolrZkClient makePath: /overseer/collection-map-completed
   [junit4]   2> 137160 INFO  (jetty-launcher-233-thread-1) [n:127.0.0.1:61643_solr    ] o.a.s.c.c.SolrZkClient makePath: /overseer/collection-map-failure
   [junit4]   2> 137161 INFO  (jetty-launcher-233-thread-2) [n:127.0.0.1:61644_solr    ] o.a.s.c.c.SolrZkClient makePath: /overseer/collection-map-failure
   [junit4]   2> 137162 INFO  (jetty-launcher-233-thread-2) [n:127.0.0.1:61644_solr    ] o.a.s.c.c.SolrZkClient makePath: /live_nodes
   [junit4]   2> 137162 INFO  (jetty-launcher-233-thread-1) [n:127.0.0.1:61643_solr    ] o.a.s.c.c.SolrZkClient makePath: /live_nodes
   [junit4]   2> 137164 INFO  (jetty-launcher-233-thread-2) [n:127.0.0.1:61644_solr    ] o.a.s.c.c.SolrZkClient makePath: /collections
   [junit4]   2> 137164 INFO  (jetty-launcher-233-thread-1) [n:127.0.0.1:61643_solr    ] o.a.s.c.c.SolrZkClient makePath: /collections
   [junit4]   2> 137166 INFO  (jetty-launcher-233-thread-1) [n:127.0.0.1:61643_solr    ] o.a.s.c.c.SolrZkClient makePath: /aliases.json
   [junit4]   2> 137166 INFO  (jetty-launcher-233-thread-2) [n:127.0.0.1:61644_solr    ] o.a.s.c.c.SolrZkClient makePath: /aliases.json
   [junit4]   2> 137169 INFO  (jetty-launcher-233-thread-1) [n:127.0.0.1:61643_solr    ] o.a.s.c.c.SolrZkClient makePath: /clusterstate.json
   [junit4]   2> 137169 INFO  (jetty-launcher-233-thread-2) [n:127.0.0.1:61644_solr    ] o.a.s.c.c.SolrZkClient makePath: /clusterstate.json
   [junit4]   2> 137170 INFO  (jetty-launcher-233-thread-1) [n:127.0.0.1:61643_solr    ] o.a.s.c.c.SolrZkClient makePath: /security.json
   [junit4]   2> 137170 INFO  (jetty-launcher-233-thread-2) [n:127.0.0.1:61644_solr    ] o.a.s.c.c.SolrZkClient makePath: /security.json
   [junit4]   2> 137171 INFO  (jetty-launcher-233-thread-2) [n:127.0.0.1:61644_solr    ] o.a.s.c.c.ZkStateReader Updating cluster state from ZooKeeper... 
   [junit4]   2> 137171 INFO  (jetty-launcher-233-thread-1) [n:127.0.0.1:61643_solr    ] o.a.s.c.c.ZkStateReader Updating cluster state from ZooKeeper... 
   [junit4]   2> 137172 INFO  (jetty-launcher-233-thread-1) [n:127.0.0.1:61643_solr    ] o.a.s.c.c.ZkStateReader Loaded cluster properties: {urlScheme=https}
   [junit4]   2> 137172 INFO  (jetty-launcher-233-thread-2) [n:127.0.0.1:61644_solr    ] o.a.s.c.c.ZkStateReader Loaded cluster properties: {urlScheme=https}
   [junit4]   2> 137173 INFO  (jetty-launcher-233-thread-1) [n:127.0.0.1:61643_solr    ] o.a.s.c.c.ZkStateReader Updated live nodes from ZooKeeper... (0) -> (0)
   [junit4]   2> 137173 INFO  (jetty-launcher-233-thread-2) [n:127.0.0.1:61644_solr    ] o.a.s.c.c.ZkStateReader Updated live nodes from ZooKeeper... (0) -> (0)
   [junit4]   2> 137177 INFO  (jetty-launcher-233-thread-1) [n:127.0.0.1:61643_solr    ] o.a.s.c.c.SolrZkClient makePath: /overseer_elect
   [junit4]   2> 137177 INFO  (jetty-launcher-233-thread-2) [n:127.0.0.1:61644_solr    ] o.a.s.c.c.SolrZkClient makePath: /overseer_elect
   [junit4]   2> 137178 INFO  (jetty-launcher-233-thread-2) [n:127.0.0.1:61644_solr    ] o.a.s.c.c.SolrZkClient makePath: /overseer_elect/election
   [junit4]   2> 137179 INFO  (jetty-launcher-233-thread-1) [n:127.0.0.1:61643_solr    ] o.a.s.c.c.SolrZkClient makePath: /overseer_elect/election
   [junit4]   2> 137181 INFO  (jetty-launcher-233-thread-1) [n:127.0.0.1:61643_solr    ] o.a.s.c.Overseer Overseer (id=null) closing
   [junit4]   2> 137181 INFO  (jetty-launcher-233-thread-2) [n:127.0.0.1:61644_solr    ] o.a.s.c.Overseer Overseer (id=null) closing
   [junit4]   2> 137181 INFO  (jetty-launcher-233-thread-1) [n:127.0.0.1:61643_solr    ] o.a.s.c.LeaderElector Joined leadership election with path: /overseer_elect/election/96622517018165254-127.0.0.1:61643_solr-n_0000000000
   [junit4]   2> 137182 INFO  (jetty-launcher-233-thread-2) [n:127.0.0.1:61644_solr    ] o.a.s.c.LeaderElector Joined leadership election with path: /overseer_elect/election/96622517018165253-127.0.0.1:61644_solr-n_0000000001
   [junit4]   2> 137182 INFO  (jetty-launcher-233-thread-1) [n:127.0.0.1:61643_solr    ] o.a.s.c.OverseerElectionContext I am going to be the leader 127.0.0.1:61643_solr
   [junit4]   2> 137182 INFO  (jetty-launcher-233-thread-1) [n:127.0.0.1:61643_solr    ] o.a.s.c.c.SolrZkClient makePath: /overseer_elect/leader
   [junit4]   2> 137184 INFO  (jetty-launcher-233-thread-2) [n:127.0.0.1:61644_solr    ] o.a.s.c.LeaderElector Watching path /overseer_elect/election/96622517018165254-127.0.0.1:61643_solr-n_0000000000 to know if I could be the leader
   [junit4]   2> 137184 INFO  (jetty-launcher-233-thread-2) [n:127.0.0.1:61644_solr    ] o.a.s.c.ZkController Register node as live in ZooKeeper:/live_nodes/127.0.0.1:61644_solr
   [junit4]   2> 137184 INFO  (jetty-launcher-233-thread-2) [n:127.0.0.1:61644_solr    ] o.a.s.c.c.SolrZkClient makePath: /live_nodes/127.0.0.1:61644_solr
   [junit4]   2> 137185 INFO  (jetty-launcher-233-thread-1) [n:127.0.0.1:61643_solr    ] o.a.s.c.Overseer Overseer (id=96622517018165254-127.0.0.1:61643_solr-n_0000000000) starting
   [junit4]   2> 137186 INFO  (zkCallback-243-thread-1-processing-n:127.0.0.1:61644_solr) [n:127.0.0.1:61644_solr    ] o.a.s.c.c.ZkStateReader A live node change: [WatchedEvent state:SyncConnected type:NodeChildrenChanged path:/live_nodes], has occurred - updating... (live nodes size: [0])
   [junit4]   2> 137186 INFO  (zkCallback-244-thread-1-processing-n:127.0.0.1:61643_solr) [n:127.0.0.1:61643_solr    ] o.a.s.c.c.ZkStateReader A live node change: [WatchedEvent state:SyncConnected type:NodeChildrenChanged path:/live_nodes], has occurred - updating... (live nodes size: [0])
   [junit4]   2> 137188 INFO  (zkCallback-244-thread-1-processing-n:127.0.0.1:61643_solr) [n:127.0.0.1:61643_solr    ] o.a.s.c.c.ZkStateReader Updated live nodes from ZooKeeper... (0) -> (1)
   [junit4]   2> 137188 INFO  (zkCallback-243-thread-1-processing-n:127.0.0.1:61644_solr) [n:127.0.0.1:61644_solr    ] o.a.s.c.c.ZkStateReader Updated live nodes from ZooKeeper... (0) -> (1)
   [junit4]   2> 137189 INFO  (jetty-launcher-233-thread-1) [n:127.0.0.1:61643_solr    ] o.a.s.c.c.SolrZkClient makePath: /overseer/queue-work
   [junit4]   2> 137212 INFO  (jetty-launcher-233-thread-1) [n:127.0.0.1:61643_solr    ] o.a.s.c.OverseerAutoReplicaFailoverThread Starting OverseerAutoReplicaFailoverThread autoReplicaFailoverWorkLoopDelay=10000 autoReplicaFailoverWaitAfterExpiration=30000 autoReplicaFailoverBadNodeExpiration=60000
   [junit4]   2> 137212 INFO  (jetty-launcher-233-thread-1) [n:127.0.0.1:61643_solr    ] o.a.s.c.ZkController Publish node=127.0.0.1:61643_solr as DOWN
   [junit4]   2> 137214 INFO  (jetty-launcher-233-thread-1) [n:127.0.0.1:61643_solr    ] o.a.s.c.ZkController Register node as live in ZooKeeper:/live_nodes/127.0.0.1:61643_solr
   [junit4]   2> 137214 INFO  (jetty-launcher-233-thread-1) [n:127.0.0.1:61643_solr    ] o.a.s.c.c.SolrZkClient makePath: /live_nodes/127.0.0.1:61643_solr
   [junit4]   2> 137216 INFO  (zkCallback-244-thread-1-processing-n:127.0.0.1:61643_solr) [n:127.0.0.1:61643_solr    ] o.a.s.c.c.ZkStateReader A live node change: [WatchedEvent state:SyncConnected type:NodeChildrenChanged path:/live_nodes], has occurred - updating... (live nodes size: [1])
   [junit4]   2> 137216 INFO  (zkCallback-243-thread-1-processing-n:127.0.0.1:61644_solr) [n:127.0.0.1:61644_solr    ] o.a.s.c.c.ZkStateReader A live node change: [WatchedEvent state:SyncConnected type:NodeChildrenChanged path:/live_nodes], has occurred - updating... (live nodes size: [1])
   [junit4]   2> 137219 INFO  (zkCallback-244-thread-1-processing-n:127.0.0.1:61643_solr) [n:127.0.0.1:61643_solr    ] o.a.s.c.c.ZkStateReader Updated live nodes from ZooKeeper... (1) -> (2)
   [junit4]   2> 137219 INFO  (zkCallback-243-thread-1-processing-n:127.0.0.1:61644_solr) [n:127.0.0.1:61644_solr    ] o.a.s.c.c.ZkStateReader Updated live nodes from ZooKeeper... (1) -> (2)
   [junit4]   2> 137220 INFO  (jetty-launcher-233-thread-2) [n:127.0.0.1:61644_solr    ] o.a.s.c.CoreContainer Security conf doesn't exist. Skipping setup for authorization module.
   [junit4]   2> 137220 INFO  (jetty-launcher-233-thread-2) [n:127.0.0.1:61644_solr    ] o.a.s.c.CoreContainer No authentication plugin used.
   [junit4]   2> 137220 INFO  (OverseerStateUpdate-96622517018165254-127.0.0.1:61643_solr-n_0000000000) [n:127.0.0.1:61643_solr    ] o.a.s.c.Overseer Starting to work on the main queue
   [junit4]   2> 137221 INFO  (jetty-launcher-233-thread-2) [n:127.0.0.1:61644_solr    ] o.a.s.c.CorePropertiesLocator Looking for core definitions underneath C:\Users\jenkins\workspace\Lucene-Solr-6.x-Windows\solr\build\solr-core\test\J1\temp\solr.schema.TestManagedSchemaAPI_89CE62CE0521968B-001\tempDir-001\node2\.
   [junit4]   2> 137222 INFO  (OverseerStateUpdate-96622517018165254-127.0.0.1:61643_solr-n_0000000000) [n:127.0.0.1:61643_solr    ] o.a.s.c.c.ZkStateReader Updated live nodes from ZooKeeper... (2) -> (2)
   [junit4]   2> 137223 INFO  (jetty-launcher-233-thread-2) [n:127.0.0.1:61644_solr    ] o.a.s.c.CorePropertiesLocator Found 0 core definitions
   [junit4]   2> 137224 INFO  (jetty-launcher-233-thread-2) [n:127.0.0.1:61644_solr    ] o.a.s.s.SolrDispatchFilter user.dir=C:\Users\jenkins\workspace\Lucene-Solr-6.x-Windows\solr\build\solr-core\test\J1
   [junit4]   2> 137224 INFO  (jetty-launcher-233-thread-2) [n:127.0.0.1:61644_solr    ] o.a.s.s.SolrDispatchFilter SolrDispatchFilter.init() done
   [junit4]   2> 137224 INFO  (OverseerCollectionConfigSetProcessor-96622517018165254-127.0.0.1:61643_solr-n_0000000000) [n:127.0.0.1:61643_solr    ] o.a.s.c.OverseerTaskProcessor Process current queue of overseer operations
   [junit4]   2> 137225 INFO  (OverseerStateUpdate-96622517018165254-127.0.0.1:61643_solr-n_0000000000) [n:127.0.0.1:61643_solr    ] o.a.s.c.Overseer processMessage: queueSize: 1, message = {
   [junit4]   2>   "operation":"downnode",
   [junit4]   2>   "node_name":"127.0.0.1:61643_solr"} current state version: 0
   [junit4]   2> 137225 INFO  (OverseerStateUpdate-96622517018165254-127.0.0.1:61643_solr-n_0000000000) [n:127.0.0.1:61643_solr    ] o.a.s.c.o.NodeMutator DownNode state invoked for node: 127.0.0.1:61643_solr
   [junit4]   2> 137243 INFO  (jetty-launcher-233-thread-1) [n:127.0.0.1:61643_solr    ] o.a.s.c.CoreContainer Security conf doesn't exist. Skipping setup for authorization module.
   [junit4]   2> 137243 INFO  (jetty-launcher-233-thread-1) [n:127.0.0.1:61643_solr    ] o.a.s.c.CoreContainer No authentication plugin used.
   [junit4]   2> 137245 INFO  (jetty-launcher-233-thread-1) [n:127.0.0.1:61643_solr    ] o.a.s.c.CorePropertiesLocator Looking for core definitions underneath C:\Users\jenkins\workspace\Lucene-Solr-6.x-Windows\solr\build\solr-core\test\J1\temp\solr.schema.TestManagedSchemaAPI_89CE62CE0521968B-001\tempDir-001\node1\.
   [junit4]   2> 137246 INFO  (jetty-launcher-233-thread-1) [n:127.0.0.1:61643_solr    ] o.a.s.c.CorePropertiesLocator Found 0 core definitions
   [junit4]   2> 137247 INFO  (jetty-launcher-233-thread-1) [n:127.0.0.1:61643_solr    ] o.a.s.s.SolrDispatchFilter user.dir=C:\Users\jenkins\workspace\Lucene-Solr-6.x-Windows\solr\build\solr-core\test\J1
   [junit4]   2> 137247 INFO  (jetty-launcher-233-thread-1) [n:127.0.0.1:61643_solr    ] o.a.s.s.SolrDispatchFilter SolrDispatchFilter.init() done
   [junit4]   2> 137247 INFO  (SUITE-TestManagedSchemaAPI-seed#[89CE62CE0521968B]-worker) [    ] o.a.s.c.c.SolrZkClient Using default ZkCredentialsProvider
   [junit4]   2> 137248 INFO  (SUITE-TestManagedSchemaAPI-seed#[89CE62CE0521968B]-worker) [    ] o.a.s.c.c.ConnectionManager Waiting for client to connect to ZooKeeper
   [junit4]   2> 137250 INFO  (zkCallback-247-thread-1) [    ] o.a.s.c.c.ConnectionManager Watcher org.apache.solr.common.cloud.ConnectionManager@1355466 name:ZooKeeperConnection Watcher:127.0.0.1:61639 got event WatchedEvent state:SyncConnected type:None path:null path:null type:None
   [junit4]   2> 137251 INFO  (SUITE-TestManagedSchemaAPI-seed#[89CE62CE0521968B]-worker) [    ] o.a.s.c.c.ConnectionManager Client is connected to ZooKeeper
   [junit4]   2> 137251 INFO  (SUITE-TestManagedSchemaAPI-seed#[89CE62CE0521968B]-worker) [    ] o.a.s.c.c.SolrZkClient Using default ZkACLProvider
   [junit4]   2> 137254 WARN  (NIOServerCxn.Factory:0.0.0.0/0.0.0.0:0) [    ] o.a.z.s.NIOServerCnxn caught end of stream exception
   [junit4]   2> EndOfStreamException: Unable to read additional data from client sessionid 0x15745aad42c0007, likely client has closed socket
   [junit4]   2> 	at org.apache.zookeeper.server.NIOServerCnxn.doIO(NIOServerCnxn.java:228)
   [junit4]   2> 	at org.apache.zookeeper.server.NIOServerCnxnFactory.run(NIOServerCnxnFactory.java:208)
   [junit4]   2> 	at java.lang.Thread.run(Thread.java:745)
   [junit4]   2> 137254 INFO  (SUITE-TestManagedSchemaAPI-seed#[89CE62CE0521968B]-worker) [    ] o.a.s.c.c.SolrZkClient Using default ZkCredentialsProvider
   [junit4]   2> 137256 INFO  (SUITE-TestManagedSchemaAPI-seed#[89CE62CE0521968B]-worker) [    ] o.a.s.c.c.ConnectionManager Waiting for client to connect to ZooKeeper
   [junit4]   2> 137259 INFO  (zkCallback-250-thread-1) [    ] o.a.s.c.c.ConnectionManager Watcher org.apache.solr.common.cloud.ConnectionManager@c9cf4e name:ZooKeeperConnection Watcher:127.0.0.1:61639/solr got event WatchedEvent state:SyncConnected type:None path:null path:null type:None
   [junit4]   2> 137259 INFO  (SUITE-TestManagedSchemaAPI-seed#[89CE62CE0521968B]-worker) [    ] o.a.s.c.c.ConnectionManager Client is connected to ZooKeeper
   [junit4]   2> 137259 INFO  (SUITE-TestManagedSchemaAPI-seed#[89CE62CE0521968B]-worker) [    ] o.a.s.c.c.SolrZkClient Using default ZkACLProvider
   [junit4]   2> 137259 INFO  (SUITE-TestManagedSchemaAPI-seed#[89CE62CE0521968B]-worker) [    ] o.a.s.c.c.ZkStateReader Updating cluster state from ZooKeeper... 
   [junit4]   2> 137261 INFO  (SUITE-TestManagedSchemaAPI-seed#[89CE62CE0521968B]-worker) [    ] o.a.s.c.c.ZkStateReader Loaded cluster properties: {urlScheme=https}
   [junit4]   2> 137261 INFO  (SUITE-TestManagedSchemaAPI-seed#[89CE62CE0521968B]-worker) [    ] o.a.s.c.c.ZkStateReader Updated live nodes from ZooKeeper... (0) -> (2)
   [junit4]   2> 137282 INFO  (SUITE-TestManagedSchemaAPI-seed#[89CE62CE0521968B]-worker) [    ] o.a.s.c.c.SolrZkClient makePath: /configs/conf1/managed-schema
   [junit4]   2> 137287 INFO  (SUITE-TestManagedSchemaAPI-seed#[89CE62CE0521968B]-worker) [    ] o.a.s.c.c.SolrZkClient makePath: /configs/conf1/solrconfig.xml
   [junit4]   2> 137310 INFO  (TEST-TestManagedSchemaAPI.test-seed#[89CE62CE0521968B]) [    ] o.a.s.SolrTestCaseJ4 ###Starting test
   [junit4]   2> 137464 INFO  (qtp18703873-1049) [n:127.0.0.1:61644_solr    ] o.a.s.h.a.CollectionsHandler Invoked Collection Action :create with params replicationFactor=2&collection.configName=conf1&name=testschemaapi&action=CREATE&numShards=1&wt=javabin&version=2 and sendToOCPQueue=true
   [junit4]   2> 137471 INFO  (OverseerCollectionConfigSetProcessor-96622517018165254-127.0.0.1:61643_solr-n_0000000000) [n:127.0.0.1:61643_solr    ] o.a.s.c.OverseerTaskProcessor Overseer Collection Message Handler: Get the message id:/overseer/collection-queue-work/qn-0000000000 message:{
   [junit4]   2>   "name":"testschemaapi",
   [junit4]   2>   "fromApi":"true",
   [junit4]   2>   "replicationFactor":"2",
   [junit4]   2>   "collection.configName":"conf1",
   [junit4]   2>   "numShards":"1",
   [junit4]   2>   "stateFormat":"2",
   [junit4]   2>   "operation":"create"}
   [junit4]   2> 137471 INFO  (OverseerThreadFactory-368-thread-1-processing-n:127.0.0.1:61643_solr) [n:127.0.0.1:61643_solr    ] o.a.s.c.OverseerCollectionMessageHandler OverseerCollectionMessageHandler.processMessage : create , {
   [junit4]   2>   "name":"testschemaapi",
   [junit4]   2>   "fromApi":"true",
   [junit4]   2>   "replicationFactor":"2",
   [junit4]   2>   "collection.configName":"conf1",
   [junit4]   2>   "numShards":"1",
   [junit4]   2>   "stateFormat":"2",
   [junit4]   2>   "operation":"create"}
   [junit4]   2> 137471 INFO  (OverseerThreadFactory-368-thread-1-processing-n:127.0.0.1:61643_solr) [n:127.0.0.1:61643_solr    ] o.a.s.c.CreateCollectionCmd Create collection testschemaapi
   [junit4]   2> 137473 INFO  (OverseerThreadFactory-368-thread-1-processing-n:127.0.0.1:61643_solr) [n:127.0.0.1:61643_solr    ] o.a.s.c.OverseerCollectionMessageHandler creating collections conf node /collections/testschemaapi 
   [junit4]   2> 137474 INFO  (OverseerThreadFactory-368-thread-1-processing-n:127.0.0.1:61643_solr) [n:127.0.0.1:61643_solr    ] o.a.s.c.c.SolrZkClient makePath: /collections/testschemaapi
   [junit4]   2> 137476 INFO  (zkCallback-243-thread-1-processing-n:127.0.0.1:61644_solr) [n:127.0.0.1:61644_solr    ] o.a.s.c.c.ZkStateReader A collections change: [WatchedEvent state:SyncConnected type:NodeChildrenChanged path:/collections], has occurred - updating...
   [junit4]   2> 137476 INFO  (zkCallback-244-thread-1-processing-n:127.0.0.1:61643_solr) [n:127.0.0.1:61643_solr    ] o.a.s.c.c.ZkStateReader A collections change: [WatchedEvent state:SyncConnected type:NodeChildrenChanged path:/collections], has occurred - updating...
   [junit4]   2> 137476 INFO  (zkCallback-250-thread-1) [    ] o.a.s.c.c.ZkStateReader A collections change: [WatchedEvent state:SyncConnected type:NodeChildrenChanged path:/collections], has occurred - updating...
   [junit4]   2> 137481 INFO  (OverseerStateUpdate-96622517018165254-127.0.0.1:61643_solr-n_0000000000) [n:127.0.0.1:61643_solr    ] o.a.s.c.Overseer processMessage: queueSize: 1, message = {
   [junit4]   2>   "name":"testschemaapi",
   [junit4]   2>   "fromApi":"true",
   [junit4]   2>   "replicationFactor":"2",
   [junit4]   2>   "collection.configName":"conf1",
   [junit4]   2>   "numShards":"1",
   [junit4]   2>   "stateFormat":"2",
   [junit4]   2>   "operation":"create"} current state version: 0
   [junit4]   2> 137481 INFO  (OverseerStateUpdate-96622517018165254-127.0.0.1:61643_solr-n_0000000000) [n:127.0.0.1:61643_solr    ] o.a.s.c.o.ClusterStateMutator building a new cName: testschemaapi
   [junit4]   2> 137482 INFO  (OverseerStateUpdate-96622517018165254-127.0.0.1:61643_solr-n_0000000000) [n:127.0.0.1:61643_solr    ] o.a.s.c.o.ZkStateWriter going to create_collection /collections/testschemaapi/state.json
   [junit4]   2> 137581 INFO  (OverseerThreadFactory-368-thread-1-processing-n:127.0.0.1:61643_solr) [n:127.0.0.1:61643_solr    ] o.a.s.c.CreateCollectionCmd Creating SolrCores for new collection testschemaapi, shardNames [shard1] , replicationFactor : 2
   [junit4]   2> 137581 INFO  (OverseerThreadFactory-368-thread-1-processing-n:127.0.0.1:61643_solr) [n:127.0.0.1:61643_solr    ] o.a.s.c.CreateCollectionCmd Creating core testschemaapi_shard1_replica1 as part of shard shard1 of collection testschemaapi on 127.0.0.1:61644_solr
   [junit4]   2> 137582 INFO  (OverseerThreadFactory-368-thread-1-processing-n:127.0.0.1:61643_solr) [n:127.0.0.1:61643_solr    ] o.a.s.c.CreateCollectionCmd Creating core testschemaapi_shard1_replica2 as part of shard shard1 of collection testschemaapi on 127.0.0.1:61643_solr
   [junit4]   2> 137602 INFO  (qtp18703873-1048) [n:127.0.0.1:61644_solr    ] o.a.s.h.a.CoreAdminOperation core create command qt=/admin/cores&collection.configName=conf1&name=testschemaapi_shard1_replica1&action=CREATE&numShards=1&collection=testschemaapi&shard=shard1&wt=javabin&version=2
   [junit4]   2> 137604 INFO  (qtp18703873-1048) [n:127.0.0.1:61644_solr    ] o.a.s.c.CoreDescriptor Created CoreDescriptor: {name=testschemaapi_shard1_replica1, collection.configName=conf1, config=solrconfig.xml, transient=false, schema=schema.xml, loadOnStartup=true, configSetProperties=configsetprops.json, collection=testschemaapi, numShards=1, dataDir=data\, shard=shard1}
   [junit4]   2> 137606 INFO  (qtp18703873-1048) [n:127.0.0.1:61644_solr c:testschemaapi s:shard1  x:testschemaapi_shard1_replica1] o.a.s.c.ZkController publishing state=down
   [junit4]   2> 137609 INFO  (qtp18703873-1048) [n:127.0.0.1:61644_solr c:testschemaapi s:shard1  x:testschemaapi_shard1_replica1] o.a.s.c.ZkController Registering watch for collection testschemaapi
   [junit4]   2> 137610 INFO  (qtp18703873-1048) [n:127.0.0.1:61644_solr c:testschemaapi s:shard1  x:testschemaapi_shard1_replica1] o.a.s.c.c.ZkStateReader Add data for [testschemaapi] ver [0]
   [junit4]   2> 137610 INFO  (qtp18703873-1048) [n:127.0.0.1:61644_solr c:testschemaapi s:shard1  x:testschemaapi_shard1_replica1] o.a.s.c.ZkController look for our core node name
   [junit4]   2> 137610 INFO  (OverseerStateUpdate-96622517018165254-127.0.0.1:61643_solr-n_0000000000) [n:127.0.0.1:61643_solr    ] o.a.s.c.Overseer processMessage: queueSize: 1, message = {
   [junit4]   2>   "core":"testschemaapi_shard1_replica1",
   [junit4]   2>   "roles":null,
   [junit4]   2>   "base_url":"https://127.0.0.1:61644/solr",
   [junit4]   2>   "node_name":"127.0.0.1:61644_solr",
   [junit4]   2>   "numShards":"1",
   [junit4]   2>   "state":"down",
   [junit4]   2>   "shard":"shard1",
   [junit4]   2>   "collection":"testschemaapi",
   [junit4]   2>   "operation":"state"} current state version: 0
   [junit4]   2> 137610 INFO  (OverseerStateUpdate-96622517018165254-127.0.0.1:61643_solr-n_0000000000) [n:127.0.0.1:61643_solr    ] o.a.s.c.o.ReplicaMutator Update state numShards=1 message={
   [junit4]   2>   "core":"testschemaapi_shard1_replica1",
   [junit4]   2>   "roles":null,
   [junit4]   2>   "base_url":"https://127.0.0.1:61644/solr",
   [junit4]   2>   "node_name":"127.0.0.1:61644_solr",
   [junit4]   2>   "numShards":"1",
   [junit4]   2>   "state":"down",
   [junit4]   2>   "shard":"shard1",
   [junit4]   2>   "collection":"testschemaapi",
   [junit4]   2>   "operation":"state"}
   [junit4]   2> 137666 INFO  (qtp21922284-1041) [n:127.0.0.1:61643_solr    ] o.a.s.h.a.CoreAdminOperation core create command qt=/admin/cores&collection.configName=conf1&name=testschemaapi_shard1_replica2&action=CREATE&numShards=1&collection=testschemaapi&shard=shard1&wt=javabin&version=2
   [junit4]   2> 137666 INFO  (qtp21922284-1041) [n:127.0.0.1:61643_solr    ] o.a.s.c.CoreDescriptor Created CoreDescriptor: {name=testschemaapi_shard1_replica2, collection.configName=conf1, config=solrconfig.xml, transient=false, schema=schema.xml, loadOnStartup=true, configSetProperties=configsetprops.json, collection=testschemaapi, numShards=1, dataDir=data\, shard=shard1}
   [junit4]   2> 137667 INFO  (qtp21922284-1041) [n:127.0.0.1:61643_solr c:testschemaapi s:shard1  x:testschemaapi_shard1_replica2] o.a.s.c.ZkController publishing state=down
   [junit4]   2> 137670 INFO  (qtp21922284-1041) [n:127.0.0.1:61643_solr c:testschemaapi s:shard1  x:testschemaapi_shard1_replica2] o.a.s.c.ZkController Registering watch for collection testschemaapi
   [junit4]   2> 137670 INFO  (OverseerStateUpdate-96622517018165254-127.0.0.1:61643_solr-n_0000000000) [n:127.0.0.1:61643_solr    ] o.a.s.c.Overseer processMessage: queueSize: 1, message = {
   [junit4]   2>   "core":"testschemaapi_shard1_replica2",
   [junit4]   2>   "roles":null,
   [junit4]   2>   "base_url":"https://127.0.0.1:61643/solr",
   [junit4]   2>   "node_name":"127.0.0.1:61643_solr",
   [junit4]   2>   "numShards":"1",
   [junit4]   2>   "state":"down",
   [junit4]   2>   "shard":"shard1",
   [junit4]   2>   "collection":"testschemaapi",
   [junit4]   2>   "operation":"state"} current state version: 0
   [junit4]   2> 137670 INFO  (OverseerStateUpdate-96622517018165254-127.0.0.1:61643_solr-n_0000000000) [n:127.0.0.1:61643_solr    ] o.a.s.c.o.ReplicaMutator Update state numShards=1 message={
   [junit4]   2>   "core":"testschemaapi_shard1_replica2",
   [junit4]   2>   "roles":null,
   [junit4]   2>   "base_url":"https://127.0.0.1:61643/solr",
   [junit4]   2>   "node_name":"127.0.0.1:61643_solr",
   [junit4]   2>   "numShards":"1",
   [junit4]   2>   "state":"down",
   [junit4]   2>   "shard":"shard1",
   [junit4]   2>   "collection":"testschemaapi",
   [junit4]   2>   "operation":"state"}
   [junit4]   2> 137671 INFO  (qtp21922284-1041) [n:127.0.0.1:61643_solr c:testschemaapi s:shard1  x:testschemaapi_shard1_replica2] o.a.s.c.c.ZkStateReader Add data for [testschemaapi] ver [0]
   [junit4]   2> 137671 INFO  (qtp21922284-1041) [n:127.0.0.1:61643_solr c:testschemaapi s:shard1  x:testschemaapi_shard1_replica2] o.a.s.c.ZkController look for our core node name
   [junit4]   2> 137859 INFO  (OverseerStateUpdate-96622517018165254-127.0.0.1:61643_solr-n_0000000000) [n:127.0.0.1:61643_solr    ] o.a.s.c.o.ZkStateWriter going to update_collection /collections/testschemaapi/state.json version: 0
   [junit4]   2> 137860 INFO  (zkCallback-243-thread-1-processing-n:127.0.0.1:61644_solr) [n:127.0.0.1:61644_solr    ] o.a.s.c.c.ZkStateReader A cluster state change: [WatchedEvent state:SyncConnected type:NodeDataChanged path:/collections/testschemaapi/state.json] for collection [testschemaapi] has occurred - updating... (live nodes size: [2])
   [junit4]   2> 137860 INFO  (zkCallback-244-thread-1-processing-n:127.0.0.1:61643_solr) [n:127.0.0.1:61643_solr    ] o.a.s.c.c.ZkStateReader A cluster state change: [WatchedEvent state:SyncConnected type:NodeDataChanged path:/collections/testschemaapi/state.json] for collection [testschemaapi] has occurred - updating... (live nodes size: [2])
   [junit4]   2> 137861 INFO  (zkCallback-243-thread-1-processing-n:127.0.0.1:61644_solr) [n:127.0.0.1:61644_solr    ] o.a.s.c.c.ZkStateReader Updating data for [testschemaapi] from [0] to [1]
   [junit4]   2> 137861 INFO  (zkCallback-244-thread-1-processing-n:127.0.0.1:61643_solr) [n:127.0.0.1:61643_solr    ] o.a.s.c.c.ZkStateReader Updating data for [testschemaapi] from [0] to [1]
   [junit4]   2> 138611 INFO  (qtp18703873-1048) [n:127.0.0.1:61644_solr c:testschemaapi s:shard1  x:testschemaapi_shard1_replica1] o.a.s.c.ZkController waiting to find shard id in clusterstate for testschemaapi_shard1_replica1
   [junit4]   2> 138611 INFO  (qtp18703873-1048) [n:127.0.0.1:61644_solr c:testschemaapi s:shard1  x:testschemaapi_shard1_replica1] o.a.s.c.ZkController Check for collection zkNode:testschemaapi
   [junit4]   2> 138619 INFO  (qtp18703873-1048) [n:127.0.0.1:61644_solr c:testschemaapi s:shard1  x:testschemaapi_shard1_replica1] o.a.s.c.ZkController Collection zkNode exists
   [junit4]   2> 138622 INFO  (qtp18703873-1048) [n:127.0.0.1:61644_solr c:testschemaapi s:shard1  x:testschemaapi_shard1_replica1] o.a.s.c.SolrResourceLoader new SolrResourceLoader for directory: 'C:\Users\jenkins\workspace\Lucene-Solr-6.x-Windows\solr\build\solr-core\test\J1\temp\solr.schema.TestManagedSchemaAPI_89CE62CE0521968B-001\tempDir-001\node2\testschemaapi_shard1_replica1'
   [junit4]   2> 138622 INFO  (qtp18703873-1048) [n:127.0.0.1:61644_solr c:testschemaapi s:shard1  x:testschemaapi_shard1_replica1] o.a.s.c.SolrResourceLoader JNDI not configured for solr (NoInitialContextEx)
   [junit4]   2> 138622 INFO  (qtp18703873-1048) [n:127.0.0.1:61644_solr c:testschemaapi s:shard1  x:testschemaapi_shard1_replica1] o.a.s.c.SolrResourceLoader solr home defaulted to 'solr/' (could not find system property or JNDI)
   [junit4]   2> 138627 INFO  (qtp18703873-1048) [n:127.0.0.1:61644_solr c:testschemaapi s:shard1  x:testschemaapi_shard1_replica1] o.a.s.c.Config loaded config solrconfig.xml with version 0 
   [junit4]   2> 138641 INFO  (qtp18703873-1048) [n:127.0.0.1:61644_solr c:testschemaapi s:shard1  x:testschemaapi_shard1_replica1] o.a.s.c.SolrConfig current version of requestparams : -1
   [junit4]   2> 138643 INFO  (qtp18703873-1048) [n:127.0.0.1:61644_solr c:testschemaapi s:shard1  x:testschemaapi_shard1_replica1] o.a.s.c.SolrConfig Using Lucene MatchVersion: 6.3.0
   [junit4]   2> 138648 INFO  (qtp18703873-1048) [n:127.0.0.1:61644_solr c:testschemaapi s:shard1  x:testschemaapi_shard1_replica1] o.a.s.c.SolrConfig Loaded SolrConfig: solrconfig.xml
   [junit4]   2> 138655 INFO  (qtp18703873-1048) [n:127.0.0.1:61644_solr c:testschemaapi s:shard1  x:testschemaapi_shard1_replica1] o.a.s.s.IndexSchema [testschemaapi_shard1_replica1] Schema name=minimal
   [junit4]   2> 138662 INFO  (qtp18703873-1048) [n:127.0.0.1:61644_solr c:testschemaapi s:shard1  x:testschemaapi_shard1_replica1] o.a.s.s.IndexSchema unique key field: id
   [junit4]   2> 138669 INFO  (qtp18703873-1048) [n:127.0.0.1:61644_solr c:testschemaapi s:shard1  x:testschemaapi_shard1_replica1] o.a.s.c.ConfigSetProperties Did not find ConfigSet properties, assuming default properties: Can't find resource 'configsetprops.json' in classpath or '/configs/conf1', cwd=C:\Users\jenkins\workspace\Lucene-Solr-6.x-Windows\solr\build\solr-core\test\J1
   [junit4]   2> 138669 INFO  (qtp18703873-1048) [n:127.0.0.1:61644_solr c:testschemaapi s:shard1  x:testschemaapi_shard1_replica1] o.a.s.c.CoreContainer Creating SolrCore 'testschemaapi_shard1_replica1' using configuration from collection testschemaapi
   [junit4]   2> 138670 INFO  (qtp18703873-1048) [n:127.0.0.1:61644_solr c:testschemaapi s:shard1 r:core_node1 x:testschemaapi_shard1_replica1] o.a.s.c.SolrCore org.apache.solr.core.MockDirectoryFactory
   [junit4]   2> 138671 INFO  (qtp18703873-1048) [n:127.0.0.1:61644_solr c:testschemaapi s:shard1 r:core_node1 x:testschemaapi_shard1_replica1] o.a.s.c.SolrCore [[testschemaapi_shard1_replica1] ] Opening new SolrCore at [C:\Users\jenkins\workspace\Lucene-Solr-6.x-Windows\solr\build\solr-core\test\J1\temp\solr.schema.TestManagedSchemaAPI_89CE62CE0521968B-001\tempDir-001\node2\testschemaapi_shard1_replica1], dataDir=[C:\Users\jenkins\workspace\Lucene-Solr-6.x-Windows\solr\build\solr-core\test\J1\temp\solr.schema.TestManagedSchemaAPI_89CE62CE0521968B-001\tempDir-001\node2\.\testschemaapi_shard1_replica1\data\]
   [junit4]   2> 138671 INFO  (qtp21922284-1041) [n:127.0.0.1:61643_solr c:testschemaapi s:shard1  x:testschemaapi_shard1_replica2] o.a.s.c.ZkController waiting to find shard id in clusterstate for testschemaapi_shard1_replica2
   [junit4]   2> 138671 INFO  (qtp21922284-1041) [n:127.0.0.1:61643_solr c:testschemaapi s:shard1  x:testschemaapi_shard1_replica2] o.a.s.c.ZkController Check for collection zkNode:testschemaapi
   [junit4]   2> 138671 INFO  (qtp18703873-1048) [n:127.0.0.1:61644_solr c:testschemaapi s:shard1 r:core_node1 x:testschemaapi_shard1_replica1] o.a.s.c.SolrCore JMX monitoring not detected for core: testschemaapi_shard1_replica1
   [junit4]   2> 138672 INFO  (qtp21922284-1041) [n:127.0.0.1:61643_solr c:testschemaapi s:shard1  x:testschemaapi_shard1_replica2] o.a.s.c.ZkController Collection zkNode exists
   [junit4]   2> 138672 INFO  (qtp18703873-1048) [n:127.0.0.1:61644_solr c:testschemaapi s:shard1 r:core_node1 x:testschemaapi_shard1_replica1] o.a.s.c.CachingDirectoryFactory return new directory for C:\Users\jenkins\workspace\Lucene-Solr-6.x-Windows\solr\build\solr-core\test\J1\temp\solr.schema.TestManagedSchemaAPI_89CE62CE0521968B-001\tempDir-001\node2\.\testschemaapi_shard1_replica1\data\snapshot_metadata
   [junit4]   2> 138672 INFO  (qtp18703873-1048) [n:127.0.0.1:61644_solr c:testschemaapi s:shard1 r:core_node1 x:testschemaapi_shard1_replica1] o.a.s.c.s.SolrSnapshotMetaDataManager Loading from snapshot metadata file...
   [junit4]   2> 138673 INFO  (qtp18703873-1048) [n:127.0.0.1:61644_solr c:testschemaapi s:shard1 r:core_node1 x:testschemaapi_shard1_replica1] o.a.s.c.CachingDirectoryFactory return new directory for C:\Users\jenkins\workspace\Lucene-Solr-6.x-Windows\solr\build\solr-core\test\J1\temp\solr.schema.TestManagedSchemaAPI_89CE62CE0521968B-001\tempDir-001\node2\.\testschemaapi_shard1_replica1\data\
   [junit4]   2> 138673 INFO  (qtp18703873-1048) [n:127.0.0.1:61644_solr c:testschemaapi s:shard1 r:core_node1 x:testschemaapi_shard1_replica1] o.a.s.c.SolrCore New index directory detected: old=null new=C:\Users\jenkins\workspace\Lucene-Solr-6.x-Windows\solr\build\solr-core\test\J1\temp\solr.schema.TestManagedSchemaAPI_89CE62CE0521968B-001\tempDir-001\node2\.\testschemaapi_shard1_replica1\data\index/
   [junit4]   2> 138673 WARN  (qtp18703873-1048) [n:127.0.0.1:61644_solr c:testschemaapi s:shard1 r:core_node1 x:testschemaapi_shard1_replica1] o.a.s.c.SolrCore [testschemaapi_shard1_replica1] Solr index directory 'C:\Users\jenkins\workspace\Lucene-Solr-6.x-Windows\solr\build\solr-core\test\J1\temp\solr.schema.TestManagedSchemaAPI_89CE62CE0521968B-001\tempDir-001\node2\.\testschemaapi_shard1_replica1\data\index' doesn't exist. Creating new index...
   [junit4]   2> 138676 INFO  (qtp18703873-1048) [n:127.0.0.1:61644_solr c:testschemaapi s:shard1 r:core_node1 x:testschemaapi_shard1_replica1] o.a.s.c.CachingDirectoryFactory return new directory for C:\Users\jenkins\workspace\Lucene-Solr-6.x-Windows\solr\build\solr-core\test\J1\temp\solr.schema.TestManagedSchemaAPI_89CE62CE0521968B-001\tempDir-001\node2\.\testschemaapi_shard1_replica1\data\index
   [junit4]   2> 138676 INFO  (qtp21922284-1041) [n:127.0.0.1:61643_solr c:testschemaapi s:shard1  x:testschemaapi_shard1_replica2] o.a.s.c.SolrResourceLoader new SolrResourceLoader for directory: 'C:\Users\jenkins\workspace\Lucene-Solr-6.x-Windows\solr\build\solr-core\test\J1\temp\solr.schema.TestManagedSchemaAPI_89CE62CE0521968B-001\tempDir-001\node1\testschemaapi_shard1_replica2'
   [junit4]   2> 138676 INFO  (qtp21922284-1041) [n:127.0.0.1:61643_solr c:testschemaapi s:shard1  x:testschemaapi_shard1_replica2] o.a.s.c.SolrResourceLoader JNDI not configured for solr (NoInitialContextEx)
   [junit4]   2> 138676 INFO  (qtp21922284-1041) [n:127.0.0.1:61643_solr c:testschemaapi s:shard1  x:testschemaapi_shard1_replica2] o.a.s.c.SolrResourceLoader solr home defaulted to 'solr/' (could not find system property or JNDI)
   [junit4]   2> 138687 INFO  (qtp21922284-1041) [n:127.0.0.1:61643_solr c:testschemaapi s:shard1  x:testschemaapi_shard1_replica2] o.a.s.c.Config loaded config solrconfig.xml with version 0 
   [junit4]   2> 138695 INFO  (qtp21922284-1041) [n:127.0.0.1:61643_solr c:testschemaapi s:shard1  x:testschemaapi_shard1_replica2] o.a.s.c.SolrConfig current version of requestparams : -1
   [junit4]   2> 138697 INFO  (qtp21922284-1041) [n:127.0.0.1:61643_solr c:testschemaapi s:shard1  x:testschemaapi_shard1_replica2] o.a.s.c.SolrConfig Using Lucene MatchVersion: 6.3.0
   [junit4]   2> 138702 INFO  (qtp21922284-1041) [n:127.0.0.1:61643_solr c:testschemaapi s:shard1  x:testschemaapi_shard1_replica2] o.a.s.c.SolrConfig Loaded SolrConfig: solrconfig.xml
   [junit4]   2> 138710 INFO  (qtp21922284-1041) [n:127.0.0.1:61643_solr c:testschemaapi s:shard1  x:testschemaapi_shard1_replica2] o.a.s.s.IndexSchema [testschemaapi_shard1_replica2] Schema name=minimal
   [junit4]   2> 138712 INFO  (qtp21922284-1041) [n:127.0.0.1:61643_solr c:testschemaapi s:shard1  x:testschemaapi_shard1_replica2] o.a.s.s.IndexSchema unique key field: id
   [junit4]   2> 138715 INFO  (qtp21922284-1041) [n:127.0.0.1:61643_solr c:testschemaapi s:shard1  x:testschemaapi_shard1_replica2] o.a.s.c.ConfigSetProperties Did not find ConfigSet properties, assuming default properties: Can't find resource 'configsetprops.json' in classpath or '/configs/conf1', cwd=C:\Users\jenkins\workspace\Lucene-Solr-6.x-Windows\solr\build\solr-core\test\J1
   [junit4]   2> 138715 INFO  (qtp21922284-1041) [n:127.0.0.1:61643_solr c:testschemaapi s:shard1  x:testschemaapi_shard1_replica2] o.a.s.c.CoreContainer Creating SolrCore 'testschemaapi_shard1_replica2' using configuration from collection testschemaapi
   [junit4]   2> 138716 INFO  (qtp21922284-1041) [n:127.0.0.1:61643_solr c:testschemaapi s:shard1 r:core_node2 x:testschemaapi_shard1_replica2] o.a.s.c.SolrCore org.apache.solr.core.MockDirectoryFactory
   [junit4]   2> 138720 INFO  (qtp21922284-1041) [n:127.0.0.1:61643_solr c:testschemaapi s:shard1 r:core_node2 x:testschemaapi_shard1_replica2] o.a.s.c.SolrCore [[testschemaapi_shard1_replica2] ] Opening new SolrCore at [C:\Users\jenkins\workspace\Lucene-Solr-6.x-Windows\solr\build\solr-core\test\J1\temp\solr.schema.TestManagedSchemaAPI_89CE62CE0521968B-001\tempDir-001\node1\testschemaapi_shard1_replica2], dataDir=[C:\Users\jenkins\workspace\Lucene-Solr-6.x-Windows\solr\build\solr-core\test\J1\temp\solr.schema.TestManagedSchemaAPI_89CE62CE0521968B-001\tempDir-001\node1\.\testschemaapi_shard1_replica2\data\]
   [junit4]   2> 138721 INFO  (qtp21922284-1041) [n:127.0.0.1:61643_solr c:testschemaapi s:shard1 r:core_node2 x:testschemaapi_shard1_replica2] o.a.s.c.SolrCore JMX monitoring not detected for core: testschemaapi_shard1_replica2
   [junit4]   2> 138722 INFO  (qtp21922284-1041) [n:127.0.0.1:61643_solr c:testschemaapi s:shard1 r:core_node2 x:testschemaapi_shard1_replica2] o.a.s.c.CachingDirectoryFactory return new directory for C:\Users\jenkins\workspace\Lucene-Solr-6.x-Windows\solr\build\solr-core\test\J1\temp\solr.schema.TestManagedSchemaAPI_89CE62CE0521968B-001\tempDir-001\node1\.\testschemaapi_shard1_replica2\data\snapshot_metadata
   [junit4]   2> 138722 INFO  (qtp21922284-1041) [n:127.0.0.1:61643_solr c:testschemaapi s:shard1 r:core_node2 x:testschemaapi_shard1_replica2] o.a.s.c.s.SolrSnapshotMetaDataManager Loading from snapshot metadata file...
   [junit4]   2> 138722 INFO  (qtp21922284-1041) [n:127.0.0.1:61643_solr c:testschemaapi s:shard1 r:core_node2 x:testschemaapi_shard1_replica2] o.a.s.c.CachingDirectoryFactory return new directory for C:\Users\jenkins\workspace\Lucene-Solr-6.x-Windows\solr\build\solr-core\test\J1\temp\solr.schema.TestManagedSchemaAPI_89CE62CE0521968B-001\tempDir-001\node1\.\testschemaapi_shard1_replica2\data\
   [junit4]   2> 138722 INFO  (qtp21922284-1041) [n:127.0.0.1:61643_solr c:testschemaapi s:shard1 r:core_node2 x:testschemaapi_shard1_replica2] o.a.s.c.SolrCore New index directory detected: old=null new=C:\Users\jenkins\workspace\Lucene-Solr-6.x-Windows\solr\build\solr-core\test\J1\temp\solr.schema.TestManagedSchemaAPI_89CE62CE0521968B-001\tempDir-001\node1\.\testschemaapi_shard1_replica2\data\index/
   [junit4]   2> 138722 WARN  (qtp21922284-1041) [n:127.0.0.1:61643_solr c:testschemaapi s:shard1 r:core_node2 x:testschemaapi_shard1_replica2] o.a.s.c.SolrCore [testschemaapi_shard1_replica2] Solr index directory 'C:\Users\jenkins\workspace\Lucene-Solr-6.x-Windows\solr\build\solr-core\test\J1\temp\solr.schema.TestManagedSchemaAPI_89CE62CE0521968B-001\tempDir-001\node1\.\testschemaapi_shard1_replica2\data\index' doesn't exist. Creating new index...
   [junit4]   2> 138723 INFO  (qtp21922284-1041) [n:127.0.0.1:61643_solr c:testschemaapi s:shard1 r:core_node2 x:testschemaapi_shard1_replica2] o.a.s.c.CachingDirectoryFactory return new directory for C:\Users\jenkins\workspace\Lucene-Solr-6.x-Windows\solr\build\solr-core\test\J1\temp\solr.schema.TestManagedSchemaAPI_89CE62CE0521968B-001\tempDir-001\node1\.\testschemaapi_shard1_replica2\data\index
   [junit4]   2> 138726 INFO  (qtp18703873-1048) [n:127.0.0.1:61644_solr c:testschemaapi s:shard1 r:core_node1 x:testschemaapi_shard1_replica1] o.a.s.c.SolrDeletionPolicy SolrDeletionPolicy.onCommit: commits: num=1
   [junit4]   2> 	commit{dir=MockDirectoryWrapper(RAMDirectory@18403e0 lockFactory=org.apache.lucene.store.SingleInstanceLockFactory@12bf3aa),segFN=segments_1,generation=1}
   [junit4]   2> 138726 INFO  (qtp18703873-1048) [n:127.0.0.1:61644_solr c:testschemaapi s:shard1 r:core_node1 x:testschemaapi_shard1_replica1] o.a.s.c.SolrDeletionPolicy newest commit generation = 1
   [junit4]   2> 138726 INFO  (qtp21922284-1041) [n:127.0.0.1:61643_solr c:testschemaapi s:shard1 r:core_node2 x:testschemaapi_shard1_replica2] o.a.s.c.SolrDeletionPolicy SolrDeletionPolicy.onCommit: commits: num=1
   [junit4]   2> 	commit{dir=MockDirectoryWrapper(RAMDirectory@1bd8892 lockFactory=org.apache.lucene.store.SingleInstanceLockFactory@efbe9f),segFN=segments_1,generation=1}
   [junit4]   2> 138726 INFO  (qtp21922284-1041) [n:127.0.0.1:61643_solr c:testschemaapi s:shard1 r:core_node2 x:testschemaapi_shard1_replica2] o.a.s.c.SolrDeletionPolicy newest commit generation = 1
   [junit4]   2> 138728 INFO  (qtp18703873-1048) [n:127.0.0.1:61644_solr c:testschemaapi s:shard1 r:core_node1 x:testschemaapi_shard1_replica1] o.a.s.c.SolrCore no updateRequestProcessorChain defined as default, creating implicit default
   [junit4]   2> 138731 INFO  (qtp21922284-1041) [n:127.0.0.1:61643_solr c:testschemaapi s:shard1 r:core_node2 x:testschemaapi_shard1_replica2] o.a.s.c.SolrCore no updateRequestProcessorChain defined as default, creating implicit default
   [junit4]   2> 138738 INFO  (OldIndexDirectoryCleanupThreadForCore-testschemaapi_shard1_replica2) [n:127.0.0.1:61643_solr c:testschemaapi s:shard1 r:core_node2 x:testschemaapi_shard1_replica2] o.a.s.c.SolrCore Looking for old index directories to cleanup for core testschemaapi_shard1_replica2 in C:\Users\jenkins\workspace\Lucene-Solr-6.x-Windows\solr\build\solr-core\test\J1\temp\solr.schema.TestManagedSchemaAPI_89CE62CE0521968B-001\tempDir-001\node1\.\testschemaapi_shard1_replica2\data\
   [junit4]   2> 138739 INFO  (qtp18703873-1048) [n:127.0.0.1:61644_solr c:testschemaapi s:shard1 r:core_node1 x:testschemaapi_shard1_replica1] o.a.s.h.l.XMLLoader xsltCacheLifetimeSeconds=60
   [junit4]   2> 138739 WARN  (OldIndexDirectoryCleanupThreadForCore-testschemaapi_shard1_replica2) [n:127.0.0.1:61643_solr c:testschemaapi s:shard1 r:core_node2 x:testschemaapi_shard1_replica2] o.a.s.c.DirectoryFactory C:\Users\jenkins\workspace\Lucene-Solr-6.x-Windows\solr\build\solr-core\test\J1\temp\solr.schema.TestManagedSchemaAPI_89CE62CE0521968B-001\tempDir-001\node1\.\testschemaapi_shard1_replica2\data\ does not point to a valid data directory; skipping clean-up of old index directories.
   [junit4]   2> 138740 INFO  (qtp21922284-1041) [n:127.0.0.1:61643_solr c:testschemaapi s:shard1 r:core_node2 x:testschemaapi_shard1_replica2] o.a.s.h.l.XMLLoader xsltCacheLifetimeSeconds=60
   [junit4]   2> 138741 INFO  (qtp18703873-1048) [n:127.0.0.1:61644_solr c:testschemaapi s:shard1 r:core_node1 x:testschemaapi_shard1_replica1] o.a.s.h.l.XMLLoader xsltCacheLifetimeSeconds=60
   [junit4]   2> 138742 INFO  (qtp21922284-1041) [n:127.0.0.1:61643_solr c:testschemaapi s:shard1 r:core_node2 x:testschemaapi_shard1_replica2] o.a.s.h.l.XMLLoader xsltCacheLifetimeSeconds=60
   [junit4]   2> 138744 INFO  (qtp21922284-1041) [n:127.0.0.1:61643_solr c:testschemaapi s:shard1 r:core_node2 x:testschemaapi_shard1_replica2] o.a.s.h.l.XMLLoader xsltCacheLifetimeSeconds=60
   [junit4]   2> 138746 INFO  (qtp21922284-1041) [n:127.0.0.1:61643_solr c:testschemaapi s:shard1 r:core_node2 x:testschemaapi_shard1_replica2] o.a.s.h.l.XMLLoader xsltCacheLifetimeSeconds=60
   [junit4]   2> 138748 INFO  (qtp21922284-1041) [n:127.0.0.1:61643_solr c:testschemaapi s:shard1 r:core_node2 x:testschemaapi_shard1_replica2] o.a.s.c.RequestHandlers Registered paths: /admin/mbeans,/update/json/docs,/admin/luke,/export,/get,/admin/properties,/update/json,/admin/threads,/update/csv,/sql,/graph,/select,/admin/segments,/admin/system,/replication,/config,/stream,/schema,/admin/plugins,/admin/logging,/admin/ping,/update,/admin/file,/terms
   [junit4]   2> 138748 INFO  (qtp21922284-1041) [n:127.0.0.1:61643_solr c:testschemaapi s:shard1 r:core_node2 x:testschemaapi_shard1_replica2] o.a.s.c.SolrCore Using default statsCache cache: org.apache.solr.search.stats.LocalStatsCache
   [junit4]   2> 138750 INFO  (qtp21922284-1041) [n:127.0.0.1:61643_solr c:testschemaapi s:shard1 r:core_node2 x:testschemaapi_shard1_replica2] o.a.s.u.UpdateHandler Using UpdateLog implementation: org.apache.solr.update.UpdateLog
   [junit4]   2> 138750 INFO  (qtp21922284-1041) [n:127.0.0.1:61643_solr c:testschemaapi s:shard1 r:core_node2 x:testschemaapi_shard1_replica2] o.a.s.u.UpdateLog Initializing UpdateLog: dataDir=null defaultSyncLevel=FLUSH numRecordsToKeep=100 maxNumLogsToKeep=10 numVersionBuckets=65536
   [junit4]   2> 138750 INFO  (qtp18703873-1048) [n:127.0.0.1:61644_solr c:testschemaapi s:shard1 r:core_node1 x:testschemaapi_shard1_replica1] o.a.s.h.l.XMLLoader xsltCacheLifetimeSeconds=60
   [junit4]   2> 138752 INFO  (qtp18703873-1048) [n:127.0.0.1:61644_solr c:testschemaapi s:shard1 r:core_node1 x:testschemaapi_shard1_replica1] o.a.s.h.l.XMLLoader xsltCacheLifetimeSeconds=60
   [junit4]   2> 138753 INFO  (qtp21922284-1041) [n:127.0.0.1:61643_solr c:testschemaapi s:shard1 r:core_node2 x:testschemaapi_shard1_replica2] o.a.s.u.CommitTracker Hard AutoCommit: disabled
   [junit4]   2> 138753 INFO  (qtp21922284-1041) [n:127.0.0.1:61643_solr c:testschemaapi s:shard1 r:core_node2 x:testschemaapi_shard1_replica2] o.a.s.u.CommitTracker Soft AutoCommit: disabled
   [junit4]   2> 138754 INFO  (OldIndexDirectoryCleanupThreadForCore-testschemaapi_shard1_replica1) [n:127.0.0.1:61644_solr c:testschemaapi s:shard1 r:core_node1 x:testschemaapi_shard1_replica1] o.a.s.c.SolrCore Looking for old index directories to cleanup for core testschemaapi_shard1_replica1 in C:\Users\jenkins\workspace\Lucene-Solr-6.x-Windows\solr\build\solr-core\test\J1\temp\solr.schema.TestManagedSchemaAPI_89CE62CE0521968B-001\tempDir-001\node2\.\testschemaapi_shard1_replica1\data\
   [junit4]   2> 138754 INFO  (qtp18703873-1048) [n:127.0.0.1:61644_solr c:testschemaapi s:shard1 r:core_node1 x:testschemaapi_shard1_replica1] o.a.s.c.RequestHandlers Registered paths: /admin/mbeans,/update/json/docs,/admin/luke,/export,/get,/admin/properties,/update/json,/admin/threads,/update/csv,/sql,/graph,/select,/admin/segments,/admin/system,/replication,/config,/stream,/schema,/admin/plugins,/admin/logging,/admin/ping,/update,/admin/file,/terms
   [junit4]   2> 138754 INFO  (qtp18703873-1048) [n:127.0.0.1:61644_solr c:testschemaapi s:shard1 r:core_node1 x:testschemaapi_shard1_replica1] o.a.s.c.SolrCore Using default statsCache cache: org.apache.solr.search.stats.LocalStatsCache
   [junit4]   2> 138757 WARN  (OldIndexDirectoryCleanupThreadForCore-testschemaapi_shard1_replica1) [n:127.0.0.1:61644_solr c:testschemaapi s:shard1 r:core_node1 x:testschemaapi_shard1_replica1] o.a.s.c.DirectoryFactory C:\Users\jenkins\workspace\Lucene-Solr-6.x-Windows\solr\build\solr-core\test\J1\temp\solr.schema.TestManagedSchemaAPI_89CE62CE0521968B-001\tempDir-001\node2\.\testschemaapi_shard1_replica1\data\ does not point to a valid data directory; skipping clean-up of old index directories.
   [junit4]   2> 138757 INFO  (qtp18703873-1048) [n:127.0.0.1:61644_solr c:testschemaapi s:shard1 r:core_node1 x:testschemaapi_shard1_replica1] o.a.s.u.UpdateHandler Using UpdateLog implementation: org.apache.solr.update.UpdateLog
   [junit4]   2> 138757 INFO  (qtp18703873-1048) [n:127.0.0.1:61644_solr c:testschemaapi s:shard1 r:core_node1 x:testschemaapi_shard1_replica1] o.a.s.u.UpdateLog Initializing UpdateLog: dataDir=null defaultSyncLevel=FLUSH numRecordsToKeep=100 maxNumLogsToKeep=10 numVersionBuckets=65536
   [junit4]   2> 138758 INFO  (qtp21922284-1041) [n:127.0.0.1:61643_solr c:testschemaapi s:shard1 r:core_node2 x:testschemaapi_shard1_replica2] o.a.s.c.SolrDeletionPolicy SolrDeletionPolicy.onInit: commits: num=1
   [junit4]   2> 	commit{dir=MockDirectoryWrapper(RAMDirectory@1bd8892 lockFactory=org.apache.lucene.store.SingleInstanceLockFactory@efbe9f),segFN=segments_1,generation=1}
   [junit4]   2> 138758 INFO  (qtp21922284-1041) [n:127.0.0.1:61643_solr c:testschemaapi s:shard1 r:core_node2 x:testschemaapi_shard1_replica2] o.a.s.c.SolrDeletionPolicy newest commit generation = 1
   [junit4]   2> 138760 INFO  (qtp21922284-1041) [n:127.0.0.1:61643_solr c:testschemaapi s:shard1 r:core_node2 x:testschemaapi_shard1_replica2] o.a.s.s.SolrIndexSearcher Opening [Searcher@1c41849[testschemaapi_shard1_replica2] main]
   [junit4]   2> 138760 INFO  (qtp18703873-1048) [n:127.0.0.1:61644_solr c:testschemaapi s:shard1 r:core_node1 x:testschemaapi_shard1_replica1] o.a.s.u.CommitTracker Hard AutoCommit: disabled
   [junit4]   2> 138760 INFO  (qtp18703873-1048) [n:127.0.0.1:61644_solr c:testschemaapi s:shard1 r:core_node1 x:testschemaapi_shard1_replica1] o.a.s.u.CommitTracker Soft AutoCommit: disabled
   [junit4]   2> 138761 INFO  (qtp21922284-1041) [n:127.0.0.1:61643_solr c:testschemaapi s:shard1 r:core_node2 x:testschemaapi_shard1_replica2] o.a.s.r.ManagedResourceStorage Setting up ZooKeeper-based storage for the RestManager with znodeBase: /configs/conf1
   [junit4]   2> 138761 INFO  (qtp18703873-1048) [n:127.0.0.1:61644_solr c:testschemaapi s:shard1 r:core_node1 x:testschemaapi_shard1_replica1] o.a.s.c.SolrDeletionPolicy SolrDeletionPolicy.onInit: commits: num=1
   [junit4]   2> 	commit{dir=MockDirectoryWrapper(RAMDirectory@18403e0 lockFactory=org.apache.lucene.store.SingleInstanceLockFactory@12bf3aa),segFN=segments_1,generation=1}
   [junit4]   2> 138762 INFO  (qtp21922284-1041) [n:127.0.0.1:61643_solr c:testschemaapi s:shard1 r:core_node2 x:testschemaapi_shard1_replica2] o.a.s.r.ManagedResourceStorage Configured ZooKeeperStorageIO with znodeBase: /configs/conf1
   [junit4]   2> 138762 INFO  (qtp21922284-1041) [n:127.0.0.1:61643_solr c:testschemaapi s:shard1 r:core_node2 x:testschemaapi_shard1_replica2] o.a.s.r.RestManager Initializing RestManager with initArgs: {}
   [junit4]   2> 138762 INFO  (qtp18703873-1048) [n:127.0.0.1:61644_solr c:testschemaapi s:shard1 r:core_node1 x:testschemaapi_shard1_replica1] o.a.s.c.SolrDeletionPolicy newest commit generation = 1
   [junit4]   2> 138762 INFO  (qtp21922284-1041) [n:127.0.0.1:61643_solr c:testschemaapi s:shard1 r:core_node2 x:testschemaapi_shard1_replica2] o.a.s.r.ManagedResourceStorage Reading _rest_managed.json using ZooKeeperStorageIO:path=/configs/conf1
   [junit4]   2> 138763 INFO  (qtp21922284-1041) [n:127.0.0.1:61643_solr c:testschemaapi s:shard1 r:core_node2 x:testschemaapi_shard1_replica2] o.a.s.r.ManagedResourceStorage No data found for znode /configs/conf1/_rest_managed.json
   [junit4]   2> 138763 INFO  (qtp21922284-1041) [n:127.0.0.1:61643_solr c:testschemaapi s:shard1 r:core_node2 x:testschemaapi_shard1_replica2] o.a.s.r.ManagedResourceStorage Loaded null at path _rest_managed.json using ZooKeeperStorageIO:path=/configs/conf1
   [junit4]   2> 138763 INFO  (qtp21922284-1041) [n:127.0.0.1:61643_solr c:testschemaapi s:shard1 r:core_node2 x:testschemaapi_shard1_replica2] o.a.s.r.RestManager Initializing 0 registered ManagedResources
   [junit4]   2> 138763 INFO  (qtp18703873-1048) [n:127.0.0.1:61644_solr c:testschemaapi s:shard1 r:core_node1 x:testschemaapi_shard1_replica1] o.a.s.s.SolrIndexSearcher Opening [Searcher@179bcaf[testschemaapi_shard1_replica1] main]
   [junit4]   2> 138765 INFO  (qtp18703873-1048) [n:127.0.0.1:61644_solr c:testschemaapi s:shard1 r:core_node1 x:testschemaapi_shard1_replica1] o.a.s.r.ManagedResourceStorage Setting up ZooKeeper-based storage for the RestManager with znodeBase: /configs/conf1
   [junit4]   2> 138765 INFO  (qtp18703873-1048) [n:127.0.0.1:61644_solr c:testschemaapi s:shard1 r:core_node1 x:testschemaapi_shard1_replica1] o.a.s.r.ManagedResourceStorage Configured ZooKeeperStorageIO with znodeBase: /configs/conf1
   [junit4]   2> 138765 INFO  (qtp18703873-1048) [n:127.0.0.1:61644_solr c:testschemaapi s:shard1 r:core_node1 x:testschemaapi_shard1_replica1] o.a.s.r.RestManager Initializing RestManager with initArgs: {}
   [junit4]   2> 138765 INFO  (qtp18703873-1048) [n:127.0.0.1:61644_solr c:testschemaapi s:shard1 r:core_node1 x:testschemaapi_shard1_replica1] o.a.s.r.ManagedResourceStorage Reading _rest_managed.json using ZooKeeperStorageIO:path=/configs/conf1
   [junit4]   2> 138766 INFO  (qtp18703873-1048) [n:127.0.0.1:61644_solr c:testschemaapi s:shard1 r:core_node1 x:testschemaapi_shard1_replica1] o.a.s.r.ManagedResourceStorage No data found for znode /configs/conf1/_rest_managed.json
   [junit4]   2> 138766 INFO  (qtp18703873-1048) [n:127.0.0.1:61644_solr c:testschemaapi s:shard1 r:core_node1 x:testschemaapi_shard1_replica1] o.a.s.r.ManagedResourceStorage Loaded null at path _rest_managed.json using ZooKeeperStorageIO:path=/configs/conf1
   [junit4]   2> 138766 INFO  (qtp18703873-1048) [n:127.0.0.1:61644_solr c:testschemaapi s:shard1 r:core_node1 x:testschemaapi_shard1_replica1] o.a.s.r.RestManager Initializing 0 registered ManagedResources
   [junit4]   2> 138773 INFO  (qtp18703873-1048) [n:127.0.0.1:61644_solr c:testschemaapi s:shard1 r:core_node1 x:testschemaapi_shard1_replica1] o.a.s.s.ZkIndexSchemaReader Creating ZooKeeper watch for the managed schema at /configs/conf1/managed-schema
   [junit4]   2> 138773 INFO  (qtp21922284-1041) [n:127.0.0.1:61643_solr c:testschemaapi s:shard1 r:core_node2 x:testschemaapi_shard1_replica2] o.a.s.s.ZkIndexSchemaReader Creating ZooKeeper watch for the managed schema at /configs/conf1/managed-schema
   [junit4]   2> 138778 INFO  (qtp21922284-1041) [n:127.0.0.1:61643_solr c:testschemaapi s:shard1 r:core_node2 x:testschemaapi_shard1_replica2] o.a.s.c.ZkController Added new OnReconnect listener ZkIndexSchemaReader: /configs/conf1/managed-schema, uniqueCoreId: testschemaapi_shard1_replica2:208939157511080
   [junit4]   2> 138778 INFO  (qtp21922284-1041) [n:127.0.0.1:61643_solr c:testschemaapi s:shard1 r:core_node2 x:testschemaapi_shard1_replica2] o.a.s.h.ReplicationHandler Commits will be reserved for  10000
   [junit4]   2> 138779 INFO  (qtp18703873-1048) [n:127.0.0.1:61644_solr c:testschemaapi s:shard1 r:core_node1 x:testschemaapi_shard1_replica1] o.a.s.c.ZkController Added new OnReconnect listener ZkIndexSchemaReader: /configs/conf1/managed-schema, uniqueCoreId: testschemaapi_shard1_replica1:208939111817015
   [junit4]   2> 138779 INFO  (qtp21922284-1041) [n:127.0.0.1:61643_solr c:testschemaapi s:shard1 r:core_node2 x:testschemaapi_shard1_replica2] o.a.s.u.UpdateLog Looking up max value of version field to seed version buckets
   [junit4]   2> 138779 INFO  (qtp18703873-1048) [n:127.0.0.1:61644_solr c:testschemaapi s:shard1 r:core_node1 x:testschemaapi_shard1_replica1] o.a.s.h.ReplicationHandler Commits will be reserved for  10000
   [junit4]   2> 138779 INFO  (qtp18703873-1048) [n:127.0.0.1:61644_solr c:testschemaapi s:shard1 r:core_node1 x:testschemaapi_shard1_replica1] o.a.s.u.UpdateLog Looking up max value of version field to seed version buckets
   [junit4]   2> 138779 INFO  (qtp18703873-1048) [n:127.0.0.1:61644_solr c:testschemaapi s:shard1 r:core_node1 x:testschemaapi_shard1_replica1] o.a.s.u.VersionInfo Refreshing highest value of _version_ for 65536 version buckets from index
   [junit4]   2> 138779 INFO  (qtp18703873-1048) [n:127.0.0.1:61644_solr c:testschemaapi s:shard1 r:core_node1 x:testschemaapi_shard1_replica1] o.a.s.u.VersionInfo No terms found for _version_, cannot seed version bucket highest value from index
   [junit4]   2> 138779 INFO  (qtp18703873-1048) [n:127.0.0.1:61644_solr c:testschemaapi s:shard1 r:core_node1 x:testschemaapi_shard1_replica1] o.a.s.u.UpdateLog Could not find max version in index or recent updates, using new clock 1545960274477973504
   [junit4]   2> 138780 INFO  (qtp21922284-1041) [n:127.0.0.1:61643_solr c:testschemaapi s:shard1 r:core_node2 x:testschemaapi_shard1_replica2] o.a.s.u.VersionInfo Refreshing highest value of _version_ for 65536 version buckets from index
   [junit4]   2> 138780 INFO  (qtp21922284-1041) [n:127.0.0.1:61643_solr c:testschemaapi s:shard1 r:core_node2 x:testschemaapi_shard1_replica2] o.a.s.u.VersionInfo No terms found for _version_, cannot seed version bucket highest value from index
   [junit4]   2> 138780 INFO  (qtp21922284-1041) [n:127.0.0.1:61643_solr c:testschemaapi s:shard1 r:core_node2 x:testschemaapi_shard1_replica2] o.a.s.u.UpdateLog Could not find max version in index or recent updates, using new clock 1545960274479022080
   [junit4]   2> 138781 INFO  (qtp18703873-1048) [n:127.0.0.1:61644_solr c:testschemaapi s:shard1 r:core_node1 x:testschemaapi_shard1_replica1] o.a.s.u.UpdateLog Took 2.0ms to seed version buckets with highest version 1545960274477973504
   [junit4]   2> 138782 INFO  (qtp18703873-1048) [n:127.0.0.1:61644_solr c:testschemaapi s:shard1 r:core_node1 x:testschemaapi_shard1_replica1] o.a.s.c.ZkController watch zkdir /configs/conf1
   [junit4]   2> 138782 INFO  (searcherExecutor-372-thread-1-processing-n:127.0.0.1:61643_solr x:testschemaapi_shard1_replica2 s:shard1 c:testschemaapi r:core_node2) [n:127.0.0.1:61643_solr c:testschemaapi s:shard1 r:core_node2 x:testschemaapi_shard1_replica2] o.a.s.c.SolrCore [testschemaapi_shard1_replica2] Registered new searcher Searcher@1c41849[testschemaapi_shard1_replica2] main{ExitableDirectoryReader(UninvertingDirectoryReader())}
   [junit4]   2> 138782 INFO  (qtp21922284-1041) [n:127.0.0.1:61643_solr c:testschemaapi s:shard1 r:core_node2 x:testschemaapi_shard1_replica2] o.a.s.u.UpdateLog Took 3.0ms to seed version buckets with highest version 1545960274479022080
   [junit4]   2> 138782 INFO  (searcherExecutor-371-thread-1-processing-n:127.0.0.1:61644_solr x:testschemaapi_shard1_replica1 s:shard1 c:testschemaapi r:core_node1) [n:127.0.0.1:61644_solr c:testschemaapi s:shard1 r:core_node1 x:testschemaapi_shard1_replica1] o.a.s.c.SolrCore [testschemaapi_shard1_replica1] Registered new searcher Searcher@179bcaf[testschemaapi_shard1_replica1] main{ExitableDirectoryReader(UninvertingDirectoryReader())}
   [junit4]   2> 138782 INFO  (qtp21922284-1041) [n:127.0.0.1:61643_solr c:testschemaapi s:shard1 r:core_node2 x:testschemaapi_shard1_replica2] o.a.s.c.ZkController watch zkdir /configs/conf1
   [junit4]   2> 138783 INFO  (qtp21922284-1041) [n:127.0.0.1:61643_solr c:testschemaapi s:shard1 r:core_node2 x:testschemaapi_shard1_replica2] o.a.s.c.CoreContainer registering core: testschemaapi_shard1_replica2
   [junit4]   2> 138783 INFO  (qtp18703873-1048) [n:127.0.0.1:61644_solr c:testschemaapi s:shard1 r:core_node1 x:testschemaapi_shard1_replica1] o.a.s.c.CoreContainer registering core: testschemaapi_shard1_replica1
   [junit4]   2> 138783 INFO  (qtp21922284-1041) [n:127.0.0.1:61643_solr c:testschemaapi s:shard1 r:core_node2 x:testschemaapi_shard1_replica2] o.a.s.c.ZkController Register replica - core:testschemaapi_shard1_replica2 address:https://127.0.0.1:61643/solr collection:testschemaapi shard:shard1
   [junit4]   2> 138784 INFO  (qtp18703873-1048) [n:127.0.0.1:61644_solr c:testschemaapi s:shard1 r:core_node1 x:testschemaapi_shard1_replica1] o.a.s.c.ZkController Register replica - core:testschemaapi_shard1_replica1 address:https://127.0.0.1:61644/solr collection:testschemaapi shard:shard1
   [junit4]   2> 138785 INFO  (qtp18703873-

[...truncated too long message...]

r listener throws error
   [junit4]   2> org.apache.solr.common.SolrException: Unable to reload core [testschemaapi_shard1_replica2]
   [junit4]   2> 	at org.apache.solr.core.CoreContainer.reload(CoreContainer.java:948)
   [junit4]   2> 	at org.apache.solr.core.SolrCore.lambda$getConfListener$6(SolrCore.java:2584)
   [junit4]   2> 	at org.apache.solr.cloud.ZkController.lambda$fireEventListeners$3(ZkController.java:2443)
   [junit4]   2> 	at java.lang.Thread.run(Thread.java:745)
   [junit4]   2> Caused by: org.apache.solr.common.SolrException: Failed to load config name for collection:testschemaapi due to: 
   [junit4]   2> 	at org.apache.solr.core.SolrCore.<init>(SolrCore.java:815)
   [junit4]   2> 	at org.apache.solr.core.SolrCore.reload(SolrCore.java:503)
   [junit4]   2> 	at org.apache.solr.core.CoreContainer.reload(CoreContainer.java:942)
   [junit4]   2> 	... 3 more
   [junit4]   2> Caused by: org.apache.solr.common.SolrException: Failed to load config name for collection:testschemaapi due to: 
   [junit4]   2> 	at org.apache.solr.rest.ManagedResourceStorage.newStorageIO(ManagedResourceStorage.java:98)
   [junit4]   2> 	at org.apache.solr.core.SolrCore.initRestManager(SolrCore.java:2364)
   [junit4]   2> 	at org.apache.solr.core.SolrCore.<init>(SolrCore.java:791)
   [junit4]   2> 	... 5 more
   [junit4]   2> Caused by: org.apache.solr.common.SolrException: Error loading config name for collection testschemaapi
   [junit4]   2> 	at org.apache.solr.common.cloud.ZkStateReader.readConfigName(ZkStateReader.java:198)
   [junit4]   2> 	at org.apache.solr.rest.ManagedResourceStorage.newStorageIO(ManagedResourceStorage.java:95)
   [junit4]   2> 	... 7 more
   [junit4]   2> Caused by: org.apache.zookeeper.KeeperException$SessionExpiredException: KeeperErrorCode = Session expired for /collections/testschemaapi
   [junit4]   2> 	at org.apache.zookeeper.KeeperException.create(KeeperException.java:127)
   [junit4]   2> 	at org.apache.zookeeper.KeeperException.create(KeeperException.java:51)
   [junit4]   2> 	at org.apache.zookeeper.ZooKeeper.getData(ZooKeeper.java:1155)
   [junit4]   2> 	at org.apache.solr.common.cloud.SolrZkClient$7.execute(SolrZkClient.java:356)
   [junit4]   2> 	at org.apache.solr.common.cloud.SolrZkClient$7.execute(SolrZkClient.java:353)
   [junit4]   2> 	at org.apache.solr.common.cloud.ZkCmdExecutor.retryOperation(ZkCmdExecutor.java:60)
   [junit4]   2> 	at org.apache.solr.common.cloud.SolrZkClient.getData(SolrZkClient.java:353)
   [junit4]   2> 	at org.apache.solr.common.cloud.ZkStateReader.readConfigName(ZkStateReader.java:178)
   [junit4]   2> 	... 8 more
   [junit4]   2> NOTE: test params are: codec=CheapBastard, sim=ClassicSimilarity, locale=fr, timezone=Europe/Zagreb
   [junit4]   2> NOTE: Windows 10 10.0 x86/Oracle Corporation 1.8.0_102 (32-bit)/cpus=3,threads=1,free=125759336,total=252706816
   [junit4]   2> NOTE: All tests run in this JVM: [OverseerStatusTest, TestDFRSimilarityFactory, SharedFSAutoReplicaFailoverTest, TriLevelCompositeIdRoutingTest, HdfsCollectionsAPIDistributedZkTest, ZkStateReaderTest, TestSearcherReuse, ScriptEngineTest, FacetPivotSmallTest, SuggestComponentContextFilterQueryTest, AnalyticsMergeStrategyTest, TestSQLHandler, HdfsUnloadDistributedZkTest, TestShardHandlerFactory, BadIndexSchemaTest, TestQueryUtils, DistributedQueueTest, TestXmlQParser, IgnoreCommitOptimizeUpdateProcessorFactoryTest, TestManagedSchemaAPI]
   [junit4]   2> NOTE: reproduce with: ant test  -Dtestcase=TestManagedSchemaAPI -Dtests.seed=89CE62CE0521968B -Dtests.slow=true -Dtests.locale=fr -Dtests.timezone=Europe/Zagreb -Dtests.asserts=true -Dtests.file.encoding=ISO-8859-1
   [junit4] ERROR   0.00s J1 | TestManagedSchemaAPI (suite) <<<
   [junit4]    > Throwable #1: java.lang.AssertionError: ObjectTracker found 10 object(s) that were not released!!! [MockDirectoryWrapper, MDCAwareThreadPoolExecutor, TransactionLog, MockDirectoryWrapper, MockDirectoryWrapper, MockDirectoryWrapper, MockDirectoryWrapper, MDCAwareThreadPoolExecutor, MockDirectoryWrapper, TransactionLog]
   [junit4]    > 	at __randomizedtesting.SeedInfo.seed([89CE62CE0521968B]:0)
   [junit4]    > 	at org.apache.solr.SolrTestCaseJ4.teardownTestCases(SolrTestCaseJ4.java:257)
   [junit4]    > 	at java.lang.Thread.run(Thread.java:745)Throwable #2: java.io.IOException: Could not remove the following files (in the order of attempts):
   [junit4]    >    C:\Users\jenkins\workspace\Lucene-Solr-6.x-Windows\solr\build\solr-core\test\J1\temp\solr.schema.TestManagedSchemaAPI_89CE62CE0521968B-001\tempDir-001\node1\testschemaapi_shard1_replica2\data\tlog\tlog.0000000000000000001: java.nio.file.FileSystemException: C:\Users\jenkins\workspace\Lucene-Solr-6.x-Windows\solr\build\solr-core\test\J1\temp\solr.schema.TestManagedSchemaAPI_89CE62CE0521968B-001\tempDir-001\node1\testschemaapi_shard1_replica2\data\tlog\tlog.0000000000000000001: The process cannot access the file because it is being used by another process.
   [junit4]    >    C:\Users\jenkins\workspace\Lucene-Solr-6.x-Windows\solr\build\solr-core\test\J1\temp\solr.schema.TestManagedSchemaAPI_89CE62CE0521968B-001\tempDir-001\node1\testschemaapi_shard1_replica2\data\tlog: java.nio.file.DirectoryNotEmptyException: C:\Users\jenkins\workspace\Lucene-Solr-6.x-Windows\solr\build\solr-core\test\J1\temp\solr.schema.TestManagedSchemaAPI_89CE62CE0521968B-001\tempDir-001\node1\testschemaapi_shard1_replica2\data\tlog
   [junit4]    >    C:\Users\jenkins\workspace\Lucene-Solr-6.x-Windows\solr\build\solr-core\test\J1\temp\solr.schema.TestManagedSchemaAPI_89CE62CE0521968B-001\tempDir-001\node1\testschemaapi_shard1_replica2\data: java.nio.file.DirectoryNotEmptyException: C:\Users\jenkins\workspace\Lucene-Solr-6.x-Windows\solr\build\solr-core\test\J1\temp\solr.schema.TestManagedSchemaAPI_89CE62CE0521968B-001\tempDir-001\node1\testschemaapi_shard1_replica2\data
   [junit4]    >    C:\Users\jenkins\workspace\Lucene-Solr-6.x-Windows\solr\build\solr-core\test\J1\temp\solr.schema.TestManagedSchemaAPI_89CE62CE0521968B-001\tempDir-001\node1\testschemaapi_shard1_replica2: java.nio.file.DirectoryNotEmptyException: C:\Users\jenkins\workspace\Lucene-Solr-6.x-Windows\solr\build\solr-core\test\J1\temp\solr.schema.TestManagedSchemaAPI_89CE62CE0521968B-001\tempDir-001\node1\testschemaapi_shard1_replica2
   [junit4]    >    C:\Users\jenkins\workspace\Lucene-Solr-6.x-Windows\solr\build\solr-core\test\J1\temp\solr.schema.TestManagedSchemaAPI_89CE62CE0521968B-001\tempDir-001\node1: java.nio.file.DirectoryNotEmptyException: C:\Users\jenkins\workspace\Lucene-Solr-6.x-Windows\solr\build\solr-core\test\J1\temp\solr.schema.TestManagedSchemaAPI_89CE62CE0521968B-001\tempDir-001\node1
   [junit4]    >    C:\Users\jenkins\workspace\Lucene-Solr-6.x-Windows\solr\build\solr-core\test\J1\temp\solr.schema.TestManagedSchemaAPI_89CE62CE0521968B-001\tempDir-001\node2\testschemaapi_shard1_replica1\data\tlog\tlog.0000000000000000000: java.nio.file.FileSystemException: C:\Users\jenkins\workspace\Lucene-Solr-6.x-Windows\solr\build\solr-core\test\J1\temp\solr.schema.TestManagedSchemaAPI_89CE62CE0521968B-001\tempDir-001\node2\testschemaapi_shard1_replica1\data\tlog\tlog.0000000000000000000: The process cannot access the file because it is being used by another process.
   [junit4]    >    C:\Users\jenkins\workspace\Lucene-Solr-6.x-Windows\solr\build\solr-core\test\J1\temp\solr.schema.TestManagedSchemaAPI_89CE62CE0521968B-001\tempDir-001\node2\testschemaapi_shard1_replica1\data\tlog: java.nio.file.DirectoryNotEmptyException: C:\Users\jenkins\workspace\Lucene-Solr-6.x-Windows\solr\build\solr-core\test\J1\temp\solr.schema.TestManagedSchemaAPI_89CE62CE0521968B-001\tempDir-001\node2\testschemaapi_shard1_replica1\data\tlog
   [junit4]    >    C:\Users\jenkins\workspace\Lucene-Solr-6.x-Windows\solr\build\solr-core\test\J1\temp\solr.schema.TestManagedSchemaAPI_89CE62CE0521968B-001\tempDir-001\node2\testschemaapi_shard1_replica1\data: java.nio.file.DirectoryNotEmptyException: C:\Users\jenkins\workspace\Lucene-Solr-6.x-Windows\solr\build\solr-core\test\J1\temp\solr.schema.TestManagedSchemaAPI_89CE62CE0521968B-001\tempDir-001\node2\testschemaapi_shard1_replica1\data
   [junit4]    >    C:\Users\jenkins\workspace\Lucene-Solr-6.x-Windows\solr\build\solr-core\test\J1\temp\solr.schema.TestManagedSchemaAPI_89CE62CE0521968B-001\tempDir-001\node2\testschemaapi_shard1_replica1: java.nio.file.DirectoryNotEmptyException: C:\Users\jenkins\workspace\Lucene-Solr-6.x-Windows\solr\build\solr-core\test\J1\temp\solr.schema.TestManagedSchemaAPI_89CE62CE0521968B-001\tempDir-001\node2\testschemaapi_shard1_replica1
   [junit4]    >    C:\Users\jenkins\workspace\Lucene-Solr-6.x-Windows\solr\build\solr-core\test\J1\temp\solr.schema.TestManagedSchemaAPI_89CE62CE0521968B-001\tempDir-001\node2: java.nio.file.DirectoryNotEmptyException: C:\Users\jenkins\workspace\Lucene-Solr-6.x-Windows\solr\build\solr-core\test\J1\temp\solr.schema.TestManagedSchemaAPI_89CE62CE0521968B-001\tempDir-001\node2
   [junit4]    >    C:\Users\jenkins\workspace\Lucene-Solr-6.x-Windows\solr\build\solr-core\test\J1\temp\solr.schema.TestManagedSchemaAPI_89CE62CE0521968B-001\tempDir-001: java.nio.file.DirectoryNotEmptyException: C:\Users\jenkins\workspace\Lucene-Solr-6.x-Windows\solr\build\solr-core\test\J1\temp\solr.schema.TestManagedSchemaAPI_89CE62CE0521968B-001\tempDir-001
   [junit4]    >    C:\Users\jenkins\workspace\Lucene-Solr-6.x-Windows\solr\build\solr-core\test\J1\temp\solr.schema.TestManagedSchemaAPI_89CE62CE0521968B-001: java.nio.file.DirectoryNotEmptyException: C:\Users\jenkins\workspace\Lucene-Solr-6.x-Windows\solr\build\solr-core\test\J1\temp\solr.schema.TestManagedSchemaAPI_89CE62CE0521968B-001
   [junit4]    > 	at org.apache.lucene.util.IOUtils.rm(IOUtils.java:323)
   [junit4]    > 	at java.lang.Thread.run(Thread.java:745)
   [junit4] Completed [35/630 (1!)] on J1 in 13.31s, 1 test, 1 failure, 1 error <<< FAILURES!

[...truncated 54527 lines...]


[JENKINS] Lucene-Solr-6.x-Windows (32bit/jdk1.8.0_102) - Build # 464 - Still Unstable!

Posted by Policeman Jenkins Server <je...@thetaphi.de>.
Build: http://jenkins.thetaphi.de/job/Lucene-Solr-6.x-Windows/464/
Java: 32bit/jdk1.8.0_102 -server -XX:+UseSerialGC

2 tests failed.
FAILED:  org.apache.solr.cloud.LeaderFailoverAfterPartitionTest.test

Error Message:
No live SolrServers available to handle this request:[http://127.0.0.1:62344/b/c8n_1x3_lf_shard1_replica3]

Stack Trace:
org.apache.solr.client.solrj.impl.CloudSolrClient$RouteException: No live SolrServers available to handle this request:[http://127.0.0.1:62344/b/c8n_1x3_lf_shard1_replica3]
	at __randomizedtesting.SeedInfo.seed([62B63AF65123CE48:EAE2052CFFDFA3B0]:0)
	at org.apache.solr.client.solrj.impl.CloudSolrClient.directUpdate(CloudSolrClient.java:755)
	at org.apache.solr.client.solrj.impl.CloudSolrClient.sendRequest(CloudSolrClient.java:1161)
	at org.apache.solr.client.solrj.impl.CloudSolrClient.requestWithRetryOnStaleState(CloudSolrClient.java:1050)
	at org.apache.solr.client.solrj.impl.CloudSolrClient.request(CloudSolrClient.java:992)
	at org.apache.solr.client.solrj.SolrClient.request(SolrClient.java:1219)
	at org.apache.solr.cloud.HttpPartitionTest.sendDoc(HttpPartitionTest.java:592)
	at org.apache.solr.cloud.HttpPartitionTest.sendDoc(HttpPartitionTest.java:578)
	at org.apache.solr.cloud.LeaderFailoverAfterPartitionTest.testRf3WithLeaderFailover(LeaderFailoverAfterPartitionTest.java:174)
	at org.apache.solr.cloud.LeaderFailoverAfterPartitionTest.test(LeaderFailoverAfterPartitionTest.java:55)
	at sun.reflect.NativeMethodAccessorImpl.invoke0(Native Method)
	at sun.reflect.NativeMethodAccessorImpl.invoke(NativeMethodAccessorImpl.java:62)
	at sun.reflect.DelegatingMethodAccessorImpl.invoke(DelegatingMethodAccessorImpl.java:43)
	at java.lang.reflect.Method.invoke(Method.java:498)
	at com.carrotsearch.randomizedtesting.RandomizedRunner.invoke(RandomizedRunner.java:1764)
	at com.carrotsearch.randomizedtesting.RandomizedRunner$8.evaluate(RandomizedRunner.java:871)
	at com.carrotsearch.randomizedtesting.RandomizedRunner$9.evaluate(RandomizedRunner.java:907)
	at com.carrotsearch.randomizedtesting.RandomizedRunner$10.evaluate(RandomizedRunner.java:921)
	at org.apache.solr.BaseDistributedSearchTestCase$ShardsRepeatRule$ShardsFixedStatement.callStatement(BaseDistributedSearchTestCase.java:992)
	at org.apache.solr.BaseDistributedSearchTestCase$ShardsRepeatRule$ShardsStatement.evaluate(BaseDistributedSearchTestCase.java:967)
	at com.carrotsearch.randomizedtesting.rules.SystemPropertiesRestoreRule$1.evaluate(SystemPropertiesRestoreRule.java:57)
	at org.apache.lucene.util.TestRuleSetupTeardownChained$1.evaluate(TestRuleSetupTeardownChained.java:49)
	at org.apache.lucene.util.AbstractBeforeAfterRule$1.evaluate(AbstractBeforeAfterRule.java:45)
	at org.apache.lucene.util.TestRuleThreadAndTestName$1.evaluate(TestRuleThreadAndTestName.java:48)
	at org.apache.lucene.util.TestRuleIgnoreAfterMaxFailures$1.evaluate(TestRuleIgnoreAfterMaxFailures.java:64)
	at org.apache.lucene.util.TestRuleMarkFailure$1.evaluate(TestRuleMarkFailure.java:47)
	at com.carrotsearch.randomizedtesting.rules.StatementAdapter.evaluate(StatementAdapter.java:36)
	at com.carrotsearch.randomizedtesting.ThreadLeakControl$StatementRunner.run(ThreadLeakControl.java:367)
	at com.carrotsearch.randomizedtesting.ThreadLeakControl.forkTimeoutingTask(ThreadLeakControl.java:809)
	at com.carrotsearch.randomizedtesting.ThreadLeakControl$3.evaluate(ThreadLeakControl.java:460)
	at com.carrotsearch.randomizedtesting.RandomizedRunner.runSingleTest(RandomizedRunner.java:880)
	at com.carrotsearch.randomizedtesting.RandomizedRunner$5.evaluate(RandomizedRunner.java:781)
	at com.carrotsearch.randomizedtesting.RandomizedRunner$6.evaluate(RandomizedRunner.java:816)
	at com.carrotsearch.randomizedtesting.RandomizedRunner$7.evaluate(RandomizedRunner.java:827)
	at com.carrotsearch.randomizedtesting.rules.StatementAdapter.evaluate(StatementAdapter.java:36)
	at com.carrotsearch.randomizedtesting.rules.SystemPropertiesRestoreRule$1.evaluate(SystemPropertiesRestoreRule.java:57)
	at org.apache.lucene.util.AbstractBeforeAfterRule$1.evaluate(AbstractBeforeAfterRule.java:45)
	at com.carrotsearch.randomizedtesting.rules.StatementAdapter.evaluate(StatementAdapter.java:36)
	at org.apache.lucene.util.TestRuleStoreClassName$1.evaluate(TestRuleStoreClassName.java:41)
	at com.carrotsearch.randomizedtesting.rules.NoShadowingOrOverridesOnMethodsRule$1.evaluate(NoShadowingOrOverridesOnMethodsRule.java:40)
	at com.carrotsearch.randomizedtesting.rules.NoShadowingOrOverridesOnMethodsRule$1.evaluate(NoShadowingOrOverridesOnMethodsRule.java:40)
	at com.carrotsearch.randomizedtesting.rules.StatementAdapter.evaluate(StatementAdapter.java:36)
	at com.carrotsearch.randomizedtesting.rules.StatementAdapter.evaluate(StatementAdapter.java:36)
	at com.carrotsearch.randomizedtesting.rules.StatementAdapter.evaluate(StatementAdapter.java:36)
	at org.apache.lucene.util.TestRuleAssertionsRequired$1.evaluate(TestRuleAssertionsRequired.java:53)
	at org.apache.lucene.util.TestRuleMarkFailure$1.evaluate(TestRuleMarkFailure.java:47)
	at org.apache.lucene.util.TestRuleIgnoreAfterMaxFailures$1.evaluate(TestRuleIgnoreAfterMaxFailures.java:64)
	at org.apache.lucene.util.TestRuleIgnoreTestSuites$1.evaluate(TestRuleIgnoreTestSuites.java:54)
	at com.carrotsearch.randomizedtesting.rules.StatementAdapter.evaluate(StatementAdapter.java:36)
	at com.carrotsearch.randomizedtesting.ThreadLeakControl$StatementRunner.run(ThreadLeakControl.java:367)
	at java.lang.Thread.run(Thread.java:745)
Caused by: org.apache.solr.client.solrj.SolrServerException: No live SolrServers available to handle this request:[http://127.0.0.1:62344/b/c8n_1x3_lf_shard1_replica3]
	at org.apache.solr.client.solrj.impl.LBHttpSolrClient.request(LBHttpSolrClient.java:384)
	at org.apache.solr.client.solrj.impl.CloudSolrClient.lambda$directUpdate$0(CloudSolrClient.java:730)
	at java.util.concurrent.FutureTask.run(FutureTask.java:266)
	at org.apache.solr.common.util.ExecutorUtil$MDCAwareThreadPoolExecutor.lambda$execute$0(ExecutorUtil.java:229)
	at java.util.concurrent.ThreadPoolExecutor.runWorker(ThreadPoolExecutor.java:1142)
	at java.util.concurrent.ThreadPoolExecutor$Worker.run(ThreadPoolExecutor.java:617)
	... 1 more
Caused by: org.apache.solr.client.solrj.SolrServerException: Server refused connection at: http://127.0.0.1:62344/b/c8n_1x3_lf_shard1_replica3
	at org.apache.solr.client.solrj.impl.HttpSolrClient.executeMethod(HttpSolrClient.java:599)
	at org.apache.solr.client.solrj.impl.HttpSolrClient.request(HttpSolrClient.java:261)
	at org.apache.solr.client.solrj.impl.HttpSolrClient.request(HttpSolrClient.java:250)
	at org.apache.solr.client.solrj.impl.LBHttpSolrClient.doRequest(LBHttpSolrClient.java:405)
	at org.apache.solr.client.solrj.impl.LBHttpSolrClient.request(LBHttpSolrClient.java:357)
	... 6 more
Caused by: java.net.ConnectException: Connection refused: connect
	at java.net.DualStackPlainSocketImpl.waitForConnect(Native Method)
	at java.net.DualStackPlainSocketImpl.socketConnect(DualStackPlainSocketImpl.java:85)
	at java.net.AbstractPlainSocketImpl.doConnect(AbstractPlainSocketImpl.java:350)
	at java.net.AbstractPlainSocketImpl.connectToAddress(AbstractPlainSocketImpl.java:206)
	at java.net.AbstractPlainSocketImpl.connect(AbstractPlainSocketImpl.java:188)
	at java.net.PlainSocketImpl.connect(PlainSocketImpl.java:172)
	at java.net.SocksSocketImpl.connect(SocksSocketImpl.java:392)
	at java.net.Socket.connect(Socket.java:589)
	at org.apache.http.conn.scheme.PlainSocketFactory.connectSocket(PlainSocketFactory.java:117)
	at org.apache.http.impl.conn.DefaultClientConnectionOperator.openConnection(DefaultClientConnectionOperator.java:177)
	at org.apache.http.impl.conn.ManagedClientConnectionImpl.open(ManagedClientConnectionImpl.java:304)
	at org.apache.http.impl.client.DefaultRequestDirector.tryConnect(DefaultRequestDirector.java:611)
	at org.apache.http.impl.client.DefaultRequestDirector.execute(DefaultRequestDirector.java:446)
	at org.apache.http.impl.client.AbstractHttpClient.doExecute(AbstractHttpClient.java:882)
	at org.apache.http.impl.client.CloseableHttpClient.execute(CloseableHttpClient.java:82)
	at org.apache.http.impl.client.CloseableHttpClient.execute(CloseableHttpClient.java:107)
	at org.apache.http.impl.client.CloseableHttpClient.execute(CloseableHttpClient.java:55)
	at org.apache.solr.client.solrj.impl.HttpSolrClient.executeMethod(HttpSolrClient.java:497)
	... 10 more


FAILED:  junit.framework.TestSuite.org.apache.solr.util.TestSolrCLIRunExample

Error Message:
ObjectTracker found 4 object(s) that were not released!!! [MockDirectoryWrapper, RawDirectoryWrapper, SolrCore, MockDirectoryWrapper]

Stack Trace:
java.lang.AssertionError: ObjectTracker found 4 object(s) that were not released!!! [MockDirectoryWrapper, RawDirectoryWrapper, SolrCore, MockDirectoryWrapper]
	at __randomizedtesting.SeedInfo.seed([62B63AF65123CE48]:0)
	at org.junit.Assert.fail(Assert.java:93)
	at org.junit.Assert.assertTrue(Assert.java:43)
	at org.junit.Assert.assertNull(Assert.java:551)
	at org.apache.solr.SolrTestCaseJ4.teardownTestCases(SolrTestCaseJ4.java:257)
	at sun.reflect.GeneratedMethodAccessor21.invoke(Unknown Source)
	at sun.reflect.DelegatingMethodAccessorImpl.invoke(DelegatingMethodAccessorImpl.java:43)
	at java.lang.reflect.Method.invoke(Method.java:498)
	at com.carrotsearch.randomizedtesting.RandomizedRunner.invoke(RandomizedRunner.java:1764)
	at com.carrotsearch.randomizedtesting.RandomizedRunner$7.evaluate(RandomizedRunner.java:834)
	at com.carrotsearch.randomizedtesting.rules.StatementAdapter.evaluate(StatementAdapter.java:36)
	at com.carrotsearch.randomizedtesting.rules.SystemPropertiesRestoreRule$1.evaluate(SystemPropertiesRestoreRule.java:57)
	at org.apache.lucene.util.AbstractBeforeAfterRule$1.evaluate(AbstractBeforeAfterRule.java:45)
	at com.carrotsearch.randomizedtesting.rules.StatementAdapter.evaluate(StatementAdapter.java:36)
	at org.apache.lucene.util.TestRuleStoreClassName$1.evaluate(TestRuleStoreClassName.java:41)
	at com.carrotsearch.randomizedtesting.rules.NoShadowingOrOverridesOnMethodsRule$1.evaluate(NoShadowingOrOverridesOnMethodsRule.java:40)
	at com.carrotsearch.randomizedtesting.rules.NoShadowingOrOverridesOnMethodsRule$1.evaluate(NoShadowingOrOverridesOnMethodsRule.java:40)
	at com.carrotsearch.randomizedtesting.rules.StatementAdapter.evaluate(StatementAdapter.java:36)
	at com.carrotsearch.randomizedtesting.rules.StatementAdapter.evaluate(StatementAdapter.java:36)
	at com.carrotsearch.randomizedtesting.rules.StatementAdapter.evaluate(StatementAdapter.java:36)
	at org.apache.lucene.util.TestRuleAssertionsRequired$1.evaluate(TestRuleAssertionsRequired.java:53)
	at org.apache.lucene.util.TestRuleMarkFailure$1.evaluate(TestRuleMarkFailure.java:47)
	at org.apache.lucene.util.TestRuleIgnoreAfterMaxFailures$1.evaluate(TestRuleIgnoreAfterMaxFailures.java:64)
	at org.apache.lucene.util.TestRuleIgnoreTestSuites$1.evaluate(TestRuleIgnoreTestSuites.java:54)
	at com.carrotsearch.randomizedtesting.rules.StatementAdapter.evaluate(StatementAdapter.java:36)
	at com.carrotsearch.randomizedtesting.ThreadLeakControl$StatementRunner.run(ThreadLeakControl.java:367)
	at java.lang.Thread.run(Thread.java:745)




Build Log:
[...truncated 10721 lines...]
   [junit4] Suite: org.apache.solr.cloud.LeaderFailoverAfterPartitionTest
   [junit4]   2> Creating dataDir: C:\Users\jenkins\workspace\Lucene-Solr-6.x-Windows\solr\build\solr-core\test\J1\temp\solr.cloud.LeaderFailoverAfterPartitionTest_62B63AF65123CE48-001\init-core-data-001
   [junit4]   2> 109318 INFO  (SUITE-LeaderFailoverAfterPartitionTest-seed#[62B63AF65123CE48]-worker) [    ] o.a.s.SolrTestCaseJ4 Randomized ssl (false) and clientAuth (false) via: @org.apache.solr.SolrTestCaseJ4$SuppressSSL(bugUrl=https://issues.apache.org/jira/browse/SOLR-5776)
   [junit4]   2> 109318 INFO  (SUITE-LeaderFailoverAfterPartitionTest-seed#[62B63AF65123CE48]-worker) [    ] o.a.s.BaseDistributedSearchTestCase Setting hostContext system property: /b/
   [junit4]   2> 109323 INFO  (TEST-LeaderFailoverAfterPartitionTest.test-seed#[62B63AF65123CE48]) [    ] o.a.s.c.ZkTestServer STARTING ZK TEST SERVER
   [junit4]   2> 109324 INFO  (Thread-185) [    ] o.a.s.c.ZkTestServer client port:0.0.0.0/0.0.0.0:0
   [junit4]   2> 109324 INFO  (Thread-185) [    ] o.a.s.c.ZkTestServer Starting server
   [junit4]   2> 109423 INFO  (TEST-LeaderFailoverAfterPartitionTest.test-seed#[62B63AF65123CE48]) [    ] o.a.s.c.ZkTestServer start zk server on port:62249
   [junit4]   2> 109423 INFO  (TEST-LeaderFailoverAfterPartitionTest.test-seed#[62B63AF65123CE48]) [    ] o.a.s.c.c.SolrZkClient Using default ZkCredentialsProvider
   [junit4]   2> 109424 INFO  (TEST-LeaderFailoverAfterPartitionTest.test-seed#[62B63AF65123CE48]) [    ] o.a.s.c.c.ConnectionManager Waiting for client to connect to ZooKeeper
   [junit4]   2> 109429 INFO  (zkCallback-141-thread-1) [    ] o.a.s.c.c.ConnectionManager Watcher org.apache.solr.common.cloud.ConnectionManager@53d7c4 name:ZooKeeperConnection Watcher:127.0.0.1:62249 got event WatchedEvent state:SyncConnected type:None path:null path:null type:None
   [junit4]   2> 109429 INFO  (TEST-LeaderFailoverAfterPartitionTest.test-seed#[62B63AF65123CE48]) [    ] o.a.s.c.c.ConnectionManager Client is connected to ZooKeeper
   [junit4]   2> 109430 INFO  (TEST-LeaderFailoverAfterPartitionTest.test-seed#[62B63AF65123CE48]) [    ] o.a.s.c.c.SolrZkClient Using default ZkACLProvider
   [junit4]   2> 109430 INFO  (TEST-LeaderFailoverAfterPartitionTest.test-seed#[62B63AF65123CE48]) [    ] o.a.s.c.c.SolrZkClient makePath: /solr
   [junit4]   2> 109435 INFO  (TEST-LeaderFailoverAfterPartitionTest.test-seed#[62B63AF65123CE48]) [    ] o.a.s.c.c.SolrZkClient Using default ZkCredentialsProvider
   [junit4]   2> 109441 INFO  (TEST-LeaderFailoverAfterPartitionTest.test-seed#[62B63AF65123CE48]) [    ] o.a.s.c.c.ConnectionManager Waiting for client to connect to ZooKeeper
   [junit4]   2> 109443 INFO  (zkCallback-142-thread-1) [    ] o.a.s.c.c.ConnectionManager Watcher org.apache.solr.common.cloud.ConnectionManager@11a8726 name:ZooKeeperConnection Watcher:127.0.0.1:62249/solr got event WatchedEvent state:SyncConnected type:None path:null path:null type:None
   [junit4]   2> 109443 INFO  (TEST-LeaderFailoverAfterPartitionTest.test-seed#[62B63AF65123CE48]) [    ] o.a.s.c.c.ConnectionManager Client is connected to ZooKeeper
   [junit4]   2> 109444 INFO  (TEST-LeaderFailoverAfterPartitionTest.test-seed#[62B63AF65123CE48]) [    ] o.a.s.c.c.SolrZkClient Using default ZkACLProvider
   [junit4]   2> 109444 INFO  (TEST-LeaderFailoverAfterPartitionTest.test-seed#[62B63AF65123CE48]) [    ] o.a.s.c.c.SolrZkClient makePath: /collections/collection1
   [junit4]   2> 109446 INFO  (TEST-LeaderFailoverAfterPartitionTest.test-seed#[62B63AF65123CE48]) [    ] o.a.s.c.c.SolrZkClient makePath: /collections/collection1/shards
   [junit4]   2> 109448 INFO  (TEST-LeaderFailoverAfterPartitionTest.test-seed#[62B63AF65123CE48]) [    ] o.a.s.c.c.SolrZkClient makePath: /collections/control_collection
   [junit4]   2> 109449 INFO  (TEST-LeaderFailoverAfterPartitionTest.test-seed#[62B63AF65123CE48]) [    ] o.a.s.c.c.SolrZkClient makePath: /collections/control_collection/shards
   [junit4]   2> 109451 INFO  (TEST-LeaderFailoverAfterPartitionTest.test-seed#[62B63AF65123CE48]) [    ] o.a.s.c.AbstractZkTestCase put C:\Users\jenkins\workspace\Lucene-Solr-6.x-Windows\solr\core\src\test-files\solr\collection1\conf\solrconfig-tlog.xml to /configs/conf1/solrconfig.xml
   [junit4]   2> 109451 INFO  (TEST-LeaderFailoverAfterPartitionTest.test-seed#[62B63AF65123CE48]) [    ] o.a.s.c.c.SolrZkClient makePath: /configs/conf1/solrconfig.xml
   [junit4]   2> 109455 INFO  (TEST-LeaderFailoverAfterPartitionTest.test-seed#[62B63AF65123CE48]) [    ] o.a.s.c.AbstractZkTestCase put C:\Users\jenkins\workspace\Lucene-Solr-6.x-Windows\solr\core\src\test-files\solr\collection1\conf\schema.xml to /configs/conf1/schema.xml
   [junit4]   2> 109455 INFO  (TEST-LeaderFailoverAfterPartitionTest.test-seed#[62B63AF65123CE48]) [    ] o.a.s.c.c.SolrZkClient makePath: /configs/conf1/schema.xml
   [junit4]   2> 109458 INFO  (TEST-LeaderFailoverAfterPartitionTest.test-seed#[62B63AF65123CE48]) [    ] o.a.s.c.AbstractZkTestCase put C:\Users\jenkins\workspace\Lucene-Solr-6.x-Windows\solr\core\src\test-files\solr\collection1\conf\solrconfig.snippet.randomindexconfig.xml to /configs/conf1/solrconfig.snippet.randomindexconfig.xml
   [junit4]   2> 109458 INFO  (TEST-LeaderFailoverAfterPartitionTest.test-seed#[62B63AF65123CE48]) [    ] o.a.s.c.c.SolrZkClient makePath: /configs/conf1/solrconfig.snippet.randomindexconfig.xml
   [junit4]   2> 109460 INFO  (TEST-LeaderFailoverAfterPartitionTest.test-seed#[62B63AF65123CE48]) [    ] o.a.s.c.AbstractZkTestCase put C:\Users\jenkins\workspace\Lucene-Solr-6.x-Windows\solr\core\src\test-files\solr\collection1\conf\stopwords.txt to /configs/conf1/stopwords.txt
   [junit4]   2> 109460 INFO  (TEST-LeaderFailoverAfterPartitionTest.test-seed#[62B63AF65123CE48]) [    ] o.a.s.c.c.SolrZkClient makePath: /configs/conf1/stopwords.txt
   [junit4]   2> 109463 INFO  (TEST-LeaderFailoverAfterPartitionTest.test-seed#[62B63AF65123CE48]) [    ] o.a.s.c.AbstractZkTestCase put C:\Users\jenkins\workspace\Lucene-Solr-6.x-Windows\solr\core\src\test-files\solr\collection1\conf\protwords.txt to /configs/conf1/protwords.txt
   [junit4]   2> 109464 INFO  (TEST-LeaderFailoverAfterPartitionTest.test-seed#[62B63AF65123CE48]) [    ] o.a.s.c.c.SolrZkClient makePath: /configs/conf1/protwords.txt
   [junit4]   2> 109465 INFO  (TEST-LeaderFailoverAfterPartitionTest.test-seed#[62B63AF65123CE48]) [    ] o.a.s.c.AbstractZkTestCase put C:\Users\jenkins\workspace\Lucene-Solr-6.x-Windows\solr\core\src\test-files\solr\collection1\conf\currency.xml to /configs/conf1/currency.xml
   [junit4]   2> 109466 INFO  (TEST-LeaderFailoverAfterPartitionTest.test-seed#[62B63AF65123CE48]) [    ] o.a.s.c.c.SolrZkClient makePath: /configs/conf1/currency.xml
   [junit4]   2> 109469 INFO  (TEST-LeaderFailoverAfterPartitionTest.test-seed#[62B63AF65123CE48]) [    ] o.a.s.c.AbstractZkTestCase put C:\Users\jenkins\workspace\Lucene-Solr-6.x-Windows\solr\core\src\test-files\solr\collection1\conf\enumsConfig.xml to /configs/conf1/enumsConfig.xml
   [junit4]   2> 109469 INFO  (TEST-LeaderFailoverAfterPartitionTest.test-seed#[62B63AF65123CE48]) [    ] o.a.s.c.c.SolrZkClient makePath: /configs/conf1/enumsConfig.xml
   [junit4]   2> 109471 INFO  (TEST-LeaderFailoverAfterPartitionTest.test-seed#[62B63AF65123CE48]) [    ] o.a.s.c.AbstractZkTestCase put C:\Users\jenkins\workspace\Lucene-Solr-6.x-Windows\solr\core\src\test-files\solr\collection1\conf\open-exchange-rates.json to /configs/conf1/open-exchange-rates.json
   [junit4]   2> 109472 INFO  (TEST-LeaderFailoverAfterPartitionTest.test-seed#[62B63AF65123CE48]) [    ] o.a.s.c.c.SolrZkClient makePath: /configs/conf1/open-exchange-rates.json
   [junit4]   2> 109474 INFO  (TEST-LeaderFailoverAfterPartitionTest.test-seed#[62B63AF65123CE48]) [    ] o.a.s.c.AbstractZkTestCase put C:\Users\jenkins\workspace\Lucene-Solr-6.x-Windows\solr\core\src\test-files\solr\collection1\conf\mapping-ISOLatin1Accent.txt to /configs/conf1/mapping-ISOLatin1Accent.txt
   [junit4]   2> 109474 INFO  (TEST-LeaderFailoverAfterPartitionTest.test-seed#[62B63AF65123CE48]) [    ] o.a.s.c.c.SolrZkClient makePath: /configs/conf1/mapping-ISOLatin1Accent.txt
   [junit4]   2> 109476 INFO  (TEST-LeaderFailoverAfterPartitionTest.test-seed#[62B63AF65123CE48]) [    ] o.a.s.c.AbstractZkTestCase put C:\Users\jenkins\workspace\Lucene-Solr-6.x-Windows\solr\core\src\test-files\solr\collection1\conf\old_synonyms.txt to /configs/conf1/old_synonyms.txt
   [junit4]   2> 109476 INFO  (TEST-LeaderFailoverAfterPartitionTest.test-seed#[62B63AF65123CE48]) [    ] o.a.s.c.c.SolrZkClient makePath: /configs/conf1/old_synonyms.txt
   [junit4]   2> 109478 INFO  (TEST-LeaderFailoverAfterPartitionTest.test-seed#[62B63AF65123CE48]) [    ] o.a.s.c.AbstractZkTestCase put C:\Users\jenkins\workspace\Lucene-Solr-6.x-Windows\solr\core\src\test-files\solr\collection1\conf\synonyms.txt to /configs/conf1/synonyms.txt
   [junit4]   2> 109478 INFO  (TEST-LeaderFailoverAfterPartitionTest.test-seed#[62B63AF65123CE48]) [    ] o.a.s.c.c.SolrZkClient makePath: /configs/conf1/synonyms.txt
   [junit4]   2> 109971 INFO  (TEST-LeaderFailoverAfterPartitionTest.test-seed#[62B63AF65123CE48]) [    ] o.a.s.SolrTestCaseJ4 Writing core.properties file to C:\Users\jenkins\workspace\Lucene-Solr-6.x-Windows\solr\build\solr-core\test\J1\temp\solr.cloud.LeaderFailoverAfterPartitionTest_62B63AF65123CE48-001\control-001\cores\collection1
   [junit4]   2> 109977 INFO  (TEST-LeaderFailoverAfterPartitionTest.test-seed#[62B63AF65123CE48]) [    ] o.e.j.s.Server jetty-9.3.8.v20160314
   [junit4]   2> 109978 INFO  (TEST-LeaderFailoverAfterPartitionTest.test-seed#[62B63AF65123CE48]) [    ] o.e.j.s.h.ContextHandler Started o.e.j.s.ServletContextHandler@1f99e55{/b,null,AVAILABLE}
   [junit4]   2> 109984 INFO  (TEST-LeaderFailoverAfterPartitionTest.test-seed#[62B63AF65123CE48]) [    ] o.e.j.s.ServerConnector Started ServerConnector@4bf3b4{HTTP/1.1,[http/1.1]}{127.0.0.1:62257}
   [junit4]   2> 109984 INFO  (TEST-LeaderFailoverAfterPartitionTest.test-seed#[62B63AF65123CE48]) [    ] o.e.j.s.Server Started @114284ms
   [junit4]   2> 109984 INFO  (TEST-LeaderFailoverAfterPartitionTest.test-seed#[62B63AF65123CE48]) [    ] o.a.s.c.s.e.JettySolrRunner Jetty properties: {solr.data.dir=C:\Users\jenkins\workspace\Lucene-Solr-6.x-Windows\solr\build\solr-core\test\J1\temp\solr.cloud.LeaderFailoverAfterPartitionTest_62B63AF65123CE48-001\tempDir-001/control/data, hostContext=/b, hostPort=62256, coreRootDirectory=C:\Users\jenkins\workspace\Lucene-Solr-6.x-Windows\solr\build\solr-core\test\J1\temp\solr.cloud.LeaderFailoverAfterPartitionTest_62B63AF65123CE48-001\control-001\cores}
   [junit4]   2> 109985 INFO  (TEST-LeaderFailoverAfterPartitionTest.test-seed#[62B63AF65123CE48]) [    ] o.a.s.s.SolrDispatchFilter SolrDispatchFilter.init(): sun.misc.Launcher$AppClassLoader@1d16e93
   [junit4]   2> 109988 INFO  (TEST-LeaderFailoverAfterPartitionTest.test-seed#[62B63AF65123CE48]) [    ] o.a.s.c.SolrResourceLoader new SolrResourceLoader for directory: 'C:\Users\jenkins\workspace\Lucene-Solr-6.x-Windows\solr\build\solr-core\test\J1\temp\solr.cloud.LeaderFailoverAfterPartitionTest_62B63AF65123CE48-001\control-001'
   [junit4]   2> 109988 INFO  (TEST-LeaderFailoverAfterPartitionTest.test-seed#[62B63AF65123CE48]) [    ] o.a.s.c.SolrResourceLoader JNDI not configured for solr (NoInitialContextEx)
   [junit4]   2> 109988 INFO  (TEST-LeaderFailoverAfterPartitionTest.test-seed#[62B63AF65123CE48]) [    ] o.a.s.c.SolrResourceLoader solr home defaulted to 'solr/' (could not find system property or JNDI)
   [junit4]   2> 109989 INFO  (TEST-LeaderFailoverAfterPartitionTest.test-seed#[62B63AF65123CE48]) [    ] o.a.s.c.c.SolrZkClient Using default ZkCredentialsProvider
   [junit4]   2> 109990 INFO  (TEST-LeaderFailoverAfterPartitionTest.test-seed#[62B63AF65123CE48]) [    ] o.a.s.c.c.ConnectionManager Waiting for client to connect to ZooKeeper
   [junit4]   2> 109996 INFO  (zkCallback-143-thread-1) [    ] o.a.s.c.c.ConnectionManager Watcher org.apache.solr.common.cloud.ConnectionManager@17451a5 name:ZooKeeperConnection Watcher:127.0.0.1:62249/solr got event WatchedEvent state:SyncConnected type:None path:null path:null type:None
   [junit4]   2> 109996 INFO  (TEST-LeaderFailoverAfterPartitionTest.test-seed#[62B63AF65123CE48]) [    ] o.a.s.c.c.ConnectionManager Client is connected to ZooKeeper
   [junit4]   2> 109996 INFO  (TEST-LeaderFailoverAfterPartitionTest.test-seed#[62B63AF65123CE48]) [    ] o.a.s.c.c.SolrZkClient Using default ZkACLProvider
   [junit4]   2> 109998 INFO  (TEST-LeaderFailoverAfterPartitionTest.test-seed#[62B63AF65123CE48]) [    ] o.a.s.s.SolrDispatchFilter Loading solr.xml from SolrHome (not found in ZooKeeper)
   [junit4]   2> 109998 INFO  (TEST-LeaderFailoverAfterPartitionTest.test-seed#[62B63AF65123CE48]) [    ] o.a.s.c.SolrXmlConfig Loading container configuration from C:\Users\jenkins\workspace\Lucene-Solr-6.x-Windows\solr\build\solr-core\test\J1\temp\solr.cloud.LeaderFailoverAfterPartitionTest_62B63AF65123CE48-001\control-001\solr.xml
   [junit4]   2> 110009 INFO  (TEST-LeaderFailoverAfterPartitionTest.test-seed#[62B63AF65123CE48]) [    ] o.a.s.c.CorePropertiesLocator Config-defined core root directory: C:\Users\jenkins\workspace\Lucene-Solr-6.x-Windows\solr\build\solr-core\test\J1\temp\solr.cloud.LeaderFailoverAfterPartitionTest_62B63AF65123CE48-001\control-001\cores
   [junit4]   2> 110009 INFO  (TEST-LeaderFailoverAfterPartitionTest.test-seed#[62B63AF65123CE48]) [    ] o.a.s.c.CoreContainer New CoreContainer 30887144
   [junit4]   2> 110009 INFO  (TEST-LeaderFailoverAfterPartitionTest.test-seed#[62B63AF65123CE48]) [    ] o.a.s.c.CoreContainer Loading cores into CoreContainer [instanceDir=C:\Users\jenkins\workspace\Lucene-Solr-6.x-Windows\solr\build\solr-core\test\J1\temp\solr.cloud.LeaderFailoverAfterPartitionTest_62B63AF65123CE48-001\control-001]
   [junit4]   2> 110009 WARN  (TEST-LeaderFailoverAfterPartitionTest.test-seed#[62B63AF65123CE48]) [    ] o.a.s.c.CoreContainer Couldn't add files from C:\Users\jenkins\workspace\Lucene-Solr-6.x-Windows\solr\build\solr-core\test\J1\temp\solr.cloud.LeaderFailoverAfterPartitionTest_62B63AF65123CE48-001\control-001\lib to classpath: C:\Users\jenkins\workspace\Lucene-Solr-6.x-Windows\solr\build\solr-core\test\J1\temp\solr.cloud.LeaderFailoverAfterPartitionTest_62B63AF65123CE48-001\control-001\lib
   [junit4]   2> 110010 INFO  (TEST-LeaderFailoverAfterPartitionTest.test-seed#[62B63AF65123CE48]) [    ] o.a.s.h.c.HttpShardHandlerFactory created with socketTimeout : 90000,urlScheme : ,connTimeout : 15000,maxConnectionsPerHost : 20,maxConnections : 10000,corePoolSize : 0,maximumPoolSize : 2147483647,maxThreadIdleTime : 5,sizeOfQueue : -1,fairnessPolicy : false,useRetries : false,connectionsEvictorSleepDelay : 5000,maxConnectionIdleTime : 40000,
   [junit4]   2> 110014 INFO  (TEST-LeaderFailoverAfterPartitionTest.test-seed#[62B63AF65123CE48]) [    ] o.a.s.u.UpdateShardHandler Creating UpdateShardHandler HTTP client with params: socketTimeout=340000&connTimeout=45000&retry=true
   [junit4]   2> 110014 INFO  (TEST-LeaderFailoverAfterPartitionTest.test-seed#[62B63AF65123CE48]) [    ] o.a.s.l.LogWatcher SLF4J impl is org.slf4j.impl.Log4jLoggerFactory
   [junit4]   2> 110014 INFO  (TEST-LeaderFailoverAfterPartitionTest.test-seed#[62B63AF65123CE48]) [    ] o.a.s.l.LogWatcher Registering Log Listener [Log4j (org.slf4j.impl.Log4jLoggerFactory)]
   [junit4]   2> 110014 INFO  (TEST-LeaderFailoverAfterPartitionTest.test-seed#[62B63AF65123CE48]) [    ] o.a.s.c.ZkContainer Zookeeper client=127.0.0.1:62249/solr
   [junit4]   2> 110015 INFO  (TEST-LeaderFailoverAfterPartitionTest.test-seed#[62B63AF65123CE48]) [    ] o.a.s.c.ZkController zkHost includes chroot
   [junit4]   2> 110015 INFO  (TEST-LeaderFailoverAfterPartitionTest.test-seed#[62B63AF65123CE48]) [    ] o.a.s.c.c.SolrZkClient Using default ZkCredentialsProvider
   [junit4]   2> 110016 INFO  (TEST-LeaderFailoverAfterPartitionTest.test-seed#[62B63AF65123CE48]) [    ] o.a.s.c.c.ConnectionManager Waiting for client to connect to ZooKeeper
   [junit4]   2> 110018 INFO  (zkCallback-146-thread-1) [    ] o.a.s.c.c.ConnectionManager Watcher org.apache.solr.common.cloud.ConnectionManager@5480cc name:ZooKeeperConnection Watcher:127.0.0.1:62249 got event WatchedEvent state:SyncConnected type:None path:null path:null type:None
   [junit4]   2> 110019 INFO  (TEST-LeaderFailoverAfterPartitionTest.test-seed#[62B63AF65123CE48]) [    ] o.a.s.c.c.ConnectionManager Client is connected to ZooKeeper
   [junit4]   2> 110019 INFO  (TEST-LeaderFailoverAfterPartitionTest.test-seed#[62B63AF65123CE48]) [    ] o.a.s.c.c.SolrZkClient Using default ZkACLProvider
   [junit4]   2> 110020 WARN  (NIOServerCxn.Factory:0.0.0.0/0.0.0.0:0) [    ] o.a.z.s.NIOServerCnxn caught end of stream exception
   [junit4]   2> EndOfStreamException: Unable to read additional data from client sessionid 0x15747ed5a220003, likely client has closed socket
   [junit4]   2> 	at org.apache.zookeeper.server.NIOServerCnxn.doIO(NIOServerCnxn.java:228)
   [junit4]   2> 	at org.apache.zookeeper.server.NIOServerCnxnFactory.run(NIOServerCnxnFactory.java:208)
   [junit4]   2> 	at java.lang.Thread.run(Thread.java:745)
   [junit4]   2> 110021 INFO  (TEST-LeaderFailoverAfterPartitionTest.test-seed#[62B63AF65123CE48]) [n:127.0.0.1:62256_b    ] o.a.s.c.ZkController Added new OnReconnect listener org.apache.solr.cloud.ZkController$$Lambda$69/13391062@139c92b
   [junit4]   2> 110022 INFO  (TEST-LeaderFailoverAfterPartitionTest.test-seed#[62B63AF65123CE48]) [n:127.0.0.1:62256_b    ] o.a.s.c.c.ConnectionManager Waiting for client to connect to ZooKeeper
   [junit4]   2> 110024 INFO  (zkCallback-147-thread-1-processing-n:127.0.0.1:62256_b) [n:127.0.0.1:62256_b    ] o.a.s.c.c.ConnectionManager Watcher org.apache.solr.common.cloud.ConnectionManager@c6dfe5 name:ZooKeeperConnection Watcher:127.0.0.1:62249/solr got event WatchedEvent state:SyncConnected type:None path:null path:null type:None
   [junit4]   2> 110024 INFO  (TEST-LeaderFailoverAfterPartitionTest.test-seed#[62B63AF65123CE48]) [n:127.0.0.1:62256_b    ] o.a.s.c.c.ConnectionManager Client is connected to ZooKeeper
   [junit4]   2> 110025 INFO  (TEST-LeaderFailoverAfterPartitionTest.test-seed#[62B63AF65123CE48]) [n:127.0.0.1:62256_b    ] o.a.s.c.c.SolrZkClient makePath: /overseer/queue
   [junit4]   2> 110028 INFO  (TEST-LeaderFailoverAfterPartitionTest.test-seed#[62B63AF65123CE48]) [n:127.0.0.1:62256_b    ] o.a.s.c.c.SolrZkClient makePath: /overseer/collection-queue-work
   [junit4]   2> 110032 INFO  (TEST-LeaderFailoverAfterPartitionTest.test-seed#[62B63AF65123CE48]) [n:127.0.0.1:62256_b    ] o.a.s.c.c.SolrZkClient makePath: /overseer/collection-map-running
   [junit4]   2> 110035 INFO  (TEST-LeaderFailoverAfterPartitionTest.test-seed#[62B63AF65123CE48]) [n:127.0.0.1:62256_b    ] o.a.s.c.c.SolrZkClient makePath: /overseer/collection-map-completed
   [junit4]   2> 110037 INFO  (TEST-LeaderFailoverAfterPartitionTest.test-seed#[62B63AF65123CE48]) [n:127.0.0.1:62256_b    ] o.a.s.c.c.SolrZkClient makePath: /overseer/collection-map-failure
   [junit4]   2> 110039 INFO  (TEST-LeaderFailoverAfterPartitionTest.test-seed#[62B63AF65123CE48]) [n:127.0.0.1:62256_b    ] o.a.s.c.c.SolrZkClient makePath: /live_nodes
   [junit4]   2> 110041 INFO  (TEST-LeaderFailoverAfterPartitionTest.test-seed#[62B63AF65123CE48]) [n:127.0.0.1:62256_b    ] o.a.s.c.c.SolrZkClient makePath: /aliases.json
   [junit4]   2> 110042 INFO  (TEST-LeaderFailoverAfterPartitionTest.test-seed#[62B63AF65123CE48]) [n:127.0.0.1:62256_b    ] o.a.s.c.c.SolrZkClient makePath: /clusterstate.json
   [junit4]   2> 110044 INFO  (TEST-LeaderFailoverAfterPartitionTest.test-seed#[62B63AF65123CE48]) [n:127.0.0.1:62256_b    ] o.a.s.c.c.SolrZkClient makePath: /security.json
   [junit4]   2> 110045 INFO  (TEST-LeaderFailoverAfterPartitionTest.test-seed#[62B63AF65123CE48]) [n:127.0.0.1:62256_b    ] o.a.s.c.c.ZkStateReader Updating cluster state from ZooKeeper... 
   [junit4]   2> 110046 INFO  (TEST-LeaderFailoverAfterPartitionTest.test-seed#[62B63AF65123CE48]) [n:127.0.0.1:62256_b    ] o.a.s.c.c.ZkStateReader Loaded empty cluster properties
   [junit4]   2> 110047 INFO  (TEST-LeaderFailoverAfterPartitionTest.test-seed#[62B63AF65123CE48]) [n:127.0.0.1:62256_b    ] o.a.s.c.c.ZkStateReader Updated live nodes from ZooKeeper... (0) -> (0)
   [junit4]   2> 110050 INFO  (TEST-LeaderFailoverAfterPartitionTest.test-seed#[62B63AF65123CE48]) [n:127.0.0.1:62256_b    ] o.a.s.c.c.SolrZkClient makePath: /overseer_elect
   [junit4]   2> 110052 INFO  (TEST-LeaderFailoverAfterPartitionTest.test-seed#[62B63AF65123CE48]) [n:127.0.0.1:62256_b    ] o.a.s.c.c.SolrZkClient makePath: /overseer_elect/election
   [junit4]   2> 110054 INFO  (TEST-LeaderFailoverAfterPartitionTest.test-seed#[62B63AF65123CE48]) [n:127.0.0.1:62256_b    ] o.a.s.c.Overseer Overseer (id=null) closing
   [junit4]   2> 110054 INFO  (TEST-LeaderFailoverAfterPartitionTest.test-seed#[62B63AF65123CE48]) [n:127.0.0.1:62256_b    ] o.a.s.c.LeaderElector Joined leadership election with path: /overseer_elect/election/96625001756753924-127.0.0.1:62256_b-n_0000000000
   [junit4]   2> 110055 INFO  (TEST-LeaderFailoverAfterPartitionTest.test-seed#[62B63AF65123CE48]) [n:127.0.0.1:62256_b    ] o.a.s.c.OverseerElectionContext I am going to be the leader 127.0.0.1:62256_b
   [junit4]   2> 110055 INFO  (TEST-LeaderFailoverAfterPartitionTest.test-seed#[62B63AF65123CE48]) [n:127.0.0.1:62256_b    ] o.a.s.c.c.SolrZkClient makePath: /overseer_elect/leader
   [junit4]   2> 110056 INFO  (TEST-LeaderFailoverAfterPartitionTest.test-seed#[62B63AF65123CE48]) [n:127.0.0.1:62256_b    ] o.a.s.c.Overseer Overseer (id=96625001756753924-127.0.0.1:62256_b-n_0000000000) starting
   [junit4]   2> 110058 INFO  (TEST-LeaderFailoverAfterPartitionTest.test-seed#[62B63AF65123CE48]) [n:127.0.0.1:62256_b    ] o.a.s.c.c.SolrZkClient makePath: /overseer/queue-work
   [junit4]   2> 110065 INFO  (TEST-LeaderFailoverAfterPartitionTest.test-seed#[62B63AF65123CE48]) [n:127.0.0.1:62256_b    ] o.a.s.c.OverseerAutoReplicaFailoverThread Starting OverseerAutoReplicaFailoverThread autoReplicaFailoverWorkLoopDelay=10000 autoReplicaFailoverWaitAfterExpiration=10000 autoReplicaFailoverBadNodeExpiration=60000
   [junit4]   2> 110066 INFO  (TEST-LeaderFailoverAfterPartitionTest.test-seed#[62B63AF65123CE48]) [n:127.0.0.1:62256_b    ] o.a.s.c.ZkController Register node as live in ZooKeeper:/live_nodes/127.0.0.1:62256_b
   [junit4]   2> 110066 INFO  (TEST-LeaderFailoverAfterPartitionTest.test-seed#[62B63AF65123CE48]) [n:127.0.0.1:62256_b    ] o.a.s.c.c.SolrZkClient makePath: /live_nodes/127.0.0.1:62256_b
   [junit4]   2> 110070 INFO  (zkCallback-147-thread-1-processing-n:127.0.0.1:62256_b) [n:127.0.0.1:62256_b    ] o.a.s.c.c.ZkStateReader A live node change: [WatchedEvent state:SyncConnected type:NodeChildrenChanged path:/live_nodes], has occurred - updating... (live nodes size: [0])
   [junit4]   2> 110107 INFO  (TEST-LeaderFailoverAfterPartitionTest.test-seed#[62B63AF65123CE48]) [n:127.0.0.1:62256_b    ] o.a.s.c.CoreContainer Security conf doesn't exist. Skipping setup for authorization module.
   [junit4]   2> 110107 INFO  (TEST-LeaderFailoverAfterPartitionTest.test-seed#[62B63AF65123CE48]) [n:127.0.0.1:62256_b    ] o.a.s.c.CoreContainer No authentication plugin used.
   [junit4]   2> 110108 INFO  (TEST-LeaderFailoverAfterPartitionTest.test-seed#[62B63AF65123CE48]) [n:127.0.0.1:62256_b    ] o.a.s.c.CorePropertiesLocator Looking for core definitions underneath C:\Users\jenkins\workspace\Lucene-Solr-6.x-Windows\solr\build\solr-core\test\J1\temp\solr.cloud.LeaderFailoverAfterPartitionTest_62B63AF65123CE48-001\control-001\cores
   [junit4]   2> 110109 INFO  (TEST-LeaderFailoverAfterPartitionTest.test-seed#[62B63AF65123CE48]) [n:127.0.0.1:62256_b    ] o.a.s.c.CoreDescriptor Created CoreDescriptor: {name=collection1, config=solrconfig.xml, transient=false, schema=schema.xml, loadOnStartup=true, configSetProperties=configsetprops.json, collection=control_collection, coreNodeName=, dataDir=data\, shard=}
   [junit4]   2> 110110 INFO  (TEST-LeaderFailoverAfterPartitionTest.test-seed#[62B63AF65123CE48]) [n:127.0.0.1:62256_b    ] o.a.s.c.CorePropertiesLocator Found core collection1 in C:\Users\jenkins\workspace\Lucene-Solr-6.x-Windows\solr\build\solr-core\test\J1\temp\solr.cloud.LeaderFailoverAfterPartitionTest_62B63AF65123CE48-001\control-001\cores\collection1
   [junit4]   2> 110110 INFO  (TEST-LeaderFailoverAfterPartitionTest.test-seed#[62B63AF65123CE48]) [n:127.0.0.1:62256_b    ] o.a.s.c.CorePropertiesLocator Found 1 core definitions
   [junit4]   2> 110111 INFO  (OverseerCollectionConfigSetProcessor-96625001756753924-127.0.0.1:62256_b-n_0000000000) [n:127.0.0.1:62256_b    ] o.a.s.c.OverseerTaskProcessor Process current queue of overseer operations
   [junit4]   2> 110112 INFO  (TEST-LeaderFailoverAfterPartitionTest.test-seed#[62B63AF65123CE48]) [n:127.0.0.1:62256_b    ] o.a.s.s.SolrDispatchFilter user.dir=C:\Users\jenkins\workspace\Lucene-Solr-6.x-Windows\solr\build\solr-core\test\J1
   [junit4]   2> 110112 INFO  (TEST-LeaderFailoverAfterPartitionTest.test-seed#[62B63AF65123CE48]) [n:127.0.0.1:62256_b    ] o.a.s.s.SolrDispatchFilter SolrDispatchFilter.init() done
   [junit4]   2> 110115 INFO  (zkCallback-147-thread-1-processing-n:127.0.0.1:62256_b) [n:127.0.0.1:62256_b    ] o.a.s.c.c.ZkStateReader Updated live nodes from ZooKeeper... (0) -> (1)
   [junit4]   2> 110116 INFO  (OverseerStateUpdate-96625001756753924-127.0.0.1:62256_b-n_0000000000) [n:127.0.0.1:62256_b    ] o.a.s.c.Overseer Starting to work on the main queue
   [junit4]   2> 110117 INFO  (coreLoadExecutor-344-thread-1-processing-n:127.0.0.1:62256_b) [n:127.0.0.1:62256_b c:control_collection   x:collection1] o.a.s.c.ZkController publishing state=down
   [junit4]   2> 110117 INFO  (coreLoadExecutor-344-thread-1-processing-n:127.0.0.1:62256_b) [n:127.0.0.1:62256_b c:control_collection   x:collection1] o.a.s.c.ZkController numShards not found on descriptor - reading it from system property
   [junit4]   2> 110122 INFO  (coreLoadExecutor-344-thread-1-processing-n:127.0.0.1:62256_b) [n:127.0.0.1:62256_b c:control_collection   x:collection1] o.a.s.c.ZkController Collection control_collection not visible yet, but flagging it so a watch is registered when it becomes visible
   [junit4]   2> 110122 INFO  (OverseerStateUpdate-96625001756753924-127.0.0.1:62256_b-n_0000000000) [n:127.0.0.1:62256_b    ] o.a.s.c.c.ZkStateReader Updated live nodes from ZooKeeper... (1) -> (1)
   [junit4]   2> 110124 INFO  (coreLoadExecutor-344-thread-1-processing-n:127.0.0.1:62256_b) [n:127.0.0.1:62256_b c:control_collection   x:collection1] o.a.s.c.c.ZkStateReader Deleting data for [control_collection]
   [junit4]   2> 110126 INFO  (OverseerStateUpdate-96625001756753924-127.0.0.1:62256_b-n_0000000000) [n:127.0.0.1:62256_b    ] o.a.s.c.Overseer processMessage: queueSize: 1, message = {
   [junit4]   2>   "core":"collection1",
   [junit4]   2>   "roles":null,
   [junit4]   2>   "base_url":"http://127.0.0.1:62256/b",
   [junit4]   2>   "node_name":"127.0.0.1:62256_b",
   [junit4]   2>   "numShards":"1",
   [junit4]   2>   "state":"down",
   [junit4]   2>   "shard":null,
   [junit4]   2>   "collection":"control_collection",
   [junit4]   2>   "operation":"state"} current state version: 0
   [junit4]   2> 110126 INFO  (OverseerStateUpdate-96625001756753924-127.0.0.1:62256_b-n_0000000000) [n:127.0.0.1:62256_b    ] o.a.s.c.o.ReplicaMutator Update state numShards=1 message={
   [junit4]   2>   "core":"collection1",
   [junit4]   2>   "roles":null,
   [junit4]   2>   "base_url":"http://127.0.0.1:62256/b",
   [junit4]   2>   "node_name":"127.0.0.1:62256_b",
   [junit4]   2>   "numShards":"1",
   [junit4]   2>   "state":"down",
   [junit4]   2>   "shard":null,
   [junit4]   2>   "collection":"control_collection",
   [junit4]   2>   "operation":"state"}
   [junit4]   2> 110127 INFO  (coreLoadExecutor-344-thread-1-processing-n:127.0.0.1:62256_b) [n:127.0.0.1:62256_b c:control_collection   x:collection1] o.a.s.c.ZkController look for our core node name
   [junit4]   2> 110127 INFO  (OverseerStateUpdate-96625001756753924-127.0.0.1:62256_b-n_0000000000) [n:127.0.0.1:62256_b    ] o.a.s.c.o.ClusterStateMutator building a new cName: control_collection
   [junit4]   2> 110128 INFO  (OverseerStateUpdate-96625001756753924-127.0.0.1:62256_b-n_0000000000) [n:127.0.0.1:62256_b    ] o.a.s.c.o.ReplicaMutator Assigning new node to shard shard=shard1
   [junit4]   2> 110129 INFO  (zkCallback-147-thread-1-processing-n:127.0.0.1:62256_b) [n:127.0.0.1:62256_b    ] o.a.s.c.c.ZkStateReader A cluster state change: [WatchedEvent state:SyncConnected type:NodeDataChanged path:/clusterstate.json], has occurred - updating... (live nodes size: [1])
   [junit4]   2> 111128 INFO  (coreLoadExecutor-344-thread-1-processing-n:127.0.0.1:62256_b) [n:127.0.0.1:62256_b c:control_collection   x:collection1] o.a.s.c.ZkController waiting to find shard id in clusterstate for collection1
   [junit4]   2> 111128 INFO  (coreLoadExecutor-344-thread-1-processing-n:127.0.0.1:62256_b) [n:127.0.0.1:62256_b c:control_collection   x:collection1] o.a.s.c.ZkController Check for collection zkNode:control_collection
   [junit4]   2> 111128 INFO  (coreLoadExecutor-344-thread-1-processing-n:127.0.0.1:62256_b) [n:127.0.0.1:62256_b c:control_collection   x:collection1] o.a.s.c.ZkController Collection zkNode exists
   [junit4]   2> 111129 INFO  (coreLoadExecutor-344-thread-1-processing-n:127.0.0.1:62256_b) [n:127.0.0.1:62256_b c:control_collection   x:collection1] o.a.s.c.SolrResourceLoader new SolrResourceLoader for directory: 'C:\Users\jenkins\workspace\Lucene-Solr-6.x-Windows\solr\build\solr-core\test\J1\temp\solr.cloud.LeaderFailoverAfterPartitionTest_62B63AF65123CE48-001\control-001\cores\collection1'
   [junit4]   2> 111129 INFO  (coreLoadExecutor-344-thread-1-processing-n:127.0.0.1:62256_b) [n:127.0.0.1:62256_b c:control_collection   x:collection1] o.a.s.c.SolrResourceLoader JNDI not configured for solr (NoInitialContextEx)
   [junit4]   2> 111129 INFO  (coreLoadExecutor-344-thread-1-processing-n:127.0.0.1:62256_b) [n:127.0.0.1:62256_b c:control_collection   x:collection1] o.a.s.c.SolrResourceLoader solr home defaulted to 'solr/' (could not find system property or JNDI)
   [junit4]   2> 111134 INFO  (coreLoadExecutor-344-thread-1-processing-n:127.0.0.1:62256_b) [n:127.0.0.1:62256_b c:control_collection   x:collection1] o.a.s.c.Config loaded config solrconfig.xml with version 0 
   [junit4]   2> 111147 INFO  (coreLoadExecutor-344-thread-1-processing-n:127.0.0.1:62256_b) [n:127.0.0.1:62256_b c:control_collection   x:collection1] o.a.s.c.SolrConfig current version of requestparams : -1
   [junit4]   2> 111150 INFO  (coreLoadExecutor-344-thread-1-processing-n:127.0.0.1:62256_b) [n:127.0.0.1:62256_b c:control_collection   x:collection1] o.a.s.c.SolrConfig Using Lucene MatchVersion: 6.3.0
   [junit4]   2> 111162 INFO  (coreLoadExecutor-344-thread-1-processing-n:127.0.0.1:62256_b) [n:127.0.0.1:62256_b c:control_collection   x:collection1] o.a.s.c.SolrConfig Loaded SolrConfig: solrconfig.xml
   [junit4]   2> 111171 INFO  (coreLoadExecutor-344-thread-1-processing-n:127.0.0.1:62256_b) [n:127.0.0.1:62256_b c:control_collection   x:collection1] o.a.s.s.IndexSchema [collection1] Schema name=test
   [junit4]   2> 111280 INFO  (coreLoadExecutor-344-thread-1-processing-n:127.0.0.1:62256_b) [n:127.0.0.1:62256_b c:control_collection   x:collection1] o.a.s.s.OpenExchangeRatesOrgProvider Initialized with rates=open-exchange-rates.json, refreshInterval=1440.
   [junit4]   2> 111290 INFO  (coreLoadExecutor-344-thread-1-processing-n:127.0.0.1:62256_b) [n:127.0.0.1:62256_b c:control_collection   x:collection1] o.a.s.s.IndexSchema default search field in schema is text
   [junit4]   2> 111291 INFO  (coreLoadExecutor-344-thread-1-processing-n:127.0.0.1:62256_b) [n:127.0.0.1:62256_b c:control_collection   x:collection1] o.a.s.s.IndexSchema unique key field: id
   [junit4]   2> 111317 INFO  (coreLoadExecutor-344-thread-1-processing-n:127.0.0.1:62256_b) [n:127.0.0.1:62256_b c:control_collection   x:collection1] o.a.s.s.FileExchangeRateProvider Reloading exchange rates from file currency.xml
   [junit4]   2> 111320 INFO  (coreLoadExecutor-344-thread-1-processing-n:127.0.0.1:62256_b) [n:127.0.0.1:62256_b c:control_collection   x:collection1] o.a.s.s.FileExchangeRateProvider Reloading exchange rates from file currency.xml
   [junit4]   2> 111323 INFO  (coreLoadExecutor-344-thread-1-processing-n:127.0.0.1:62256_b) [n:127.0.0.1:62256_b c:control_collection   x:collection1] o.a.s.s.OpenExchangeRatesOrgProvider Reloading exchange rates from open-exchange-rates.json
   [junit4]   2> 111324 INFO  (coreLoadExecutor-344-thread-1-processing-n:127.0.0.1:62256_b) [n:127.0.0.1:62256_b c:control_collection   x:collection1] o.a.s.s.OpenExchangeRatesOrgProvider Reloading exchange rates from open-exchange-rates.json
   [junit4]   2> 111329 INFO  (coreLoadExecutor-344-thread-1-processing-n:127.0.0.1:62256_b) [n:127.0.0.1:62256_b c:control_collection   x:collection1] o.a.s.c.ConfigSetProperties Did not find ConfigSet properties, assuming default properties: Can't find resource 'configsetprops.json' in classpath or '/configs/conf1', cwd=C:\Users\jenkins\workspace\Lucene-Solr-6.x-Windows\solr\build\solr-core\test\J1
   [junit4]   2> 111329 INFO  (coreLoadExecutor-344-thread-1-processing-n:127.0.0.1:62256_b) [n:127.0.0.1:62256_b c:control_collection   x:collection1] o.a.s.c.CoreContainer Creating SolrCore 'collection1' using configuration from collection control_collection
   [junit4]   2> 111329 INFO  (coreLoadExecutor-344-thread-1-processing-n:127.0.0.1:62256_b) [n:127.0.0.1:62256_b c:control_collection s:shard1 r:core_node1 x:collection1] o.a.s.c.SolrCore org.apache.solr.core.MockDirectoryFactory
   [junit4]   2> 111330 INFO  (coreLoadExecutor-344-thread-1-processing-n:127.0.0.1:62256_b) [n:127.0.0.1:62256_b c:control_collection s:shard1 r:core_node1 x:collection1] o.a.s.c.SolrCore [[collection1] ] Opening new SolrCore at [C:\Users\jenkins\workspace\Lucene-Solr-6.x-Windows\solr\build\solr-core\test\J1\temp\solr.cloud.LeaderFailoverAfterPartitionTest_62B63AF65123CE48-001\control-001\cores\collection1], dataDir=[C:\Users\jenkins\workspace\Lucene-Solr-6.x-Windows\solr\build\solr-core\test\J1\temp\solr.cloud.LeaderFailoverAfterPartitionTest_62B63AF65123CE48-001\control-001\cores\collection1\data\]
   [junit4]   2> 111330 INFO  (coreLoadExecutor-344-thread-1-processing-n:127.0.0.1:62256_b) [n:127.0.0.1:62256_b c:control_collection s:shard1 r:core_node1 x:collection1] o.a.s.c.JmxMonitoredMap JMX monitoring is enabled. Adding Solr mbeans to JMX Server: com.sun.jmx.mbeanserver.JmxMBeanServer@13c34a8
   [junit4]   2> 111331 INFO  (coreLoadExecutor-344-thread-1-processing-n:127.0.0.1:62256_b) [n:127.0.0.1:62256_b c:control_collection s:shard1 r:core_node1 x:collection1] o.a.s.c.CachingDirectoryFactory return new directory for C:\Users\jenkins\workspace\Lucene-Solr-6.x-Windows\solr\build\solr-core\test\J1\temp\solr.cloud.LeaderFailoverAfterPartitionTest_62B63AF65123CE48-001\control-001\cores\collection1\data\snapshot_metadata
   [junit4]   2> 111331 INFO  (coreLoadExecutor-344-thread-1-processing-n:127.0.0.1:62256_b) [n:127.0.0.1:62256_b c:control_collection s:shard1 r:core_node1 x:collection1] o.a.s.c.s.SolrSnapshotMetaDataManager Loading from snapshot metadata file...
   [junit4]   2> 111331 INFO  (coreLoadExecutor-344-thread-1-processing-n:127.0.0.1:62256_b) [n:127.0.0.1:62256_b c:control_collection s:shard1 r:core_node1 x:collection1] o.a.s.c.CachingDirectoryFactory return new directory for C:\Users\jenkins\workspace\Lucene-Solr-6.x-Windows\solr\build\solr-core\test\J1\temp\solr.cloud.LeaderFailoverAfterPartitionTest_62B63AF65123CE48-001\control-001\cores\collection1\data\
   [junit4]   2> 111331 INFO  (coreLoadExecutor-344-thread-1-processing-n:127.0.0.1:62256_b) [n:127.0.0.1:62256_b c:control_collection s:shard1 r:core_node1 x:collection1] o.a.s.c.SolrCore New index directory detected: old=null new=C:\Users\jenkins\workspace\Lucene-Solr-6.x-Windows\solr\build\solr-core\test\J1\temp\solr.cloud.LeaderFailoverAfterPartitionTest_62B63AF65123CE48-001\control-001\cores\collection1\data\index/
   [junit4]   2> 111331 WARN  (coreLoadExecutor-344-thread-1-processing-n:127.0.0.1:62256_b) [n:127.0.0.1:62256_b c:control_collection s:shard1 r:core_node1 x:collection1] o.a.s.c.SolrCore [collection1] Solr index directory 'C:\Users\jenkins\workspace\Lucene-Solr-6.x-Windows\solr\build\solr-core\test\J1\temp\solr.cloud.LeaderFailoverAfterPartitionTest_62B63AF65123CE48-001\control-001\cores\collection1\data\index' doesn't exist. Creating new index...
   [junit4]   2> 111332 INFO  (coreLoadExecutor-344-thread-1-processing-n:127.0.0.1:62256_b) [n:127.0.0.1:62256_b c:control_collection s:shard1 r:core_node1 x:collection1] o.a.s.c.CachingDirectoryFactory return new directory for C:\Users\jenkins\workspace\Lucene-Solr-6.x-Windows\solr\build\solr-core\test\J1\temp\solr.cloud.LeaderFailoverAfterPartitionTest_62B63AF65123CE48-001\control-001\cores\collection1\data\index
   [junit4]   2> 111333 INFO  (coreLoadExecutor-344-thread-1-processing-n:127.0.0.1:62256_b) [n:127.0.0.1:62256_b c:control_collection s:shard1 r:core_node1 x:collection1] o.a.s.u.RandomMergePolicy RandomMergePolicy wrapping class org.apache.lucene.index.TieredMergePolicy: [TieredMergePolicy: maxMergeAtOnce=33, maxMergeAtOnceExplicit=42, maxMergedSegmentMB=87.9189453125, floorSegmentMB=1.07421875, forceMergeDeletesPctAllowed=23.49388174833842, segmentsPerTier=15.0, maxCFSSegmentSizeMB=8.796093022207999E12, noCFSRatio=1.0
   [junit4]   2> 111349 INFO  (coreLoadExecutor-344-thread-1-processing-n:127.0.0.1:62256_b) [n:127.0.0.1:62256_b c:control_collection s:shard1 r:core_node1 x:collection1] o.a.s.c.SolrDeletionPolicy SolrDeletionPolicy.onCommit: commits: num=1
   [junit4]   2> 	commit{dir=MockDirectoryWrapper(RAMDirectory@f0969f lockFactory=org.apache.lucene.store.SingleInstanceLockFactory@1f1e23e),segFN=segments_1,generation=1}
   [junit4]   2> 111349 INFO  (coreLoadExecutor-344-thread-1-processing-n:127.0.0.1:62256_b) [n:127.0.0.1:62256_b c:control_collection s:shard1 r:core_node1 x:collection1] o.a.s.c.SolrDeletionPolicy newest commit generation = 1
   [junit4]   2> 111351 INFO  (coreLoadExecutor-344-thread-1-processing-n:127.0.0.1:62256_b) [n:127.0.0.1:62256_b c:control_collection s:shard1 r:core_node1 x:collection1] o.a.s.u.p.UpdateRequestProcessorChain creating updateRequestProcessorChain "nodistrib"
   [junit4]   2> 111351 INFO  (coreLoadExecutor-344-thread-1-processing-n:127.0.0.1:62256_b) [n:127.0.0.1:62256_b c:control_collection s:shard1 r:core_node1 x:collection1] o.a.s.u.p.UpdateRequestProcessorChain creating updateRequestProcessorChain "dedupe"
   [junit4]   2> 111351 INFO  (coreLoadExecutor-344-thread-1-processing-n:127.0.0.1:62256_b) [n:127.0.0.1:62256_b c:control_collection s:shard1 r:core_node1 x:collection1] o.a.s.u.p.UpdateRequestProcessorChain inserting DistributedUpdateProcessorFactory into updateRequestProcessorChain "dedupe"
   [junit4]   2> 111351 INFO  (coreLoadExecutor-344-thread-1-processing-n:127.0.0.1:62256_b) [n:127.0.0.1:62256_b c:control_collection s:shard1 r:core_node1 x:collection1] o.a.s.u.p.UpdateRequestProcessorChain creating updateRequestProcessorChain "stored_sig"
   [junit4]   2> 111351 INFO  (coreLoadExecutor-344-thread-1-processing-n:127.0.0.1:62256_b) [n:127.0.0.1:62256_b c:control_collection s:shard1 r:core_node1 x:collection1] o.a.s.u.p.UpdateRequestProcessorChain inserting DistributedUpdateProcessorFactory into updateRequestProcessorChain "stored_sig"
   [junit4]   2> 111351 INFO  (coreLoadExecutor-344-thread-1-processing-n:127.0.0.1:62256_b) [n:127.0.0.1:62256_b c:control_collection s:shard1 r:core_node1 x:collection1] o.a.s.u.p.UpdateRequestProcessorChain creating updateRequestProcessorChain "distrib-dup-test-chain-explicit"
   [junit4]   2> 111351 INFO  (coreLoadExecutor-344-thread-1-processing-n:127.0.0.1:62256_b) [n:127.0.0.1:62256_b c:control_collection s:shard1 r:core_node1 x:collection1] o.a.s.u.p.UpdateRequestProcessorChain creating updateRequestProcessorChain "distrib-dup-test-chain-implicit"
   [junit4]   2> 111352 INFO  (coreLoadExecutor-344-thread-1-processing-n:127.0.0.1:62256_b) [n:127.0.0.1:62256_b c:control_collection s:shard1 r:core_node1 x:collection1] o.a.s.u.p.UpdateRequestProcessorChain inserting DistributedUpdateProcessorFactory into updateRequestProcessorChain "distrib-dup-test-chain-implicit"
   [junit4]   2> 111352 INFO  (coreLoadExecutor-344-thread-1-processing-n:127.0.0.1:62256_b) [n:127.0.0.1:62256_b c:control_collection s:shard1 r:core_node1 x:collection1] o.a.s.c.SolrCore no updateRequestProcessorChain defined as default, creating implicit default
   [junit4]   2> 111357 WARN  (coreLoadExecutor-344-thread-1-processing-n:127.0.0.1:62256_b) [n:127.0.0.1:62256_b c:control_collection s:shard1 r:core_node1 x:collection1] o.a.s.c.RequestHandlers INVALID paramSet a in requestHandler {type = requestHandler,name = /dump,class = DumpRequestHandler,args = {defaults={a=A,b=B}}}
   [junit4]   2> 111359 INFO  (OldIndexDirectoryCleanupThreadForCore-collection1) [n:127.0.0.1:62256_b c:control_collection s:shard1 r:core_node1 x:collection1] o.a.s.c.SolrCore Looking for old index directories to cleanup for core collection1 in C:\Users\jenkins\workspace\Lucene-Solr-6.x-Windows\solr\build\solr-core\test\J1\temp\solr.cloud.LeaderFailoverAfterPartitionTest_62B63AF65123CE48-001\control-001\cores\collection1\data\
   [junit4]   2> 111360 WARN  (OldIndexDirectoryCleanupThreadForCore-collection1) [n:127.0.0.1:62256_b c:control_collection s:shard1 r:core_node1 x:collection1] o.a.s.c.DirectoryFactory C:\Users\jenkins\workspace\Lucene-Solr-6.x-Windows\solr\build\solr-core\test\J1\temp\solr.cloud.LeaderFailoverAfterPartitionTest_62B63AF65123CE48-001\control-001\cores\collection1\data\ does not point to a valid data directory; skipping clean-up of old index directories.
   [junit4]   2> 111366 INFO  (coreLoadExecutor-344-thread-1-processing-n:127.0.0.1:62256_b) [n:127.0.0.1:62256_b c:control_collection s:shard1 r:core_node1 x:collection1] o.a.s.h.l.XMLLoader xsltCacheLifetimeSeconds=60
   [junit4]   2> 111368 INFO  (coreLoadExecutor-344-thread-1-processing-n:127.0.0.1:62256_b) [n:127.0.0.1:62256_b c:control_collection s:shard1 r:core_node1 x:collection1] o.a.s.h.l.XMLLoader xsltCacheLifetimeSeconds=60
   [junit4]   2> 111370 INFO  (coreLoadExecutor-344-thread-1-processing-n:127.0.0.1:62256_b) [n:127.0.0.1:62256_b c:control_collection s:shard1 r:core_node1 x:collection1] o.a.s.h.l.XMLLoader xsltCacheLifetimeSeconds=60
   [junit4]   2> 111372 INFO  (coreLoadExecutor-344-thread-1-processing-n:127.0.0.1:62256_b) [n:127.0.0.1:62256_b c:control_collection s:shard1 r:core_node1 x:collection1] o.a.s.h.l.XMLLoader xsltCacheLifetimeSeconds=60
   [junit4]   2> 111393 INFO  (coreLoadExecutor-344-thread-1-processing-n:127.0.0.1:62256_b) [n:127.0.0.1:62256_b c:control_collection s:shard1 r:core_node1 x:collection1] o.a.s.c.RequestHandlers Registered paths: /admin/mbeans,standard,/update/json/docs,/admin/luke,/export,/get,/admin/properties,/update/json,/admin/threads,/dump,/update/csv,/sql,/graph,/admin/segments,/admin/system,/replication,/config,/stream,/schema,/admin/plugins,/admin/logging,/admin/ping,/update,/admin/file,/terms
   [junit4]   2> 111393 INFO  (coreLoadExecutor-344-thread-1-processing-n:127.0.0.1:62256_b) [n:127.0.0.1:62256_b c:control_collection s:shard1 r:core_node1 x:collection1] o.a.s.c.SolrCore Using default statsCache cache: org.apache.solr.search.stats.LocalStatsCache
   [junit4]   2> 111394 INFO  (coreLoadExecutor-344-thread-1-processing-n:127.0.0.1:62256_b) [n:127.0.0.1:62256_b c:control_collection s:shard1 r:core_node1 x:collection1] o.a.s.u.UpdateHandler Using UpdateLog implementation: org.apache.solr.update.UpdateLog
   [junit4]   2> 111394 INFO  (coreLoadExecutor-344-thread-1-processing-n:127.0.0.1:62256_b) [n:127.0.0.1:62256_b c:control_collection s:shard1 r:core_node1 x:collection1] o.a.s.u.UpdateLog Initializing UpdateLog: dataDir= defaultSyncLevel=FLUSH numRecordsToKeep=100 maxNumLogsToKeep=10 numVersionBuckets=65536
   [junit4]   2> 111396 INFO  (coreLoadExecutor-344-thread-1-processing-n:127.0.0.1:62256_b) [n:127.0.0.1:62256_b c:control_collection s:shard1 r:core_node1 x:collection1] o.a.s.u.CommitTracker Hard AutoCommit: disabled
   [junit4]   2> 111396 INFO  (coreLoadExecutor-344-thread-1-processing-n:127.0.0.1:62256_b) [n:127.0.0.1:62256_b c:control_collection s:shard1 r:core_node1 x:collection1] o.a.s.u.CommitTracker Soft AutoCommit: disabled
   [junit4]   2> 111398 INFO  (coreLoadExecutor-344-thread-1-processing-n:127.0.0.1:62256_b) [n:127.0.0.1:62256_b c:control_collection s:shard1 r:core_node1 x:collection1] o.a.s.u.RandomMergePolicy RandomMergePolicy wrapping class org.apache.lucene.index.AlcoholicMergePolicy: [AlcoholicMergePolicy: minMergeSize=0, mergeFactor=10, maxMergeSize=735976568, maxMergeSizeForForcedMerge=9223372036854775807, calibrateSizeByDeletes=true, maxMergeDocs=2147483647, maxCFSSegmentSizeMB=8.796093022207999E12, noCFSRatio=0.1]
   [junit4]   2> 111398 INFO  (coreLoadExecutor-344-thread-1-processing-n:127.0.0.1:62256_b) [n:127.0.0.1:62256_b c:control_collection s:shard1 r:core_node1 x:collection1] o.a.s.c.SolrDeletionPolicy SolrDeletionPolicy.onInit: commits: num=1
   [junit4]   2> 	commit{dir=MockDirectoryWrapper(RAMDirectory@f0969f lockFactory=org.apache.lucene.store.SingleInstanceLockFactory@1f1e23e),segFN=segments_1,generation=1}
   [junit4]   2> 111398 INFO  (coreLoadExecutor-344-thread-1-processing-n:127.0.0.1:62256_b) [n:127.0.0.1:62256_b c:control_collection s:shard1 r:core_node1 x:collection1] o.a.s.c.SolrDeletionPolicy newest commit generation = 1
   [junit4]   2> 111399 INFO  (coreLoadExecutor-344-thread-1-processing-n:127.0.0.1:62256_b) [n:127.0.0.1:62256_b c:control_collection s:shard1 r:core_node1 x:collection1] o.a.s.s.SolrIndexSearcher Opening [Searcher@1a5ba26[collection1] main]
   [junit4]   2> 111401 INFO  (coreLoadExecutor-344-thread-1-processing-n:127.0.0.1:62256_b) [n:127.0.0.1:62256_b c:control_collection s:shard1 r:core_node1 x:collection1] o.a.s.r.ManagedResourceStorage Setting up ZooKeeper-based storage for the RestManager with znodeBase: /configs/conf1
   [junit4]   2> 111401 INFO  (coreLoadExecutor-344-thread-1-processing-n:127.0.0.1:62256_b) [n:127.0.0.1:62256_b c:control_collection s:shard1 r:core_node1 x:collection1] o.a.s.r.ManagedResourceStorage Configured ZooKeeperStorageIO with znodeBase: /configs/conf1
   [junit4]   2> 111401 INFO  (coreLoadExecutor-344-thread-1-processing-n:127.0.0.1:62256_b) [n:127.0.0.1:62256_b c:control_collection s:shard1 r:core_node1 x:collection1] o.a.s.r.RestManager Initializing RestManager with initArgs: {}
   [junit4]   2> 111401 INFO  (coreLoadExecutor-344-thread-1-processing-n:127.0.0.1:62256_b) [n:127.0.0.1:62256_b c:control_collection s:shard1 r:core_node1 x:collection1] o.a.s.r.ManagedResourceStorage Reading _rest_managed.json using ZooKeeperStorageIO:path=/configs/conf1
   [junit4]   2> 111402 INFO  (coreLoadExecutor-344-thread-1-processing-n:127.0.0.1:62256_b) [n:127.0.0.1:62256_b c:control_collection s:shard1 r:core_node1 x:collection1] o.a.s.r.ManagedResourceStorage No data found for znode /configs/conf1/_rest_managed.json
   [junit4]   2> 111402 INFO  (coreLoadExecutor-344-thread-1-processing-n:127.0.0.1:62256_b) [n:127.0.0.1:62256_b c:control_collection s:shard1 r:core_node1 x:collection1] o.a.s.r.ManagedResourceStorage Loaded null at path _rest_managed.json using ZooKeeperStorageIO:path=/configs/conf1
   [junit4]   2> 111402 INFO  (coreLoadExecutor-344-thread-1-processing-n:127.0.0.1:62256_b) [n:127.0.0.1:62256_b c:control_collection s:shard1 r:core_node1 x:collection1] o.a.s.r.RestManager Initializing 0 registered ManagedResources
   [junit4]   2> 111402 INFO  (coreLoadExecutor-344-thread-1-processing-n:127.0.0.1:62256_b) [n:127.0.0.1:62256_b c:control_collection s:shard1 r:core_node1 x:collection1] o.a.s.h.ReplicationHandler Commits will be reserved for  10000
   [junit4]   2> 111403 INFO  (searcherExecutor-346-thread-1-processing-n:127.0.0.1:62256_b x:collection1 s:shard1 c:control_collection r:core_node1) [n:127.0.0.1:62256_b c:control_collection s:shard1 r:core_node1 x:collection1] o.a.s.c.SolrCore [collection1] Registered new searcher Searcher@1a5ba26[collection1] main{ExitableDirectoryReader(UninvertingDirectoryReader())}
   [junit4]   2> 111403 INFO  (coreLoadExecutor-344-thread-1-processing-n:127.0.0.1:62256_b) [n:127.0.0.1:62256_b c:control_collection s:shard1 r:core_node1 x:collection1] o.a.s.u.UpdateLog Looking up max value of version field to seed version buckets
   [junit4]   2> 111403 INFO  (coreLoadExecutor-344-thread-1-processing-n:127.0.0.1:62256_b) [n:127.0.0.1:62256_b c:control_collection s:shard1 r:core_node1 x:collection1] o.a.s.u.VersionInfo Refreshing highest value of _version_ for 65536 version buckets from index
   [junit4]   2> 111403 INFO  (coreLoadExecutor-344-thread-1-processing-n:127.0.0.1:62256_b) [n:127.0.0.1:62256_b c:control_collection s:shard1 r:core_node1 x:collection1] o.a.s.u.VersionInfo No terms found for _version_, cannot seed version bucket highest value from index
   [junit4]   2> 111403 INFO  (coreLoadExecutor-344-thread-1-processing-n:127.0.0.1:62256_b) [n:127.0.0.1:62256_b c:control_collection s:shard1 r:core_node1 x:collection1] o.a.s.u.UpdateLog Could not find max version in index or recent updates, using new clock 1546000030280712192
   [junit4]   2> 111405 INFO  (coreLoadExecutor-344-thread-1-processing-n:127.0.0.1:62256_b) [n:127.0.0.1:62256_b c:control_collection s:shard1 r:core_node1 x:collection1] o.a.s.u.UpdateLog Took 1.0ms to seed version buckets with highest version 1546000030280712192
   [junit4]   2> 111405 INFO  (coreLoadExecutor-344-thread-1-processing-n:127.0.0.1:62256_b) [n:127.0.0.1:62256_b c:control_collection s:shard1 r:core_node1 x:collection1] o.a.s.c.ZkController watch zkdir /configs/conf1
   [junit4]   2> 111406 INFO  (coreLoadExecutor-344-thread-1-processing-n:127.0.0.1:62256_b) [n:127.0.0.1:62256_b c:control_collection s:shard1 r:core_node1 x:collection1] o.a.s.c.CoreContainer registering core: collection1
   [junit4]   2> 111406 INFO  (coreZkRegister-338-thread-1-processing-n:127.0.0.1:62256_b x:collection1 s:shard1 c:control_collection r:core_node1) [n:127.0.0.1:62256_b c:control_collection s:shard1 r:core_node1 x:collection1] o.a.s.c.ZkController Register replica - core:collection1 address:http://127.0.0.1:62256/b collection:control_collection shard:shard1
   [junit4]   2> 111407 INFO  (coreZkRegister-338-thread-1-processing-n:127.0.0.1:62256_b x:collection1 s:shard1 c:control_collection r:core_node1) [n:127.0.0.1:62256_b c:control_collection s:shard1 r:core_node1 x:collection1] o.a.s.c.c.SolrZkClient makePath: /collections/control_collection/leader_elect/shard1/election
   [junit4]   2> 111412 INFO  (coreZkRegister-338-thread-1-processing-n:127.0.0.1:62256_b x:collection1 s:shard1 c:control_collection r:core_node1) [n:127.0.0.1:62256_b c:control_collection s:shard1 r:core_node1 x:collection1] o.a.s.c.LeaderElector Joined leadership election with path: /collections/control_collection/leader_elect/shard1/election/96625001756753924-core_node1-n_0000000000
   [junit4]   2> 111412 INFO  (coreZkRegister-338-thread-1-processing-n:127.0.0.1:62256_b x:collection1 s:shard1 c:control_collection r:core_node1) [n:127.0.0.1:62256_b c:control_collection s:shard1 r:core_node1 x:collection1] o.a.s.c.ShardLeaderElectionContext Running the leader process for shard=shard1 and weAreReplacement=false and leaderVoteWait=10000
   [junit4]   2> 111414 INFO  (coreZkRegister-338-thread-1-processing-n:127.0.0.1:62256_b x:collection1 s:shard1 c:control_collection r:core_node1) [n:127.0.0.1:62256_b c:control_collection s:shard1 r:core_node1 x:collection1] o.a.s.c.ShardLeaderElectionContext Enough replicas found to continue.
   [junit4]   2> 111414 INFO  (coreZkRegister-338-thread-1-processing-n:127.0.0.1:62256_b x:collection1 s:shard1 c:control_collection r:core_node1) [n:127.0.0.1:62256_b c:control_collection s:shard1 r:core_node1 x:collection1] o.a.s.c.ShardLeaderElectionContext I may be the new leader - try and sync
   [junit4]   2> 111414 INFO  (coreZkRegister-338-thread-1-processing-n:127.0.0.1:62256_b x:collection1 s:shard1 c:control_collection r:core_node1) [n:127.0.0.1:62256_b c:control_collection s:shard1 r:core_node1 x:collection1] o.a.s.c.SyncStrategy Sync replicas to http://127.0.0.1:62256/b/collection1/
   [junit4]   2> 111414 INFO  (coreZkRegister-338-thread-1-processing-n:127.0.0.1:62256_b x:collection1 s:shard1 c:control_collection r:core_node1) [n:127.0.0.1:62256_b c:control_collection s:shard1 r:core_node1 x:collection1] o.a.s.c.SyncStrategy Sync Success - now sync replicas to me
   [junit4]   2> 111415 INFO  (coreZkRegister-338-thread-1-processing-n:127.0.0.1:62256_b x:collection1 s:shard1 c:control_collection r:core_node1) [n:127.0.0.1:62256_b c:control_collection s:shard1 r:core_node1 x:collection1] o.a.s.c.SyncStrategy http://127.0.0.1:62256/b/collection1/ has no replicas
   [junit4]   2> 111415 INFO  (OverseerStateUpdate-96625001756753924-127.0.0.1:62256_b-n_0000000000) [n:127.0.0.1:62256_b    ] o.a.s.c.Overseer processMessage: queueSize: 1, message = {
   [junit4]   2>   "operation":"leader",
   [junit4]   2>   "shard":"shard1",
   [junit4]   2>   "collection":"control_collection"} current state version: 1
   [junit4]   2> 111416 INFO  (coreZkRegister-338-thread-1-processing-n:127.0.0.1:62256_b x:collection1 s:shard1 c:control_collection r:core_node1) [n:127.0.0.1:62256_b c:control_collection s:shard1 r:core_node1 x:collection1] o.a.s.c.c.SolrZkClient makePath: /collections/control_collection/leaders/shard1
   [junit4]   2> 111420 INFO  (coreZkRegister-338-thread-1-processing-n:127.0.0.1:62256_b x:collection1 s:shard1 c:control_collection r:core_node1) [n:127.0.0.1:62256_b c:control_collection s:shard1 r:core_node1 x:collection1] o.a.s.c.ShardLeaderElectionContextBase Creating leader registration node /collections/control_collection/leaders/shard1/leader after winning as /collections/control_collection/leader_elect/shard1/election/96625001756753924-core_node1-n_0000000000
   [junit4]   2> 111423 INFO  (coreZkRegister-338-thread-1-processing-n:127.0.0.1:62256_b x:collection1 s:shard1 c:control_collection r:core_node1) [n:127.0.0.1:62256_b c:control_collection s:shard1 r:core_node1 x:collection1] o.a.s.c.ShardLeaderElectionContext I am the new leader: http://127.0.0.1:62256/b/collection1/ shard1
   [junit4]   2> 111424 INFO  (OverseerStateUpdate-96625001756753924-127.0.0.1:62256_b-n_0000000000) [n:127.0.0.1:62256_b    ] o.a.s.c.Overseer processMessage: queueSize: 1, message = {
   [junit4]   2>   "operation":"leader",
   [junit4]   2>   "shard":"shard1",
   [junit4]   2>   "collection":"control_collection",
   [junit4]   2>   "base_url":"http://127.0.0.1:62256/b",
   [junit4]   2>   "core":"collection1",
   [junit4]   2>   "state":"active"} current state version: 1
   [junit4]   2> 111529 INFO  (zkCallback-147-thread-1-processing-n:127.0.0.1:62256_b) [n:127.0.0.1:62256_b    ] o.a.s.c.c.ZkStateReader A cluster state change: [WatchedEvent state:SyncConnected type:NodeDataChanged path:/clusterstate.json], has occurred - updating... (live nodes size: [1])
   [junit4]   2> 111533 INFO  (coreZkRegister-338-thread-1-processing-n:127.0.0.1:62256_b x:collection1 s:shard1 c:control_collection r:core_node1) [n:127.0.0.1:62256_b c:control_collection s:shard1 r:core_node1 x:collection1] o.a.s.c.ZkController We are http://127.0.0.1:62256/b/collection1/ and leader is http://127.0.0.1:62256/b/collection1/
   [junit4]   2> 111533 INFO  (coreZkRegister-338-thread-1-processing-n:127.0.0.1:62256_b x:collection1 s:shard1 c:control_collection r:core_node1) [n:127.0.0.1:62256_b c:control_collection s:shard1 r:core_node1 x:collection1] o.a.s.c.ZkController No LogReplay needed for core=collection1 baseURL=http://127.0.0.1:62256/b
   [junit4]   2> 111533 INFO  (coreZkRegister-338-thread-1-processing-n:127.0.0.1:62256_b x:collection1 s:shard1 c:control_collection r:core_node1) [n:127.0.0.1:62256_b c:control_collection s:shard1 r:core_node1 x:collection1] o.a.s.c.ZkController I am the leader, no recovery necessary
   [junit4]   2> 111533 INFO  (coreZkRegister-338-thread-1-processing-n:127.0.0.1:62256_b x:collection1 s:shard1 c:control_collection r:core_node1) [n:127.0.0.1:62256_b c:control_collection s:shard1 r:core_node1 x:collection1] o.a.s.c.ZkController publishing state=active
   [junit4]   2> 111533 INFO  (coreZkRegister-338-thread-1-processing-n:127.0.0.1:62256_b x:collection1 s:shard1 c:control_collection r:core_node1) [n:127.0.0.1:62256_b c:control_collection s:shard1 r:core_node1 x:collection1] o.a.s.c.ZkController numShards not found on descriptor - reading it from system property
   [junit4]   2> 111535 INFO  (OverseerStateUpdate-96625001756753924-127.0.0.1:62256_b-n_0000000000) [n:127.0.0.1:62256_b    ] o.a.s.c.Overseer processMessage: queueSize: 1, message = {
   [junit4]   2>   "core":"collection1",
   [junit4]   2>   "core_node_name":"core_node1",
   [junit4]   2>   "roles":null,
   [junit4]   2>   "base_url":"http://127.0.0.1:62256/b",
   [junit4]   2>   "node_name":"127.0.0.1:62256_b",
   [junit4]   2>   "numShards":"1",
   [junit4]   2>   "state":"active",
   [junit4]   2>   "shard":"shard1",
   [junit4]   2>   "collection":"control_collection",
   [junit4]   2>   "operation":"state"} current state version: 2
   [junit4]   2> 111535 INFO  (OverseerStateUpdate-96625001756753924-127.0.0.1:62256_b-n_0000000000) [n:127.0.0.1:62256_b    ] o.a.s.c.o.ReplicaMutator Update state numShards=1 message={
   [junit4]   2>   "core":"collection1",
   [junit4]   2>   "core_node_name":"core_node1",
   [junit4]   2>   "roles":null,
   [junit4]   2>   "base_url":"http://127.0.0.1:62256/b",
   [junit4]   2>   "node_name":"127.0.0.1:62256_b",
   [junit4]   2>   "numShards":"1",
   [junit4]   2>   "state":"active",
   [junit4]   2>   "shard":"shard1",
   [junit4]   2>   "collection":"control_collection",
   [junit4]   2>   "operation":"state"}
   [junit4]   2> 111538 INFO  (coreZkRegister-338-thread-1-processing-n:127.0.0.1:62256_b x:collection1 s:shard1 c:control_collection r:core_node1) [n:127.0.0.1:62256_b c:control_collection s:shard1 r:core_node1 x:collection1] o.a.s.c.c.ZkStateReader Checking legacy cluster state for collection control_collection
   [junit4]   2> 111621 INFO  (TEST-LeaderFailoverAfterPartitionTest.test-seed#[62B63AF65123CE48]) [    ] o.a.s.c.c.SolrZkClient Using default ZkCredentialsProvider
   [junit4]   2> 111636 INFO  (TEST-LeaderFailoverAfterPartitionTest.test-seed#[62B63AF65123CE48]) [    ] o.a.s.c.c.ConnectionManager Waiting for client to connect to ZooKeeper
   [junit4]   2> 111645 INFO  (zkCallback-147-thread-2-processing-n:127.0.0.1:62256_b) [n:127.0.0.1:62256_b    ] o.a.s.c.c.ZkStateReader A cluster state change: [WatchedEvent state:SyncConnected type:NodeDataChanged path:/clusterstate.json], has occurred - updating... (live nodes size: [1])
   [junit4]   2> 111671 INFO  (zkCallback-151-thread-1) [    ] o.a.s.c.c.ConnectionManager Watcher org.apache.solr.common.cloud.ConnectionManager@5c1c0 name:ZooKeeperConnection Watcher:127.0.0.1:62249/solr got event WatchedEvent state:SyncConnected type:None path:null path:null type:None
   [junit4]   2> 111671 INFO  (TEST-LeaderFailoverAfterPartitionTest.test-seed#[62B63AF65123CE48]) [    ] o.a.s.c.c.ConnectionManager Client is connected to ZooKeeper
   [junit4]   2> 111672 INFO  (TEST-LeaderFailoverAfterPartitionTest.test-seed#[62B63AF65123CE48]) [    ] o.a.s.c.c.SolrZkClient Using default ZkACLProvider
   [junit4]   2> 111672 INFO  (TEST-LeaderFailoverAfterPartitionTest.test-seed#[62B63AF65123CE48]) [    ] o.a.s.c.c.ZkStateReader Updating cluster state from ZooKeeper... 
   [junit4]   2> 111674 INFO  (TEST-LeaderFailoverAfterPartitionTest.test-seed#[62B63AF65123CE48]) [    ] o.a.s.c.c.ZkStateReader Loaded empty cluster properties
   [junit4]   2> 111676 INFO  (TEST-LeaderFailoverAfterPartitionTest.test-seed#[62B63AF65123CE48]) [    ] o.a.s.c.c.ZkStateReader Updated live nodes from ZooKeeper... (0) -> (1)
   [junit4]   2> 111678 INFO  (TEST-LeaderFailoverAfterPartitionTest.test-seed#[62B63AF65123CE48]) [    ] o.a.s.c.ChaosMonkey monkey: init - expire sessions:false cause connection loss:false
   [junit4]   2> 111679 INFO  (TEST-LeaderFailoverAfterPartitionTest.test-seed#[62B63AF65123CE48]) [    ] o.a.s.c.AbstractFullDistribZkTestBase Creating collection1 with stateFormat=2
   [junit4]   2> 111679 INFO  (TEST-LeaderFailoverAfterPartitionTest.test-seed#[62B63AF65123CE48]) [    ] o.a.s.c.c.SolrZkClient Using default ZkCredentialsProvider
   [junit4]   2> 111680 INFO  (TEST-LeaderFailoverAfterPartitionTest.test-seed#[62B63AF65123CE48]) [    ] o.a.s.c.c.ConnectionManager Waiting for client to connect to ZooKeeper
   [junit4]   2> 111703 INFO  (zkCallback-152-thread-1) [    ] o.a.s.c.c.ConnectionManager Watcher org.apache.solr.common.cloud.ConnectionManager@1e044e4 name:ZooKeeperConnection Watcher:127.0.0.1:62249/solr got event WatchedEvent state:SyncConnected type:None path:null path:null type:None
   [junit4]   2> 111703 INFO  (TEST-LeaderFailoverAfterPartitionTest.test-seed#[62B63AF65123CE48]) [    ] o.a.s.c.c.ConnectionManager Client is connected to ZooKeeper
   [junit4]   2> 111703 INFO  (TEST-LeaderFailoverAfterPartitionTest.test-seed#[62B63AF65123CE48]) [    ] o.a.s.c.c.SolrZkClient Using default ZkACLProvider
   [junit4]   2> 111708 INFO  (OverseerStateUpdate-96625001756753924-127.0.0.1:62256_b-n_0000000000) [n:127.0.0.1:62256_b    ] o.a.s.c.Overseer processMessage: queueSize: 1, message = {
   [junit4]   2>   "operation":"create",
   [junit4]   2>   "name":"collection1",
   [junit4]   2>   "numShards":"2",
   [junit4]   2>   "stateFormat":"2"} current state version: 3
   [junit4]   2> 111708 INFO  (OverseerStateUpdate-96625001756753924-127.0.0.1:62256_b-n_0000000000) [n:127.0.0.1:62256_b    ] o.a.s.c.o.ClusterStateMutator building a new cName: collection1
   [junit4]   2> 111856 INFO  (OverseerStateUpdate-96625001756753924-127.0.0.1:62256_b-n_0000000000) [n:127.0.0.1:62256_b    ] o.a.s.c.o.ZkStateWriter going to create_collection /collections/collection1/state.json
   [junit4]   2> 112174 INFO  (TEST-LeaderFailoverAfterPartitionTest.test-seed#[62B63AF65123CE48]) [    ] o.a.s.SolrTestCaseJ4 Writing core.properties file to C:\Users\jenkins\workspace\Lucene-Solr-6.x-Windows\solr\build\solr-core\test\J1\temp\solr.cloud.LeaderFailoverAfterPartitionTest_62B63AF65123CE48-001\shard-1-001\cores\collection1
   [junit4]   2> 112177 INFO  (TEST-LeaderFailoverAfterPartitionTest.test-seed#[62B63AF65123CE48]) [    ] o.a.s.c.AbstractFullDistribZkTestBase create jetty 1 in directory C:\Users\jenkins\workspace\Lucene-Solr-6.x-Windows\solr\build\solr-core\test\J1\temp\solr.cloud.LeaderFailoverAfterPartitionTest_62B63AF65123CE48-001\shard-1-001
   [junit4]   2> 112180 INFO  (TEST-LeaderFailoverAfterPartitionTest.test-seed#[62B63AF65123CE48]) [    ] o.e.j.s.Server jetty-9.3.8.v20160314
   [junit4]   2> 112181 INFO  (TEST-LeaderFailoverAfterPartitionTest.test-seed#[62B63AF65123CE48]) [    ] o.e.j.s.h.ContextHandler Started o.e.j.s.ServletContextHandler@d5bd09{/b,null,AVAILABLE}
   [junit4]   2> 112182 INFO  (TEST-LeaderFailoverAfterPartitionTest.test-seed#[62B63AF65123CE48]) [    ] o.e.j.s.ServerConnector Started ServerConnector@ed8de0{HTTP/1.1,[http/1.1]}{127.0.0.1:62280}
   [junit4]   2> 112182 INFO  (TEST-LeaderFailoverAfterPartitionTest.test-seed#[62B63AF65123CE48]) [    ] o.e.j.s.Server Started @116482ms
   [junit4]   2> 112182 INFO  (TEST-LeaderFailoverAfterPartitionTest.test-seed#[62B63AF65123CE48]) [    ] o.a.s.c.s.e.JettySolrRunner Jetty properties: {solr.data.dir=C:\Users\jenkins\workspace\Lucene-Solr-6.x-Windows\solr\build\solr-core\test\J1\temp\solr.cloud.LeaderFailoverAfterPartitionTest_62B63AF65123CE48-001\tempDir-001/jetty1, solrconfig=solrconfig.xml, hostContext=/b, hostPort=62279, coreRootDirectory=C:\Users\jenkins\workspace\Lucene-Solr-6.x-Windows\solr\build\solr-core\test\J1\temp\solr.cloud.LeaderFailoverAfterPartitionTest_62B63AF65123CE48-001\shard-1-001\cores}
   [junit4]   2> 112183 INFO  (TEST-LeaderFailoverAfterPartitionTest.test-seed#[62B63AF65123CE48]) [    ] o.a.s.s.SolrDispatchFilter SolrDispatchFilter.init(): sun.misc.Launcher$AppClassLoader@1d16e93
   [junit4]   2> 112183 INFO  (TEST-LeaderFailoverAfterPartitionTest.test-seed#[62B63AF65123CE48]) [    ] o.a.s.c.SolrResourceLoader new SolrResourceLoader for directory: 'C:\Users\jenkins\workspace\Lucene-Solr-6.x-Windows\solr\build\solr-core\test\J1\temp\solr.cloud.LeaderFailoverAfterPartitionTest_62B63AF65123CE48-001\shard-1-001'
   [junit4]   2> 112183 INFO  (TEST-LeaderFailoverAfterPartitionTest.test-seed#[62B63AF65123CE48]) [    ] o.a.s.c.SolrResourceLoader JNDI not configured for solr (NoInitialContextEx)
   [junit4]   2> 112183 INFO  (TEST-LeaderFailoverAfterPartitionTest.test-seed#[62B63AF65123CE48]) [    ] o.a.s.c.SolrResourceLoader solr home defaulted to 'solr/' (could not find system property or JNDI)
   [junit4]   2> 112184 INFO  (TEST-LeaderFailoverAfterPartitionTest.test-seed#[62B63AF65123CE48]) [    ] o.a.s.c.c.SolrZkClient Using default ZkCredentialsProvider
   [junit4]   2> 112184 INFO  (TEST-LeaderFailoverAfterPartitionTest.test-seed#[62B63AF65123CE48]) [    ] o.a.s.c.c.ConnectionManager Waiting for client to connect to ZooKeeper
   [junit4]   2> 112190 INFO  (zkCallback-153-thread-1) [    ] o.a.s.c.c.ConnectionManager Watcher org.apache.solr.common.cloud.ConnectionManager@7aa745 name:ZooKeeperConnection Watcher:127.0.0.1:62249/solr got event WatchedEvent state:SyncConnected type:None path:null path:null type:None
   [junit4]   2> 112190 INFO  (TEST-LeaderFailoverAfterPartitionTest.test-seed#[62B63AF65123CE48]) [    ] o.a.s.c.c.ConnectionManager Client is connected to ZooKeeper
   [junit4]   2> 112190 INFO  (TEST-LeaderFailoverAfterPartitionTest.test-seed#[62B63AF65123CE48]) [    ] o.a.s.c.c.SolrZkClient Using default ZkACLProvider
   [junit4]   2> 112193 INFO  (TEST-LeaderFailoverAfterPartitionTest.test-seed#[62B63AF65123CE48]) [    ] o.a.s.s.SolrDispatchFilter Loading solr.xml from SolrHome (not found in ZooKeeper)
   [junit4]   2> 112193 INFO  (TEST-LeaderFailoverAfterPartitionTest.test-seed#[62B63AF65123CE48]) [    ] o.a.s.c.SolrXmlConfig Loading container configuration from C:\Users\jenkins\workspace\Lucene-Solr-6.x-Windows\solr\build\solr-core\test\J1\temp\solr.cloud.LeaderFailoverAfterPartitionTest_62B63AF65123CE48-001\shard-1-001\solr.xml
   [junit4]   2> 112204 INFO  (TEST-LeaderFailoverAfterPartitionTest.test-seed#[62B63AF65123CE48]) [    ] o.a.s.c.CorePropertiesLocator Config-defined core root directory: C:\Users\jenkins\workspace\Lucene-Solr-6.x-Windows\solr\build\solr-core\test\J1\temp\solr.cloud.LeaderFailoverAfterPartitionTest_62B63AF65123CE48-001\shard-1-001\cores
   [junit4]   2> 112204 INFO  (TEST-LeaderFailoverAfterPartitionTest.test-seed#[62B63AF65123CE48]) [    ] o.a.s.c.CoreContainer New CoreContainer 19113779
   [junit4]   2> 112204 INFO  (TEST-LeaderFailoverAfterPartitionTest.test-seed#[62B63AF65123CE48]) [    ] o.a.s.c.CoreContainer Loading cores into CoreContainer [instanceDir=C:\Users\jenkins\workspace\Lucene-Solr-6.x-Windows\solr\build\solr-core\test\J1\temp\solr.cloud.LeaderFailoverAfterPartitionTest_62B63AF65123CE48-001\shard-1-001]
   [junit4]   2> 112205 WARN  (TEST-LeaderFailoverAfterPartitionTest.test-seed#[62B63AF65123CE48]) [    ] o.a.s.c.CoreContainer Couldn't add files from C:\Users\jenkins\workspace\Lucene-Solr-6.x-Windows\solr\build\solr-core\test\J1\temp\solr.cloud.LeaderFailoverAfterPartitionTest_62B63AF65123CE48-001\shard-1-001\lib to classpath: C:\Users\jenkins\workspace\Lucene-Solr-6.x-Windows\solr\build\solr-core\test\J1\temp\solr.cloud.LeaderFailoverAfterPartitionTest_62B63AF65123CE48-001\shard-1-001\lib
   [junit4]   2> 112205 INFO  (TEST-LeaderFailoverAfterPartitionTest.test-seed#[62B63AF65123CE48]) [    ] o.a.s.h.c.HttpShardHandlerFactory created with socketTimeout : 90000,urlScheme : ,connTimeout : 15000,maxConnectionsPerHost : 20,maxConnections : 10000,corePoolSize : 0,maximumPoolSize : 2147483647,maxThreadIdleTime : 5,sizeOfQueue : -1,fairnessPolicy : false,useRetries : false,connectionsEvictorSleepDelay : 5000,maxConnectionIdleTime : 40000,
   [junit4]   2> 112209 INFO  (TEST-LeaderFailoverAfterPartitionTest.test-seed#[62B63AF65123CE48]) [    ] o.a.s.u.UpdateShardHandler Creating UpdateShardHandler HTTP client with params: socketTimeout=340000&connTimeout=45000&retry=true
   [junit4]   2> 112210 INFO  (TEST-LeaderFailoverAfterPartitionTest.test-seed#[62B63AF65123CE48]) [    ] o.a.s.l.LogWatcher SLF4J impl is org.slf4j.impl.Log4jLoggerFactory
   [junit4]   2> 112210 INFO  (TEST-LeaderFailoverAfterPartitionTest.test-seed#[62B63AF65123CE48]) [    ] o.a.s.l.LogWatcher Registering Log Listener [Log4j (org.slf4j.impl.Log4jLoggerFactory)]
   [junit4]   2> 112210 INFO  (TEST-LeaderFailoverAfterPartitionTest.test-seed#[62B63AF65123CE48]) [    ] o.a.s.c.ZkContainer Zookeeper client=127.0.0.1:62249/solr
   [junit4]   2> 112210 INFO  (TEST-LeaderFailoverAfterPartitionTest.test-seed#[62B63AF65123CE48]) [    ] o.a.s.c.ZkController zkHost includes chroot
   [junit4]   2> 112210 INFO  (TEST-LeaderFailoverAfterPartitionTest.test-seed#[62B63AF65123CE48]) [    ] o.a.s.c.c.SolrZkClient Using default ZkCredentialsProvider
   [junit4]   2> 112210 INFO  (TEST-LeaderFailoverAfterPartitionTest.test-seed#[62B63AF65123CE48]) [    ] o.a.s.c.c.ConnectionManager Waiting for client to connect to ZooKeeper
   [junit4]   2> 112214 INFO  (zkCallback-156-thread-1) [    ] o.a.s.c.c.ConnectionManager Watcher org.apache.solr.common.cloud.ConnectionManager@1da484f name:ZooKeeperConnection Watcher:127.0.0.1:62249 got event WatchedEvent state:SyncConnected type:None path:null path:null type:None
   [junit4]   2> 112214 INFO  (TEST-LeaderFailoverAfterPartitionTest.test-seed#[62B63AF65123CE48]) [    ] o.a.s.c.c.ConnectionManager Client is connected to ZooKeeper
   [junit4]   2> 112215 INFO  (TEST-LeaderFailoverAfterPartitionTest.test-seed#[62B63AF65123CE48]) [    ] o.a.s.c.c.SolrZkClient Using default ZkACLProvider
   [junit4]   2> 112217 WARN  (NIOServerCxn.Factory:0.0.0.0/0.0.0.0:0) [    ] o.a.z.s.NIOServerCnxn caught end of stream exception
   [junit4]   2> EndOfStreamException: Unable to read additional data from client sessionid 0x15747ed5a220008, likely client has closed socket
   [junit4]   2> 	at org.apache.zookeeper.server.NIOServerCnxn.doIO(NIOServerCnxn.java:228)
   [junit4]   2> 	at org.apache.zookeeper.server.NIOServerCnxnFactory.run(NIOServerCnxnFactory.java:208)
   [junit4]   2> 	at java.lang.Thread.run(Thread.java:745)
   [junit4]   2> 112217 INFO  (TEST-LeaderFailoverAfterPartitionTest.test-seed#[62B63AF65123CE48]) [n:127.0.0.1:62279_b    ] o.a.s.c.ZkController Added new OnReconnect listener org.apache.solr.cloud.ZkController$$Lambda$69/13391062@16daaba
   [junit4]   2> 112218 INFO  (TEST-LeaderFailoverAfterPartitionTest.test-seed#[62B63AF65123CE48]) [n:127.0.0.1:62279_b    ] o.a.s.c.c.ConnectionManager Waiting for client to connect to ZooKeeper
   [junit4]   2> 112222 INFO  (zkCallback-157-thread-1-processing-n:127.0.0.1:62279_b) [n:127.0.0.1:62279_b    ] o.a.s.c.c.ConnectionManager Watcher org.apache.solr.common.cloud.ConnectionManager@dcac29 name:ZooKeeperConnection Watcher:127.0.0.1:62249/solr got event WatchedEvent state:SyncConnected type:None path:null path:null type:None
   [junit4]   2> 112223 INFO  (TEST-LeaderFailoverAfterPartitionTest.test-seed#[62B63AF65123CE48]) [n:127.0.0.1:62279_b    ] o.a.s.c.c.ConnectionManager Client is connected to ZooKeeper
   [junit4]   2> 112230 INFO  (TEST-LeaderFailoverAfterPartitionTest.test-seed#[62B63AF65123CE48]) [n:127.0.0.1:62279_b    ] o.a.s.c.c.ZkStateReader Updating cluster state from ZooKeeper... 
   [junit4]   2> 112231 INFO  (TEST-LeaderFailoverAfterPartitionTest.test-seed#[62B63AF65123CE48]) [n:127.0.0.1:62279_b    ] o.a.s.c.c.ZkStateReader Loaded empty cluster properties
   [junit4]   2> 112232 INFO  (TEST-LeaderFailoverAfterPartitionTest.test-seed#[62B63AF65123CE48]) [n:127.0.0.1:62279_b    ] o.a.s.c.c.ZkStateReader Updated live nodes from ZooKeeper... (0) -> (1)
   [junit4]   2> 112237 INFO  (TEST-LeaderFailoverAfterPartitionTest.test-seed#[62B63AF65123CE48]) [n:127.0.0.1:62279_b    ] o.a.s.c.Overseer Overseer (id=null) closing
   [junit4]   2> 112238 INFO  (TEST-LeaderFailoverAfterPartitionTest.test-seed#[62B63AF65123CE48]) [n:127.0.0.1:62279_b    ] o.a.s.c.LeaderElector Joined leadership election with path: /overseer_elect/election/96625001756753929-127.0.0.1:62279_b-n_0000000001
   [junit4]   2> 112238 INFO  (TEST-LeaderFailoverAfterPartitionTest.test-seed#[62B63AF65123CE48]) [n:127.0.0.1:62279_b    ] o.a.s.c.LeaderElector Watching path /overseer_elect/election/96625001756753924-127.0.0.1:62256_b-n_0000000000 to know if I could be the leader
   [junit4]   2> 112238 INFO  (TEST-LeaderFailoverAfterPartitionTest.test-seed#[62B63AF65123CE48]) [n:127.0.0.1:62279_b    ] o.a.s.c.ZkController Publish node=127.0.0.1:62279_b as DOWN
   [junit4]   2> 112239 INFO  (TEST-LeaderFailoverAfterPartitionTest.test-seed#[62B63AF65123CE48]) [n:127.0.0.1:62279_b    ] o.a.s.c.ZkController Register node as live in ZooKeeper:/live_nodes/127.0.0.1:62279_b
   [junit4]   2> 112239 INFO  (TEST-LeaderFailoverAfterPartitionTest.test-seed#[62B63AF65123CE48]) [n:127.0.0.1:62279_b    ] o.a.s.c.c.SolrZkClient makePath: /live_nodes/127.0.0.1:62279_b
   [junit4]   2> 112241 INFO  (zkCallback-157-thread-1-processing-n:127.0.0.1:62279_b) [n:127.0.0.1:62279_b    ] o.a.s.c.c.ZkStateReader A live node change: [WatchedEvent state:SyncConnected type:NodeChildrenChanged path:/live_nodes], has occurred - updating... (live nodes size: [1])
   [junit4]   2> 112241 INFO  (zkCallback-151-thread-1) [    ] o.a.s.c.c.ZkStateReader A live node change: [WatchedEvent state:SyncConnected type:NodeChildrenChanged path:/live_nodes], has occurred - updating... (live nodes size: [1])
   [junit4]   2> 112241 INFO  (zkCallback-147-thread-2-processing-n:127.0.0.1:62256_b) [n:127.0.0.1:62256_b    ] o.a.s.c.c.ZkStateReader A live node change: [WatchedEvent state:SyncConnected type:NodeChildrenChanged path:/live_nodes], has occurred - updating... (live nodes size: [1])
   [junit4]   2> 112241 INFO  (OverseerStateUpdate-96625001756753924-127.0.0.1:62256_b-n_0000000000) [n:127.0.0.1:62256_b    ] o.a.s.c.Overseer processMessage: queueSize: 1, message = {
   [junit4]   2>   "operation":"downnode",
   [junit4]   2>   "node_name":"127.0.0.1:62279_b"} current state version: 3
   [junit4]   2> 112241 INFO  (OverseerStateUpdate-96625001756753924-127.0.0.1:62256_b-n_0000000000) [n:127.0.0.1:62256_b    ] o.a.s.c.o.NodeMutator DownNode state invoked for node: 127.0.0.1:62279_b
   [junit4]   2> 112243 INFO  (zkCallback-147-thread-2-processing-n:127.0.0.1:62256_b) [n:127.0.0.1:62256_b    ] o.a.s.c.c.ZkStateReader Updated live nodes from ZooKeeper... (1) -> (2)
   [junit4]   2> 112245 INFO  (zkCallback-151-thread-1) [    ] o.a.s.c.c.ZkStateReader Updated live nodes from ZooKeeper... (1) -> (2)
   [junit4]   2> 112246 INFO  (zkCallback-157-thread-1-processing-n:127.0.0.1:62279_b) [n:127.0.0.1:62279_b    ] o.a.s.c.c.ZkStateReader Updated live nodes from ZooKeeper... (1) -> (2)
   [junit4]   2> 112247 INFO  (zkCallback-157-thread-1-processing-n:127.0.0.1:62279_b) [n:127.0.0.1:62279_b    ] o.a.s.c.c.ZkStateReader A cluster state change: [WatchedEvent state:SyncConnected type:NodeDataChanged path:/clusterstate.json], has occurred - updating... (live nodes size: [2])
   [junit4]   2> 112247 INFO  (zkCallback-151-thread-1) [    ] o.a.s.c.c.ZkStateReader A cluster state change: [WatchedEvent state:SyncConnected type:NodeDataChanged path:/clusterstate.json], has occurred - updating... (live nodes size: [2])
   [junit4]   2> 112247 INFO  (zkCallback-147-thread-3-processing-n:127.0.0.1:62256_b) [n:127.0.0.1:62256_b    ] o.a.s.c.c.ZkStateReader A cluster state change: [WatchedEvent state:SyncConnected type:NodeDataChanged path:/clusterstate.json], has occurred - updating... (live nodes size: [2])
   [junit4]   2> 112257 INFO  (TEST-LeaderFailoverAfterPartitionTest.test-seed#[62B63AF65123CE48]) [n:127.0.0.1:62279_b    ] o.a.s.c.CoreContainer Security conf doesn't exist. Skipping setup for authorization module.
   [junit4]   2> 112257 INFO  (TEST-LeaderFailoverAfterPartitionTest.test-seed#[62B63AF65123CE48]) [n:127.0.0.1:62279_b    ] o.a.s.c.CoreContainer No authentication plugin used.
   [junit4]   2> 112258 INFO  (TEST-LeaderFailoverAfterPartitionTest.test-seed#[62B63AF65123CE48]) [n:127.0.0.1:62279_b    ] o.a.s.c.CorePropertiesLocator Looking for core definitions underneath C:\Users\jenkins\workspace\Lucene-Solr-6.x-Windows\solr\build\solr-core\test\J1\temp\solr.cloud.LeaderFailoverAfterPartitionTest_62B63AF65123CE48-001\shard-1-001\cores
   [junit4]   2> 112260 INFO  (TEST-LeaderFailoverAfterPartitionTest.test-seed#[62B63AF65123CE48]) [n:127.0.0.1:62279_b    ] o.a.s.c.CoreDescriptor Created CoreDescriptor: {name=collection1, config=solrconfig.xml, transient=false, schema=schema.xml, loadOnStartup=true, configSetProperties=configsetprops.json, collection=collection1, coreNodeName=, dataDir=data\, shard=}
   [junit4]   2> 112260 INFO  (TEST-LeaderFailoverAfterPartitionTest.test-seed#[62B63AF65123CE48]) [n:127.0.0.1:62279_b    ] o.a.s.c.CorePropertiesLocator Found core collection1 in C:\Users\jenkins\workspace\Lucene-Solr-6.x-Windows\solr\build\solr-core\test\J1\temp\solr.cloud.LeaderFailoverAfterPartitionTest_62B63AF65123CE48-001\shard-1-001\cores\collection1
   [junit4]   2> 112260 INFO  (TEST-LeaderFailoverAfterPartitionTest.test-seed#[62B63AF65123CE48]) [n:127.0.0.1:62279_b    ] o.a.s.c.CorePropertiesLocator Found 1 core definitions
   [junit4]   2> 112260 INFO  (TEST-LeaderFailoverAfterPartitionTest.test-seed#[62B63AF65123CE48]) [n:127.0.0.1:62279_b    ] o.a.s.s.SolrDispatchFilter user.dir=C:\Users\jenkins\wor

[...truncated too long message...]

<init>(SolrCore.java:688)
   [junit4]   2> 	at org.apache.solr.core.CoreContainer.create(CoreContainer.java:840)
   [junit4]   2> 	at org.apache.solr.core.CoreContainer.create(CoreContainer.java:777)
   [junit4]   2> 	at org.apache.solr.handler.admin.CoreAdminOperation.lambda$static$0(CoreAdminOperation.java:85)
   [junit4]   2> 	at org.apache.solr.handler.admin.CoreAdminOperation.execute(CoreAdminOperation.java:374)
   [junit4]   2> 	at org.apache.solr.handler.admin.CoreAdminHandler$CallInfo.call(CoreAdminHandler.java:365)
   [junit4]   2> 	at org.apache.solr.handler.admin.CoreAdminHandler.handleRequestBody(CoreAdminHandler.java:156)
   [junit4]   2> 	at org.apache.solr.handler.RequestHandlerBase.handleRequest(RequestHandlerBase.java:154)
   [junit4]   2> 	at org.apache.solr.servlet.HttpSolrCall.handleAdminRequest(HttpSolrCall.java:658)
   [junit4]   2> 	at org.apache.solr.servlet.HttpSolrCall.call(HttpSolrCall.java:440)
   [junit4]   2> 	at org.apache.solr.servlet.SolrDispatchFilter.doFilter(SolrDispatchFilter.java:257)
   [junit4]   2> 	at org.apache.solr.servlet.SolrDispatchFilter.doFilter(SolrDispatchFilter.java:208)
   [junit4]   2> 	at org.eclipse.jetty.servlet.ServletHandler$CachedChain.doFilter(ServletHandler.java:1676)
   [junit4]   2> 	at org.apache.solr.client.solrj.embedded.JettySolrRunner$DebugFilter.doFilter(JettySolrRunner.java:108)
   [junit4]   2> 	at org.eclipse.jetty.servlet.ServletHandler$CachedChain.doFilter(ServletHandler.java:1676)
   [junit4]   2> 	at org.eclipse.jetty.servlet.ServletHandler.doHandle(ServletHandler.java:581)
   [junit4]   2> 	at org.eclipse.jetty.server.session.SessionHandler.doHandle(SessionHandler.java:224)
   [junit4]   2> 	at org.eclipse.jetty.server.handler.ContextHandler.doHandle(ContextHandler.java:1160)
   [junit4]   2> 	at org.eclipse.jetty.servlet.ServletHandler.doScope(ServletHandler.java:511)
   [junit4]   2> 	at org.eclipse.jetty.server.session.SessionHandler.doScope(SessionHandler.java:185)
   [junit4]   2> 	at org.eclipse.jetty.server.handler.ContextHandler.doScope(ContextHandler.java:1092)
   [junit4]   2> 	at org.eclipse.jetty.server.handler.ScopedHandler.handle(ScopedHandler.java:141)
   [junit4]   2> 	at org.eclipse.jetty.server.handler.gzip.GzipHandler.handle(GzipHandler.java:399)
   [junit4]   2> 	at org.eclipse.jetty.server.handler.HandlerWrapper.handle(HandlerWrapper.java:134)
   [junit4]   2> 	at org.eclipse.jetty.server.Server.handle(Server.java:518)
   [junit4]   2> 	at org.eclipse.jetty.server.HttpChannel.handle(HttpChannel.java:308)
   [junit4]   2> 	at org.eclipse.jetty.server.HttpConnection.onFillable(HttpConnection.java:244)
   [junit4]   2> 	at org.eclipse.jetty.io.AbstractConnection$ReadCallback.succeeded(AbstractConnection.java:273)
   [junit4]   2> 	at org.eclipse.jetty.io.FillInterest.fillable(FillInterest.java:95)
   [junit4]   2> 	at org.eclipse.jetty.io.SelectChannelEndPoint$2.run(SelectChannelEndPoint.java:93)
   [junit4]   2> 	at org.eclipse.jetty.util.thread.strategy.ExecuteProduceConsume.produceAndRun(ExecuteProduceConsume.java:246)
   [junit4]   2> 	at org.eclipse.jetty.util.thread.strategy.ExecuteProduceConsume.run(ExecuteProduceConsume.java:156)
   [junit4]   2> 	at org.eclipse.jetty.util.thread.QueuedThreadPool.runJob(QueuedThreadPool.java:654)
   [junit4]   2> 	at org.eclipse.jetty.util.thread.QueuedThreadPool$3.run(QueuedThreadPool.java:572)
   [junit4]   2> 	at java.lang.Thread.run(Thread.java:745)
   [junit4]   2> 
   [junit4]   2> org.apache.solr.common.util.ObjectReleaseTracker$ObjectTrackerException
   [junit4]   2> 	at org.apache.solr.common.util.ObjectReleaseTracker.track(ObjectReleaseTracker.java:42)
   [junit4]   2> 	at org.apache.solr.core.SolrCore.<init>(SolrCore.java:850)
   [junit4]   2> 	at org.apache.solr.core.SolrCore.reload(SolrCore.java:503)
   [junit4]   2> 	at org.apache.solr.core.CoreContainer.reload(CoreContainer.java:942)
   [junit4]   2> 	at org.apache.solr.core.SolrCore.lambda$getConfListener$6(SolrCore.java:2584)
   [junit4]   2> 	at org.apache.solr.cloud.ZkController.lambda$fireEventListeners$3(ZkController.java:2443)
   [junit4]   2> 	at java.lang.Thread.run(Thread.java:745)
   [junit4]   2> 
   [junit4]   2> 331191 INFO  (Thread-825) [n:localhost:63661_solr    ] o.a.s.c.CachingDirectoryFactory Closing directory, CoreContainer#isShutdown=true
   [junit4]   2> 331191 INFO  (Thread-825) [n:localhost:63661_solr    ] o.a.s.c.CachingDirectoryFactory Closing directory: C:\Users\jenkins\workspace\Lucene-Solr-6.x-Windows\solr\build\solr-core\test\J0\temp\solr.util.TestSolrCLIRunExample_62B63AF65123CE48-001\tempDir-003\node1\testCloudExamplePrompt_shard2_replica1\data\index
   [junit4]   2> 331191 INFO  (Thread-825) [n:localhost:63661_solr    ] o.a.s.c.CachingDirectoryFactory looking to close C:\Users\jenkins\workspace\Lucene-Solr-6.x-Windows\solr\build\solr-core\test\J0\temp\solr.util.TestSolrCLIRunExample_62B63AF65123CE48-001\tempDir-003\node1\testCloudExamplePrompt_shard2_replica1\data\ [CachedDir<<refCount=0;path=C:\Users\jenkins\workspace\Lucene-Solr-6.x-Windows\solr\build\solr-core\test\J0\temp\solr.util.TestSolrCLIRunExample_62B63AF65123CE48-001\tempDir-003\node1\testCloudExamplePrompt_shard2_replica1\data\;done=false>>]
   [junit4]   2> 331191 INFO  (Thread-825) [n:localhost:63661_solr    ] o.a.s.c.CachingDirectoryFactory Closing directory, CoreContainer#isShutdown=true
   [junit4]   2> 331191 INFO  (Thread-825) [n:localhost:63661_solr    ] o.a.s.c.CachingDirectoryFactory Closing directory: C:\Users\jenkins\workspace\Lucene-Solr-6.x-Windows\solr\build\solr-core\test\J0\temp\solr.util.TestSolrCLIRunExample_62B63AF65123CE48-001\tempDir-003\node1\testCloudExamplePrompt_shard2_replica1\data\
   [junit4]   2> 331191 INFO  (Thread-825) [n:localhost:63661_solr    ] o.a.s.c.CachingDirectoryFactory Removing directory after core close: C:\Users\jenkins\workspace\Lucene-Solr-6.x-Windows\solr\build\solr-core\test\J0\temp\solr.util.TestSolrCLIRunExample_62B63AF65123CE48-001\tempDir-003\node1\testCloudExamplePrompt_shard2_replica1\data\
   [junit4]   2> 331191 WARN  (Thread-825) [n:localhost:63661_solr    ] o.a.s.c.SolrCore 
   [junit4]   2> org.apache.solr.core.SolrResourceNotFoundException: Can't find resource 'managed-schema' in classpath or '/configs/testCloudExamplePrompt', cwd=C:\Users\jenkins\workspace\Lucene-Solr-6.x-Windows\solr\build\solr-core\test\J0
   [junit4]   2> 	at org.apache.solr.cloud.ZkSolrResourceLoader.openResource(ZkSolrResourceLoader.java:130)
   [junit4]   2> 	at org.apache.solr.schema.SchemaManager.getFreshManagedSchema(SchemaManager.java:429)
   [junit4]   2> 	at org.apache.solr.core.SolrCore.lambda$getConfListener$6(SolrCore.java:2577)
   [junit4]   2> 	at org.apache.solr.cloud.ZkController.lambda$fireEventListeners$3(ZkController.java:2443)
   [junit4]   2> 	at java.lang.Thread.run(Thread.java:745)
   [junit4]   2> 331192 INFO  (Thread-825) [n:localhost:63661_solr    ] o.a.s.c.SolrCore core reload testCloudExamplePrompt_shard2_replica1
   [junit4]   2> 331192 WARN  (Thread-825) [n:localhost:63661_solr    ] o.a.s.c.ZkController listener throws error
   [junit4]   2> org.apache.solr.common.SolrException: No such core: testCloudExamplePrompt_shard2_replica1
   [junit4]   2> 	at org.apache.solr.core.CoreContainer.reload(CoreContainer.java:935)
   [junit4]   2> 	at org.apache.solr.core.SolrCore.lambda$getConfListener$6(SolrCore.java:2584)
   [junit4]   2> 	at org.apache.solr.cloud.ZkController.lambda$fireEventListeners$3(ZkController.java:2443)
   [junit4]   2> 	at java.lang.Thread.run(Thread.java:745)
   [junit4]   2> Sep 20, 2016 2:12:21 PM com.carrotsearch.randomizedtesting.ThreadLeakControl checkThreadLeaks
   [junit4]   2> WARNING: Will linger awaiting termination of 3 leaked thread(s).
   [junit4]   2> NOTE: test params are: codec=Asserting(Lucene62): {}, docValues:{}, maxPointsInLeafNode=514, maxMBSortInHeap=5.915237048432969, sim=ClassicSimilarity, locale=es-CR, timezone=Africa/Nairobi
   [junit4]   2> NOTE: Windows 10 10.0 x86/Oracle Corporation 1.8.0_102 (32-bit)/cpus=3,threads=1,free=43333688,total=260288512
   [junit4]   2> NOTE: All tests run in this JVM: [TestRawTransformer, RecoveryAfterSoftCommitTest, TestStandardQParsers, DistributedVersionInfoTest, SimpleFacetsTest, UniqFieldsUpdateProcessorFactoryTest, TestImplicitCoreProperties, TestMissingGroups, BlockJoinFacetSimpleTest, TestRandomRequestDistribution, ActionThrottleTest, TestCSVLoader, TestReRankQParserPlugin, ResponseHeaderTest, TlogReplayBufferedWhileIndexingTest, DocValuesMissingTest, BasicDistributedZkTest, TestShortCircuitedRequests, TestInitParams, RuleEngineTest, TestStressVersions, CoreMergeIndexesAdminHandlerTest, TestGraphMLResponseWriter, TestSurroundQueryParser, MoreLikeThisHandlerTest, DistribJoinFromCollectionTest, TestDynamicFieldCollectionResource, RecoveryZkTest, SpatialHeatmapFacetsTest, PrimUtilsTest, SuggestComponentTest, TestDocumentBuilder, TestClusterStateMutator, ClassificationUpdateProcessorFactoryTest, SolrPluginUtilsTest, PathHierarchyTokenizerFactoryTest, TestSolrCLIRunExample]
   [junit4]   2> NOTE: reproduce with: ant test  -Dtestcase=TestSolrCLIRunExample -Dtests.seed=62B63AF65123CE48 -Dtests.slow=true -Dtests.locale=es-CR -Dtests.timezone=Africa/Nairobi -Dtests.asserts=true -Dtests.file.encoding=UTF-8
   [junit4] ERROR   0.00s J0 | TestSolrCLIRunExample (suite) <<<
   [junit4]    > Throwable #1: java.lang.AssertionError: ObjectTracker found 4 object(s) that were not released!!! [MockDirectoryWrapper, RawDirectoryWrapper, SolrCore, MockDirectoryWrapper]
   [junit4]    > 	at __randomizedtesting.SeedInfo.seed([62B63AF65123CE48]:0)
   [junit4]    > 	at org.apache.solr.SolrTestCaseJ4.teardownTestCases(SolrTestCaseJ4.java:257)
   [junit4]    > 	at java.lang.Thread.run(Thread.java:745)
   [junit4] Completed [96/630 (2!)] on J0 in 21.75s, 3 tests, 1 failure, 1 skipped <<< FAILURES!

[...truncated 54344 lines...]