You are viewing a plain text version of this content. The canonical link for it is here.
Posted to dev@brooklyn.apache.org by Apache Jenkins Server <je...@builds.apache.org> on 2015/09/21 19:03:26 UTC
Build failed in Jenkins: incubator-brooklyn-master-windows #289
See <https://builds.apache.org/job/incubator-brooklyn-master-windows/289/>
------------------------------------------
[...truncated 17592 lines...]
[INFO] Configuring TestNG with: TestNG652Configurator
[INFO] 2015-09-21 16:21:33,364 INFO TESTNG RUNNING: Suite: "Surefire test" containing "2" Tests (config: null)
[INFO] 2015-09-21 16:21:33,386 INFO TESTNG INVOKING CONFIGURATION: "Surefire test" - @BeforeMethod com.acme.sample.brooklyn.sample.app.SampleUnitTest.setup()
[INFO] 2015-09-21 16:21:40,736 INFO TESTNG PASSED CONFIGURATION: "Surefire test" - @BeforeMethod com.acme.sample.brooklyn.sample.app.SampleUnitTest.setup() finished in 7352 ms
[INFO] 2015-09-21 16:21:40,736 INFO TESTNG INVOKING: "Surefire test" - com.acme.sample.brooklyn.sample.app.SampleUnitTest.testSampleClusterStructure()
[INFO] 2015-09-21 16:21:44,576 INFO app from spec is: ClusterWebServerDatabaseSample{id=aRtrTdTt}
[INFO] 2015-09-21 16:21:44,580 INFO TESTNG PASSED: "Surefire test" - com.acme.sample.brooklyn.sample.app.SampleUnitTest.testSampleClusterStructure() finished in 3844 ms
[INFO] 2015-09-21 16:21:44,581 INFO TESTNG INVOKING CONFIGURATION: "Surefire test" - @AfterMethod com.acme.sample.brooklyn.sample.app.SampleUnitTest.shutdown()
[INFO] 2015-09-21 16:21:45,052 INFO TESTNG PASSED CONFIGURATION: "Surefire test" - @AfterMethod com.acme.sample.brooklyn.sample.app.SampleUnitTest.shutdown() finished in 471 ms
[INFO] 2015-09-21 16:21:45,053 INFO TESTNG INVOKING CONFIGURATION: "Surefire test" - @BeforeMethod com.acme.sample.brooklyn.sample.app.SampleUnitTest.setup()
[INFO] 2015-09-21 16:21:48,909 INFO TESTNG PASSED CONFIGURATION: "Surefire test" - @BeforeMethod com.acme.sample.brooklyn.sample.app.SampleUnitTest.setup() finished in 3856 ms
[INFO] 2015-09-21 16:21:48,910 INFO TESTNG INVOKING: "Surefire test" - com.acme.sample.brooklyn.sample.app.SampleUnitTest.testSampleSingleStructure()
[INFO] 2015-09-21 16:21:49,532 INFO app from spec is: SingleWebServerSample{id=yavXveUl}
[INFO] 2015-09-21 16:21:49,533 INFO TESTNG PASSED: "Surefire test" - com.acme.sample.brooklyn.sample.app.SampleUnitTest.testSampleSingleStructure() finished in 623 ms
[INFO] 2015-09-21 16:21:49,534 INFO TESTNG INVOKING CONFIGURATION: "Surefire test" - @AfterMethod com.acme.sample.brooklyn.sample.app.SampleUnitTest.shutdown()
[INFO] 2015-09-21 16:21:49,863 INFO TESTNG PASSED CONFIGURATION: "Surefire test" - @AfterMethod com.acme.sample.brooklyn.sample.app.SampleUnitTest.shutdown() finished in 329 ms
[INFO] 2015-09-21 16:21:55,078 INFO TESTNG
[INFO] ===============================================
[INFO] Surefire test
[INFO] Tests run: 2, Failures: 0, Skips: 0
[INFO] ===============================================
[INFO] Tests run: 2, Failures: 0, Errors: 0, Skipped: 0, Time elapsed: 32.743 sec - in TestSuite
[INFO]
[INFO] Results :
[INFO]
[INFO] Tests run: 2, Failures: 0, Errors: 0, Skipped: 0
[INFO]
[INFO] [INFO]
[INFO] [INFO] --- maven-jar-plugin:2.6:jar (default-jar) @ brooklyn-sample ---
[INFO] [INFO] Building jar: F:\hudson\hudson-slave\workspace\incubator-brooklyn-master-windows\usage\archetypes\quickstart\target\test-classes\projects\integration-test-1\project\brooklyn-sample\target\brooklyn-sample-0.1.0-SNAPSHOT.jar
[INFO] [INFO]
[INFO] [INFO] --- maven-site-plugin:3.4:attach-descriptor (attach-descriptor) @ brooklyn-sample ---
[INFO] [INFO]
[INFO] [INFO] --- maven-jar-plugin:2.6:test-jar (test-jar-creation) @ brooklyn-sample ---
[INFO] [INFO] Building jar: F:\hudson\hudson-slave\workspace\incubator-brooklyn-master-windows\usage\archetypes\quickstart\target\test-classes\projects\integration-test-1\project\brooklyn-sample\target\brooklyn-sample-0.1.0-SNAPSHOT-tests.jar
[INFO] [INFO]
[INFO] [INFO] --- maven-install-plugin:2.5.2:install (default-install) @ brooklyn-sample ---
[INFO] [INFO] Installing F:\hudson\hudson-slave\workspace\incubator-brooklyn-master-windows\usage\archetypes\quickstart\target\test-classes\projects\integration-test-1\project\brooklyn-sample\target\brooklyn-sample-0.1.0-SNAPSHOT.jar to F:\hudson\hudson-slave\maven-repositories\0\com\acme\sample\brooklyn-sample\0.1.0-SNAPSHOT\brooklyn-sample-0.1.0-SNAPSHOT.jar
[INFO] [INFO] Installing F:\hudson\hudson-slave\workspace\incubator-brooklyn-master-windows\usage\archetypes\quickstart\target\test-classes\projects\integration-test-1\project\brooklyn-sample\pom.xml to F:\hudson\hudson-slave\maven-repositories\0\com\acme\sample\brooklyn-sample\0.1.0-SNAPSHOT\brooklyn-sample-0.1.0-SNAPSHOT.pom
[INFO] [INFO] Installing F:\hudson\hudson-slave\workspace\incubator-brooklyn-master-windows\usage\archetypes\quickstart\target\test-classes\projects\integration-test-1\project\brooklyn-sample\target\brooklyn-sample-0.1.0-SNAPSHOT-tests.jar to F:\hudson\hudson-slave\maven-repositories\0\com\acme\sample\brooklyn-sample\0.1.0-SNAPSHOT\brooklyn-sample-0.1.0-SNAPSHOT-tests.jar
[INFO] [INFO] ------------------------------------------------------------------------
[INFO] [INFO] BUILD SUCCESS
[INFO] [INFO] ------------------------------------------------------------------------
[INFO] [INFO] Total time: 2:06.669s
[INFO] [INFO] Finished at: Mon Sep 21 16:22:04 BST 2015
[INFO] [INFO] Final Memory: 45M/236M
[INFO] [INFO] ------------------------------------------------------------------------
[INFO] Post-archetype-generation invoker exit code: 0
[JENKINS] Recording test results
[INFO]
[INFO] --- apache-rat-plugin:0.10:check (default) @ brooklyn-archetype-quickstart ---
[INFO] 51 implicit excludes (use -debug for more details).
[INFO] Exclude: sandbox/**
[INFO] Exclude: release/**
[INFO] Exclude: **/nbactions.xml
[INFO] Exclude: **/nb-configuration.xml
[INFO] Exclude: **/src/main/resources/archetype-resources/**/*
[INFO] Exclude: **/src/test/resources/projects/integration-test-1/goal.txt
[INFO] Exclude: **/src/test/resources/projects/integration-test-1/reference/**/*
[INFO] Exclude: **/src/main/java/sample/**/*Sample*.java
[INFO] Exclude: **/src/main/resources/logback-custom.xml
[INFO] Exclude: **/src/brooklyn-sample/README.md
[INFO] Exclude: **/src/brooklyn-sample/pom.xml
[INFO] Exclude: **/src/brooklyn-sample/src/main/assembly/files/conf/*
[INFO] Exclude: **/src/brooklyn-sample/src/main/java/**/*.java
[INFO] Exclude: **/src/brooklyn-sample/src/main/resources/logback-custom.xml
[INFO] Exclude: **/src/brooklyn-sample/src/test/java/**/*.java
[INFO] Exclude: **/.git/**
[INFO] Exclude: **/.gitignore
[INFO] Exclude: **/.repository/**
[INFO] Exclude: **/.idea/**
[INFO] Exclude: **/*.iml
[INFO] Exclude: **/.classpath/**
[INFO] Exclude: **/.project
[INFO] Exclude: **/.settings/**
[INFO] Exclude: **/*.log
[INFO] Exclude: **/brooklyn*.log.*
[INFO] Exclude: **/target/**
[INFO] Exclude: ignored/**
[INFO] Exclude: LICENSE.md
[INFO] Exclude: **/src/main/license/**
[INFO] Exclude: **/src/test/license/**
[INFO] Exclude: **/MANIFEST.MF
[INFO] Exclude: **/test-output/**
[INFO] Exclude: **/*.pem.pub
[INFO] Exclude: **/*.pem
[INFO] Exclude: **/*_rsa.pub
[INFO] Exclude: **/*_rsa
[INFO] Exclude: **/*.svg
[INFO] Exclude: **/*.crt
[INFO] Exclude: **/*.csr
[INFO] Exclude: **/*.key
[INFO] Exclude: **/*.key.org
[INFO] Exclude: **/*.psd
[INFO] Exclude: **/*.json
[INFO] Exclude: **/*.plxarc
[INFO] Exclude: **/src/test/resources/org/apache/brooklyn/entity/software/base/template_with_extra_substitutions.txt
[INFO] Exclude: **/src/main/resources/banner.txt
[INFO] Exclude: **/src/test/resources/ssl/certs/localhost/info.txt
[INFO] Exclude: **/sandbox/examples/src/main/scripts/amis.txt
[INFO] Exclude: docs/**
[INFO] 9 resources included (use -debug for more details)
[INFO] Rat check: Summary of files. Unapproved: 0 unknown: 0 generated: 0 approved: 7 licence.
[INFO]
[INFO] --- maven-source-plugin:2.4:jar-no-fork (attach-sources) @ brooklyn-archetype-quickstart ---
[INFO] Building jar: F:\hudson\hudson-slave\workspace\incubator-brooklyn-master-windows\usage\archetypes\quickstart\target\brooklyn-archetype-quickstart-0.9.0-SNAPSHOT-sources.jar
[INFO]
[INFO] --- maven-install-plugin:2.5.2:install (default-install) @ brooklyn-archetype-quickstart ---
[INFO] Installing F:\hudson\hudson-slave\workspace\incubator-brooklyn-master-windows\usage\archetypes\quickstart\target\brooklyn-archetype-quickstart-0.9.0-SNAPSHOT.jar to f:\hudson\hudson-slave\maven-repositories\0\org\apache\brooklyn\brooklyn-archetype-quickstart\0.9.0-SNAPSHOT\brooklyn-archetype-quickstart-0.9.0-SNAPSHOT.jar
[INFO] Installing F:\hudson\hudson-slave\workspace\incubator-brooklyn-master-windows\usage\archetypes\quickstart\pom.xml to f:\hudson\hudson-slave\maven-repositories\0\org\apache\brooklyn\brooklyn-archetype-quickstart\0.9.0-SNAPSHOT\brooklyn-archetype-quickstart-0.9.0-SNAPSHOT.pom
[INFO] Installing F:\hudson\hudson-slave\workspace\incubator-brooklyn-master-windows\usage\archetypes\quickstart\target\brooklyn-archetype-quickstart-0.9.0-SNAPSHOT-tests.jar to f:\hudson\hudson-slave\maven-repositories\0\org\apache\brooklyn\brooklyn-archetype-quickstart\0.9.0-SNAPSHOT\brooklyn-archetype-quickstart-0.9.0-SNAPSHOT-tests.jar
[INFO] Installing F:\hudson\hudson-slave\workspace\incubator-brooklyn-master-windows\usage\archetypes\quickstart\target\brooklyn-archetype-quickstart-0.9.0-SNAPSHOT-sources.jar to f:\hudson\hudson-slave\maven-repositories\0\org\apache\brooklyn\brooklyn-archetype-quickstart\0.9.0-SNAPSHOT\brooklyn-archetype-quickstart-0.9.0-SNAPSHOT-sources.jar
[INFO]
[INFO] --- maven-archetype-plugin:2.3:update-local-catalog (default-update-local-catalog) @ brooklyn-archetype-quickstart ---
[JENKINS] Archiving disabled
[INFO]
[INFO] ------------------------------------------------------------------------
[INFO] Skipping Brooklyn Distribution
[INFO] This project has been banned from the build due to previous failures.
[INFO] ------------------------------------------------------------------------
[INFO]
[INFO] ------------------------------------------------------------------------
[INFO] Skipping Brooklyn QA
[INFO] This project has been banned from the build due to previous failures.
[INFO] ------------------------------------------------------------------------
[INFO]
[INFO] ------------------------------------------------------------------------
[INFO] Skipping Brooklyn REST Client
[INFO] This project has been banned from the build due to previous failures.
[INFO] ------------------------------------------------------------------------
[INFO] ------------------------------------------------------------------------
[INFO] Reactor Summary:
[INFO]
[INFO] Brooklyn Root ..................................... SUCCESS [4.630s]
[INFO] Brooklyn Parent Project ........................... SUCCESS [8.982s]
[INFO] Brooklyn Logback Configuration .................... SUCCESS [10.438s]
[INFO] Brooklyn Test Support Utilities ................... SUCCESS [10.428s]
[INFO] Brooklyn Logback Includable Configuration ......... SUCCESS [4.093s]
[INFO] Brooklyn Common Utilities ......................... SUCCESS [1:42.230s]
[INFO] Brooklyn API ...................................... SUCCESS [11.935s]
[INFO] Brooklyn Test Support ............................. SUCCESS [8.263s]
[INFO] Brooklyn Downstream Project Parent ................ SUCCESS [0.309s]
[INFO] CAMP Server Parent Project ........................ SUCCESS [0.538s]
[INFO] CAMP Base ......................................... SUCCESS [17.099s]
[INFO] Brooklyn REST Swagger Apidoc Utilities ............ SUCCESS [10.671s]
[INFO] CAMP Server ....................................... SUCCESS [30.830s]
[INFO] Brooklyn Groovy Utilities ......................... SUCCESS [42.811s]
[INFO] Brooklyn Core ..................................... FAILURE [21:49.697s]
[INFO] Brooklyn Examples Aggregator Project .............. SUCCESS [0.545s]
[INFO] Brooklyn Examples Aggregator Project - Webapps .... SUCCESS [0.747s]
[INFO] hello-world-webapp Maven Webapp ................... SUCCESS [1.501s]
[INFO] hello-world-sql-webapp Maven Webapp ............... SUCCESS [4.125s]
[INFO] Brooklyn Policies ................................. SKIPPED
[INFO] Brooklyn Jclouds Location Targets ................. SKIPPED
[INFO] Brooklyn Secure JMXMP Agent ....................... SKIPPED
[INFO] Brooklyn JMX RMI Agent ............................ SUCCESS [9.490s]
[INFO] Brooklyn Software Base ............................ SKIPPED
[INFO] Brooklyn Web App Software Entities ................ SKIPPED
[INFO] Brooklyn Messaging Software Entities .............. SKIPPED
[INFO] Brooklyn Database Software Entities ............... SKIPPED
[INFO] Brooklyn Monitoring Software Entities ............. SKIPPED
[INFO] Brooklyn OSGi Software Entities ................... SKIPPED
[INFO] Brooklyn NoSQL Data Store Software Entities ....... SKIPPED
[INFO] Brooklyn Network Software Entities ................ SKIPPED
[INFO] Brooklyn REST API ................................. SUCCESS [48.815s]
[INFO] Brooklyn CAMP REST API ............................ SKIPPED
[INFO] Brooklyn REST Server .............................. SKIPPED
[INFO] Brooklyn REST JavaScript Web GUI .................. SKIPPED
[INFO] Brooklyn Launcher ................................. SKIPPED
[INFO] Brooklyn Command Line Interface ................... SKIPPED
[INFO] Brooklyn All Things ............................... SKIPPED
[INFO] Brooklyn Simple Web Cluster Example ............... SKIPPED
[INFO] Brooklyn Global Web Fabric Example ................ SKIPPED
[INFO] Brooklyn Simple Messaging Publish-Subscribe Example SKIPPED
[INFO] Brooklyn NoSQL Cluster Examples ................... SKIPPED
[INFO] Brooklyn Hazelcast Storage ........................ SKIPPED
[INFO] Brooklyn Quick-Start Project Archetype ............ SUCCESS [2:27.128s]
[INFO] Brooklyn Distribution ............................. SKIPPED
[INFO] Brooklyn QA ....................................... SKIPPED
[INFO] Brooklyn REST Client .............................. SKIPPED
[INFO] ------------------------------------------------------------------------
[INFO] BUILD FAILURE
[INFO] ------------------------------------------------------------------------
[INFO] Total time: 29:58.696s
[INFO] Finished at: Mon Sep 21 16:22:06 BST 2015
[INFO] Final Memory: 66M/242M
[INFO] ------------------------------------------------------------------------
[JENKINS] Archiving disabled
[JENKINS] Archiving disabled
[JENKINS] Archiving disabled
[JENKINS] Archiving disabled
[JENKINS] Archiving disabled
[JENKINS] Archiving disabled
[JENKINS] Archiving disabled
[JENKINS] Archiving disabled
[JENKINS] Archiving disabled
[JENKINS] Archiving disabled
[JENKINS] Archiving disabled
[JENKINS] Archiving disabled
[JENKINS] Archiving disabled
[JENKINS] Archiving disabled
[JENKINS] Archiving disabled
[JENKINS] Archiving disabled
[JENKINS] Archiving disabled
[JENKINS] Archiving disabled
[JENKINS] Archiving disabled
[JENKINS] Archiving disabled
[JENKINS] Archiving disabled
[JENKINS] Archiving disabled
[JENKINS] Archiving disabled
[JENKINS] Archiving disabled
[JENKINS] Archiving disabled
[JENKINS] Archiving disabled
[JENKINS] Archiving disabled
[JENKINS] Archiving disabled
[JENKINS] Archiving disabled
[JENKINS] Archiving disabled
[JENKINS] Archiving disabled
[JENKINS] Archiving disabled
[JENKINS] Archiving disabled
[JENKINS] Archiving disabled
[JENKINS] Archiving disabled
[JENKINS] Archiving disabled
[JENKINS] Archiving disabled
[JENKINS] Archiving disabled
[JENKINS] Archiving disabled
[JENKINS] Archiving disabled
[JENKINS] Archiving disabled
[JENKINS] Archiving disabled
[JENKINS] Archiving disabled
[JENKINS] Archiving disabled
[JENKINS] Archiving disabled
[JENKINS] Archiving disabled
[JENKINS] Archiving disabled
Waiting for Jenkins to finish collecting data
[ERROR] Failed to execute goal org.apache.maven.plugins:maven-surefire-plugin:2.18.1:test (default-test) on project brooklyn-core: There are test failures.
[ERROR]
[ERROR] Please refer to F:\hudson\hudson-slave\workspace\incubator-brooklyn-master-windows\core\target\surefire-reports for the individual test results.
[ERROR] -> [Help 1]
[ERROR]
[ERROR] To see the full stack trace of the errors, re-run Maven with the -e switch.
[ERROR] Re-run Maven using the -X switch to enable full debug logging.
[ERROR]
[ERROR] For more information about the errors and possible solutions, please read the following articles:
[ERROR] [Help 1] http://cwiki.apache.org/confluence/display/MAVEN/MojoFailureException
[ERROR]
[ERROR] After correcting the problems, you can resume the build with the command
[ERROR] mvn <goals> -rf :brooklyn-core
channel stopped
Build failed in Jenkins: incubator-brooklyn-master-windows #296
Posted by Apache Jenkins Server <je...@builds.apache.org>.
See <https://builds.apache.org/job/incubator-brooklyn-master-windows/296/changes>
Changes:
[aled.sage] winrm docs: more tips/limitations
------------------------------------------
[...truncated 16630 lines...]
[INFO] Exclude: **/*.log
[INFO] Exclude: **/brooklyn*.log.*
[INFO] Exclude: **/target/**
[INFO] Exclude: ignored/**
[INFO] Exclude: LICENSE.md
[INFO] Exclude: **/src/main/license/**
[INFO] Exclude: **/src/test/license/**
[INFO] Exclude: **/MANIFEST.MF
[INFO] Exclude: **/test-output/**
[INFO] Exclude: **/*.pem.pub
[INFO] Exclude: **/*.pem
[INFO] Exclude: **/*_rsa.pub
[INFO] Exclude: **/*_rsa
[INFO] Exclude: **/*.svg
[INFO] Exclude: **/*.crt
[INFO] Exclude: **/*.csr
[INFO] Exclude: **/*.key
[INFO] Exclude: **/*.key.org
[INFO] Exclude: **/*.psd
[INFO] Exclude: **/*.json
[INFO] Exclude: **/*.plxarc
[INFO] Exclude: **/src/test/resources/org/apache/brooklyn/entity/software/base/template_with_extra_substitutions.txt
[INFO] Exclude: **/src/main/resources/banner.txt
[INFO] Exclude: **/src/test/resources/ssl/certs/localhost/info.txt
[INFO] Exclude: **/sandbox/examples/src/main/scripts/amis.txt
[INFO] Exclude: docs/**
[INFO] 3 resources included (use -debug for more details)
[INFO] Rat check: Summary of files. Unapproved: 0 unknown: 0 generated: 0 approved: 3 licence.
[INFO]
[INFO] --- maven-source-plugin:2.4:jar-no-fork (attach-sources) @ brooklyn-jmxrmi-agent ---
[INFO] Building jar: F:\hudson\hudson-slave\workspace\incubator-brooklyn-master-windows\utils\jmx\jmxrmi-agent\target\brooklyn-jmxrmi-agent-0.9.0-SNAPSHOT-sources.jar
[INFO]
[INFO] --- maven-install-plugin:2.5.2:install (default-install) @ brooklyn-jmxrmi-agent ---
[INFO] Installing F:\hudson\hudson-slave\workspace\incubator-brooklyn-master-windows\utils\jmx\jmxrmi-agent\target\brooklyn-jmxrmi-agent-0.9.0-SNAPSHOT.jar to f:\hudson\hudson-slave\maven-repositories\0\org\apache\brooklyn\brooklyn-jmxrmi-agent\0.9.0-SNAPSHOT\brooklyn-jmxrmi-agent-0.9.0-SNAPSHOT.jar
[INFO] Installing F:\hudson\hudson-slave\workspace\incubator-brooklyn-master-windows\utils\jmx\jmxrmi-agent\pom.xml to f:\hudson\hudson-slave\maven-repositories\0\org\apache\brooklyn\brooklyn-jmxrmi-agent\0.9.0-SNAPSHOT\brooklyn-jmxrmi-agent-0.9.0-SNAPSHOT.pom
[INFO] Installing F:\hudson\hudson-slave\workspace\incubator-brooklyn-master-windows\utils\jmx\jmxrmi-agent\target\brooklyn-jmxrmi-agent-0.9.0-SNAPSHOT-tests.jar to f:\hudson\hudson-slave\maven-repositories\0\org\apache\brooklyn\brooklyn-jmxrmi-agent\0.9.0-SNAPSHOT\brooklyn-jmxrmi-agent-0.9.0-SNAPSHOT-tests.jar
[INFO] Installing F:\hudson\hudson-slave\workspace\incubator-brooklyn-master-windows\utils\jmx\jmxrmi-agent\target\brooklyn-jmxrmi-agent-0.9.0-SNAPSHOT-sources.jar to f:\hudson\hudson-slave\maven-repositories\0\org\apache\brooklyn\brooklyn-jmxrmi-agent\0.9.0-SNAPSHOT\brooklyn-jmxrmi-agent-0.9.0-SNAPSHOT-sources.jar
[JENKINS] Archiving disabled
[INFO]
[INFO] ------------------------------------------------------------------------
[INFO] Skipping Brooklyn Software Base
[INFO] This project has been banned from the build due to previous failures.
[INFO] ------------------------------------------------------------------------
[INFO]
[INFO] ------------------------------------------------------------------------
[INFO] Skipping Brooklyn Web App Software Entities
[INFO] This project has been banned from the build due to previous failures.
[INFO] ------------------------------------------------------------------------
[INFO]
[INFO] ------------------------------------------------------------------------
[INFO] Skipping Brooklyn Messaging Software Entities
[INFO] This project has been banned from the build due to previous failures.
[INFO] ------------------------------------------------------------------------
[INFO]
[INFO] ------------------------------------------------------------------------
[INFO] Skipping Brooklyn Database Software Entities
[INFO] This project has been banned from the build due to previous failures.
[INFO] ------------------------------------------------------------------------
[INFO]
[INFO] ------------------------------------------------------------------------
[INFO] Skipping Brooklyn Monitoring Software Entities
[INFO] This project has been banned from the build due to previous failures.
[INFO] ------------------------------------------------------------------------
[INFO]
[INFO] ------------------------------------------------------------------------
[INFO] Skipping Brooklyn OSGi Software Entities
[INFO] This project has been banned from the build due to previous failures.
[INFO] ------------------------------------------------------------------------
[INFO]
[INFO] ------------------------------------------------------------------------
[INFO] Skipping Brooklyn NoSQL Data Store Software Entities
[INFO] This project has been banned from the build due to previous failures.
[INFO] ------------------------------------------------------------------------
[INFO]
[INFO] ------------------------------------------------------------------------
[INFO] Skipping Brooklyn Network Software Entities
[INFO] This project has been banned from the build due to previous failures.
[INFO] ------------------------------------------------------------------------
[INFO]
[INFO] ------------------------------------------------------------------------
[INFO] Skipping Brooklyn CAMP REST API
[INFO] This project has been banned from the build due to previous failures.
[INFO] ------------------------------------------------------------------------
[INFO]
[INFO] ------------------------------------------------------------------------
[INFO] Skipping Brooklyn REST Server
[INFO] This project has been banned from the build due to previous failures.
[INFO] ------------------------------------------------------------------------
[INFO]
[INFO] ------------------------------------------------------------------------
[INFO] Skipping Brooklyn REST JavaScript Web GUI
[INFO] This project has been banned from the build due to previous failures.
[INFO] ------------------------------------------------------------------------
[INFO]
[INFO] ------------------------------------------------------------------------
[INFO] Skipping Brooklyn Launcher
[INFO] This project has been banned from the build due to previous failures.
[INFO] ------------------------------------------------------------------------
[INFO]
[INFO] ------------------------------------------------------------------------
[INFO] Skipping Brooklyn Command Line Interface
[INFO] This project has been banned from the build due to previous failures.
[INFO] ------------------------------------------------------------------------
[INFO]
[INFO] ------------------------------------------------------------------------
[INFO] Skipping Brooklyn All Things
[INFO] This project has been banned from the build due to previous failures.
[INFO] ------------------------------------------------------------------------
[INFO]
[INFO] ------------------------------------------------------------------------
[INFO] Skipping Brooklyn Simple Web Cluster Example
[INFO] This project has been banned from the build due to previous failures.
[INFO] ------------------------------------------------------------------------
[INFO]
[INFO] ------------------------------------------------------------------------
[INFO] Skipping Brooklyn Global Web Fabric Example
[INFO] This project has been banned from the build due to previous failures.
[INFO] ------------------------------------------------------------------------
[INFO]
[INFO] ------------------------------------------------------------------------
[INFO] Skipping Brooklyn Simple Messaging Publish-Subscribe Example
[INFO] This project has been banned from the build due to previous failures.
[INFO] ------------------------------------------------------------------------
[INFO]
[INFO] ------------------------------------------------------------------------
[INFO] Skipping Brooklyn NoSQL Cluster Examples
[INFO] This project has been banned from the build due to previous failures.
[INFO] ------------------------------------------------------------------------
[INFO]
[INFO] ------------------------------------------------------------------------
[INFO] Skipping Brooklyn Hazelcast Storage
[INFO] This project has been banned from the build due to previous failures.
[INFO] ------------------------------------------------------------------------
[INFO]
[INFO] ------------------------------------------------------------------------
[INFO] Skipping Brooklyn Distribution
[INFO] This project has been banned from the build due to previous failures.
[INFO] ------------------------------------------------------------------------
[INFO]
[INFO] ------------------------------------------------------------------------
[INFO] Skipping Brooklyn QA
[INFO] This project has been banned from the build due to previous failures.
[INFO] ------------------------------------------------------------------------
[INFO]
[INFO] ------------------------------------------------------------------------
[INFO] Skipping Brooklyn REST Client
[INFO] This project has been banned from the build due to previous failures.
[INFO] ------------------------------------------------------------------------
[INFO] ------------------------------------------------------------------------
[INFO] Reactor Summary:
[INFO]
[INFO] Brooklyn Root ..................................... SUCCESS [9.610s]
[INFO] Brooklyn Parent Project ........................... SUCCESS [28.927s]
[INFO] Brooklyn Logback Configuration .................... SUCCESS [19.951s]
[INFO] Brooklyn Test Support Utilities ................... SUCCESS [10.593s]
[INFO] Brooklyn Logback Includable Configuration ......... SUCCESS [3.477s]
[INFO] Brooklyn Common Utilities ......................... SUCCESS [6:45.648s]
[INFO] Brooklyn API ...................................... SUCCESS [11.966s]
[INFO] Brooklyn Test Support ............................. SUCCESS [6.336s]
[INFO] CAMP Server Parent Project ........................ SUCCESS [0.585s]
[INFO] CAMP Base ......................................... SUCCESS [15.757s]
[INFO] Brooklyn Groovy Utilities ......................... SUCCESS [47.441s]
[INFO] Brooklyn Core ..................................... FAILURE [23:57.823s]
[INFO] Brooklyn Policies ................................. SKIPPED
[INFO] Brooklyn Jclouds Location Targets ................. SKIPPED
[INFO] Brooklyn Secure JMXMP Agent ....................... SKIPPED
[INFO] Brooklyn JMX RMI Agent ............................ SUCCESS [6.973s]
[INFO] Brooklyn Software Base ............................ SKIPPED
[INFO] Brooklyn Web App Software Entities ................ SKIPPED
[INFO] Brooklyn Messaging Software Entities .............. SKIPPED
[INFO] Brooklyn Database Software Entities ............... SKIPPED
[INFO] Brooklyn Monitoring Software Entities ............. SKIPPED
[INFO] Brooklyn OSGi Software Entities ................... SKIPPED
[INFO] Brooklyn NoSQL Data Store Software Entities ....... SKIPPED
[INFO] Brooklyn Network Software Entities ................ SKIPPED
[INFO] Brooklyn CAMP REST API ............................ SKIPPED
[INFO] Brooklyn REST Server .............................. SKIPPED
[INFO] Brooklyn REST JavaScript Web GUI .................. SKIPPED
[INFO] Brooklyn Launcher ................................. SKIPPED
[INFO] Brooklyn Command Line Interface ................... SKIPPED
[INFO] Brooklyn All Things ............................... SKIPPED
[INFO] Brooklyn Simple Web Cluster Example ............... SKIPPED
[INFO] Brooklyn Global Web Fabric Example ................ SKIPPED
[INFO] Brooklyn Simple Messaging Publish-Subscribe Example SKIPPED
[INFO] Brooklyn NoSQL Cluster Examples ................... SKIPPED
[INFO] Brooklyn Hazelcast Storage ........................ SKIPPED
[INFO] Brooklyn Distribution ............................. SKIPPED
[INFO] Brooklyn QA ....................................... SKIPPED
[INFO] Brooklyn REST Client .............................. SKIPPED
[INFO] ------------------------------------------------------------------------
[INFO] BUILD FAILURE
[INFO] ------------------------------------------------------------------------
[INFO] Total time: 33:45.695s
[INFO] Finished at: Fri Sep 25 16:32:29 BST 2015
[INFO] Final Memory: 56M/240M
[INFO] ------------------------------------------------------------------------
[JENKINS] Archiving disabled
[JENKINS] Archiving disabled
[JENKINS] Archiving disabled
[JENKINS] Archiving disabled
[JENKINS] Archiving disabled
[JENKINS] Archiving disabled
[JENKINS] Archiving disabled
[JENKINS] Archiving disabled
[JENKINS] Archiving disabled
[JENKINS] Archiving disabled
[JENKINS] Archiving disabled
[JENKINS] Archiving disabled
[JENKINS] Archiving disabled
[JENKINS] Archiving disabled
[JENKINS] Archiving disabled
[JENKINS] Archiving disabled
[JENKINS] Archiving disabled
[JENKINS] Archiving disabled
[JENKINS] Archiving disabled
[JENKINS] Archiving disabled
[JENKINS] Archiving disabled
[JENKINS] Archiving disabled
[JENKINS] Archiving disabled
[JENKINS] Archiving disabled
[JENKINS] Archiving disabled
[JENKINS] Archiving disabled
[JENKINS] Archiving disabled
[JENKINS] Archiving disabled
[JENKINS] Archiving disabled
[JENKINS] Archiving disabled
[JENKINS] Archiving disabled
[JENKINS] Archiving disabled
[JENKINS] Archiving disabled
[JENKINS] Archiving disabled
[JENKINS] Archiving disabled
[JENKINS] Archiving disabled
[JENKINS] Archiving disabled
[JENKINS] Archiving disabled
Waiting for Jenkins to finish collecting data
[ERROR] Failed to execute goal org.apache.maven.plugins:maven-surefire-plugin:2.18.1:test (default-test) on project brooklyn-core: There are test failures.
[ERROR]
[ERROR] Please refer to F:\hudson\hudson-slave\workspace\incubator-brooklyn-master-windows\core\target\surefire-reports for the individual test results.
[ERROR] -> [Help 1]
[ERROR]
[ERROR] To see the full stack trace of the errors, re-run Maven with the -e switch.
[ERROR] Re-run Maven using the -X switch to enable full debug logging.
[ERROR]
[ERROR] For more information about the errors and possible solutions, please read the following articles:
[ERROR] [Help 1] http://cwiki.apache.org/confluence/display/MAVEN/MojoFailureException
[ERROR]
[ERROR] After correcting the problems, you can resume the build with the command
[ERROR] mvn <goals> -rf :brooklyn-core
channel stopped
Build failed in Jenkins: incubator-brooklyn-master-windows #295
Posted by Apache Jenkins Server <je...@builds.apache.org>.
See <https://builds.apache.org/job/incubator-brooklyn-master-windows/295/changes>
Changes:
[valentin.aitken] Pass EntitlementContext to effectors
------------------------------------------
[...truncated 16315 lines...]
[INFO]
[INFO] --- maven-resources-plugin:2.7:testResources (default-testResources) @ brooklyn-jmxrmi-agent ---
[INFO] Using 'UTF-8' encoding to copy filtered resources.
[INFO] skip non existing resourceDirectory F:\hudson\hudson-slave\workspace\incubator-brooklyn-master-windows\utils\jmx\jmxrmi-agent\src\test\resources
[INFO] Copying 4 resources
[INFO]
[INFO] --- maven-compiler-plugin:3.3:testCompile (default-testCompile) @ brooklyn-jmxrmi-agent ---
[INFO] Changes detected - recompiling the module!
[INFO] Compiling 1 source file to F:\hudson\hudson-slave\workspace\incubator-brooklyn-master-windows\utils\jmx\jmxrmi-agent\target\test-classes
[INFO]
[INFO] --- maven-surefire-plugin:2.18.1:test (default-test) @ brooklyn-jmxrmi-agent ---
[JENKINS] Recording test results
[INFO]
[INFO] --- maven-jar-plugin:2.6:jar (default-jar) @ brooklyn-jmxrmi-agent ---
[INFO] Building jar: F:\hudson\hudson-slave\workspace\incubator-brooklyn-master-windows\utils\jmx\jmxrmi-agent\target\brooklyn-jmxrmi-agent-0.9.0-SNAPSHOT.jar
[INFO]
[INFO] --- maven-site-plugin:3.4:attach-descriptor (attach-descriptor) @ brooklyn-jmxrmi-agent ---
[INFO]
[INFO] --- maven-jar-plugin:2.6:test-jar (test-jar-creation) @ brooklyn-jmxrmi-agent ---
[INFO] Building jar: F:\hudson\hudson-slave\workspace\incubator-brooklyn-master-windows\utils\jmx\jmxrmi-agent\target\brooklyn-jmxrmi-agent-0.9.0-SNAPSHOT-tests.jar
[INFO]
[INFO] --- apache-rat-plugin:0.10:check (default) @ brooklyn-jmxrmi-agent ---
[INFO] 51 implicit excludes (use -debug for more details).
[INFO] Exclude: sandbox/**
[INFO] Exclude: release/**
[INFO] Exclude: **/nbactions.xml
[INFO] Exclude: **/nb-configuration.xml
[INFO] Exclude: **/.git/**
[INFO] Exclude: **/.gitignore
[INFO] Exclude: **/.repository/**
[INFO] Exclude: **/.idea/**
[INFO] Exclude: **/*.iml
[INFO] Exclude: **/.classpath/**
[INFO] Exclude: **/.project
[INFO] Exclude: **/.settings/**
[INFO] Exclude: **/*.log
[INFO] Exclude: **/brooklyn*.log.*
[INFO] Exclude: **/target/**
[INFO] Exclude: ignored/**
[INFO] Exclude: LICENSE.md
[INFO] Exclude: **/src/main/license/**
[INFO] Exclude: **/src/test/license/**
[INFO] Exclude: **/MANIFEST.MF
[INFO] Exclude: **/test-output/**
[INFO] Exclude: **/*.pem.pub
[INFO] Exclude: **/*.pem
[INFO] Exclude: **/*_rsa.pub
[INFO] Exclude: **/*_rsa
[INFO] Exclude: **/*.svg
[INFO] Exclude: **/*.crt
[INFO] Exclude: **/*.csr
[INFO] Exclude: **/*.key
[INFO] Exclude: **/*.key.org
[INFO] Exclude: **/*.psd
[INFO] Exclude: **/*.json
[INFO] Exclude: **/*.plxarc
[INFO] Exclude: **/src/test/resources/org/apache/brooklyn/entity/software/base/template_with_extra_substitutions.txt
[INFO] Exclude: **/src/main/resources/banner.txt
[INFO] Exclude: **/src/test/resources/ssl/certs/localhost/info.txt
[INFO] Exclude: **/sandbox/examples/src/main/scripts/amis.txt
[INFO] Exclude: docs/**
[INFO] 3 resources included (use -debug for more details)
[INFO] Rat check: Summary of files. Unapproved: 0 unknown: 0 generated: 0 approved: 3 licence.
[INFO]
[INFO] --- maven-source-plugin:2.4:jar-no-fork (attach-sources) @ brooklyn-jmxrmi-agent ---
[INFO] Building jar: F:\hudson\hudson-slave\workspace\incubator-brooklyn-master-windows\utils\jmx\jmxrmi-agent\target\brooklyn-jmxrmi-agent-0.9.0-SNAPSHOT-sources.jar
[INFO]
[INFO] --- maven-install-plugin:2.5.2:install (default-install) @ brooklyn-jmxrmi-agent ---
[INFO] Installing F:\hudson\hudson-slave\workspace\incubator-brooklyn-master-windows\utils\jmx\jmxrmi-agent\target\brooklyn-jmxrmi-agent-0.9.0-SNAPSHOT.jar to f:\hudson\hudson-slave\maven-repositories\0\org\apache\brooklyn\brooklyn-jmxrmi-agent\0.9.0-SNAPSHOT\brooklyn-jmxrmi-agent-0.9.0-SNAPSHOT.jar
[INFO] Installing F:\hudson\hudson-slave\workspace\incubator-brooklyn-master-windows\utils\jmx\jmxrmi-agent\pom.xml to f:\hudson\hudson-slave\maven-repositories\0\org\apache\brooklyn\brooklyn-jmxrmi-agent\0.9.0-SNAPSHOT\brooklyn-jmxrmi-agent-0.9.0-SNAPSHOT.pom
[INFO] Installing F:\hudson\hudson-slave\workspace\incubator-brooklyn-master-windows\utils\jmx\jmxrmi-agent\target\brooklyn-jmxrmi-agent-0.9.0-SNAPSHOT-tests.jar to f:\hudson\hudson-slave\maven-repositories\0\org\apache\brooklyn\brooklyn-jmxrmi-agent\0.9.0-SNAPSHOT\brooklyn-jmxrmi-agent-0.9.0-SNAPSHOT-tests.jar
[INFO] Installing F:\hudson\hudson-slave\workspace\incubator-brooklyn-master-windows\utils\jmx\jmxrmi-agent\target\brooklyn-jmxrmi-agent-0.9.0-SNAPSHOT-sources.jar to f:\hudson\hudson-slave\maven-repositories\0\org\apache\brooklyn\brooklyn-jmxrmi-agent\0.9.0-SNAPSHOT\brooklyn-jmxrmi-agent-0.9.0-SNAPSHOT-sources.jar
[JENKINS] Archiving disabled
[INFO]
[INFO] ------------------------------------------------------------------------
[INFO] Skipping Brooklyn Software Base
[INFO] This project has been banned from the build due to previous failures.
[INFO] ------------------------------------------------------------------------
[INFO]
[INFO] ------------------------------------------------------------------------
[INFO] Skipping Brooklyn Web App Software Entities
[INFO] This project has been banned from the build due to previous failures.
[INFO] ------------------------------------------------------------------------
[INFO]
[INFO] ------------------------------------------------------------------------
[INFO] Skipping Brooklyn Database Software Entities
[INFO] This project has been banned from the build due to previous failures.
[INFO] ------------------------------------------------------------------------
[INFO]
[INFO] ------------------------------------------------------------------------
[INFO] Skipping Brooklyn NoSQL Data Store Software Entities
[INFO] This project has been banned from the build due to previous failures.
[INFO] ------------------------------------------------------------------------
[INFO]
[INFO] ------------------------------------------------------------------------
[INFO] Skipping Brooklyn CAMP REST API
[INFO] This project has been banned from the build due to previous failures.
[INFO] ------------------------------------------------------------------------
[INFO]
[INFO] ------------------------------------------------------------------------
[INFO] Skipping Brooklyn REST Server
[INFO] This project has been banned from the build due to previous failures.
[INFO] ------------------------------------------------------------------------
[INFO]
[INFO] ------------------------------------------------------------------------
[INFO] Skipping Brooklyn REST JavaScript Web GUI
[INFO] This project has been banned from the build due to previous failures.
[INFO] ------------------------------------------------------------------------
[INFO]
[INFO] ------------------------------------------------------------------------
[INFO] Skipping Brooklyn Launcher
[INFO] This project has been banned from the build due to previous failures.
[INFO] ------------------------------------------------------------------------
[INFO]
[INFO] ------------------------------------------------------------------------
[INFO] Skipping Brooklyn Command Line Interface
[INFO] This project has been banned from the build due to previous failures.
[INFO] ------------------------------------------------------------------------
[INFO]
[INFO] ------------------------------------------------------------------------
[INFO] Skipping Brooklyn All Things
[INFO] This project has been banned from the build due to previous failures.
[INFO] ------------------------------------------------------------------------
[INFO]
[INFO] ------------------------------------------------------------------------
[INFO] Skipping Brooklyn Simple Web Cluster Example
[INFO] This project has been banned from the build due to previous failures.
[INFO] ------------------------------------------------------------------------
[INFO]
[INFO] ------------------------------------------------------------------------
[INFO] Skipping Brooklyn Global Web Fabric Example
[INFO] This project has been banned from the build due to previous failures.
[INFO] ------------------------------------------------------------------------
[INFO]
[INFO] ------------------------------------------------------------------------
[INFO] Skipping Brooklyn Simple Messaging Publish-Subscribe Example
[INFO] This project has been banned from the build due to previous failures.
[INFO] ------------------------------------------------------------------------
[INFO]
[INFO] ------------------------------------------------------------------------
[INFO] Skipping Brooklyn NoSQL Cluster Examples
[INFO] This project has been banned from the build due to previous failures.
[INFO] ------------------------------------------------------------------------
[INFO]
[INFO] ------------------------------------------------------------------------
[INFO] Skipping Brooklyn Distribution
[INFO] This project has been banned from the build due to previous failures.
[INFO] ------------------------------------------------------------------------
[INFO]
[INFO] ------------------------------------------------------------------------
[INFO] Skipping Brooklyn QA
[INFO] This project has been banned from the build due to previous failures.
[INFO] ------------------------------------------------------------------------
[INFO]
[INFO] ------------------------------------------------------------------------
[INFO] Skipping Brooklyn REST Client
[INFO] This project has been banned from the build due to previous failures.
[INFO] ------------------------------------------------------------------------
[INFO] ------------------------------------------------------------------------
[INFO] Reactor Summary:
[INFO]
[INFO] Brooklyn Root ..................................... SUCCESS [7.106s]
[INFO] Brooklyn Parent Project ........................... SUCCESS [10.565s]
[INFO] Brooklyn Logback Configuration .................... SUCCESS [9.989s]
[INFO] Brooklyn Test Support Utilities ................... SUCCESS [8.834s]
[INFO] Brooklyn Logback Includable Configuration ......... SUCCESS [4.433s]
[INFO] Brooklyn Common Utilities ......................... SUCCESS [2:01.918s]
[INFO] Brooklyn API ...................................... SUCCESS [18.944s]
[INFO] Brooklyn Test Support ............................. SUCCESS [6.807s]
[INFO] CAMP Server Parent Project ........................ SUCCESS [0.772s]
[INFO] CAMP Base ......................................... SUCCESS [15.558s]
[INFO] Brooklyn Groovy Utilities ......................... SUCCESS [26.707s]
[INFO] Brooklyn Core ..................................... FAILURE [32:06.569s]
[INFO] Brooklyn Policies ................................. SKIPPED
[INFO] Brooklyn Jclouds Location Targets ................. SKIPPED
[INFO] Brooklyn Secure JMXMP Agent ....................... SKIPPED
[INFO] Brooklyn JMX RMI Agent ............................ SUCCESS [8.504s]
[INFO] Brooklyn Software Base ............................ SKIPPED
[INFO] Brooklyn Web App Software Entities ................ SKIPPED
[INFO] Brooklyn Database Software Entities ............... SKIPPED
[INFO] Brooklyn NoSQL Data Store Software Entities ....... SKIPPED
[INFO] Brooklyn CAMP REST API ............................ SKIPPED
[INFO] Brooklyn REST Server .............................. SKIPPED
[INFO] Brooklyn REST JavaScript Web GUI .................. SKIPPED
[INFO] Brooklyn Launcher ................................. SKIPPED
[INFO] Brooklyn Command Line Interface ................... SKIPPED
[INFO] Brooklyn All Things ............................... SKIPPED
[INFO] Brooklyn Simple Web Cluster Example ............... SKIPPED
[INFO] Brooklyn Global Web Fabric Example ................ SKIPPED
[INFO] Brooklyn Simple Messaging Publish-Subscribe Example SKIPPED
[INFO] Brooklyn NoSQL Cluster Examples ................... SKIPPED
[INFO] Brooklyn Distribution ............................. SKIPPED
[INFO] Brooklyn QA ....................................... SKIPPED
[INFO] Brooklyn REST Client .............................. SKIPPED
[INFO] ------------------------------------------------------------------------
[INFO] BUILD FAILURE
[INFO] ------------------------------------------------------------------------
[INFO] Total time: 36:20.580s
[INFO] Finished at: Thu Sep 24 10:19:30 BST 2015
[INFO] Final Memory: 56M/241M
[INFO] ------------------------------------------------------------------------
[JENKINS] Archiving disabled
[JENKINS] Archiving disabled
[JENKINS] Archiving disabled
[JENKINS] Archiving disabled
[JENKINS] Archiving disabled
[JENKINS] Archiving disabled
[JENKINS] Archiving disabled
[JENKINS] Archiving disabled
[JENKINS] Archiving disabled
[JENKINS] Archiving disabled
[JENKINS] Archiving disabled
[JENKINS] Archiving disabled
[JENKINS] Archiving disabled
[JENKINS] Archiving disabled
[JENKINS] Archiving disabled
[JENKINS] Archiving disabled
[JENKINS] Archiving disabled
[JENKINS] Archiving disabled
[JENKINS] Archiving disabled
[JENKINS] Archiving disabled
[JENKINS] Archiving disabled
[JENKINS] Archiving disabled
[JENKINS] Archiving disabled
[JENKINS] Archiving disabled
[JENKINS] Archiving disabled
[JENKINS] Archiving disabled
[JENKINS] Archiving disabled
[JENKINS] Archiving disabled
[JENKINS] Archiving disabled
[JENKINS] Archiving disabled
[JENKINS] Archiving disabled
[JENKINS] Archiving disabled
[JENKINS] Archiving disabled
Waiting for Jenkins to finish collecting data
[ERROR] Failed to execute goal org.apache.maven.plugins:maven-surefire-plugin:2.18.1:test (default-test) on project brooklyn-core: There are test failures.
[ERROR]
[ERROR] Please refer to F:\hudson\hudson-slave\workspace\incubator-brooklyn-master-windows\core\target\surefire-reports for the individual test results.
[ERROR] -> [Help 1]
[ERROR]
[ERROR] To see the full stack trace of the errors, re-run Maven with the -e switch.
[ERROR] Re-run Maven using the -X switch to enable full debug logging.
[ERROR]
[ERROR] For more information about the errors and possible solutions, please read the following articles:
[ERROR] [Help 1] http://cwiki.apache.org/confluence/display/MAVEN/MojoFailureException
[ERROR]
[ERROR] After correcting the problems, you can resume the build with the command
[ERROR] mvn <goals> -rf :brooklyn-core
channel stopped
Build failed in Jenkins: incubator-brooklyn-master-windows #294
Posted by Apache Jenkins Server <je...@builds.apache.org>.
See <https://builds.apache.org/job/incubator-brooklyn-master-windows/294/changes>
Changes:
[aled.sage] Move EntityLocal.setDisplayName to Entity
[aled.sage] Create entity.subscriptions() for grouping
[aled.sage] Create entity.enrichers() and entity.policies()
[aled.sage] Deleted EntityInternal.getSubscriptionContext
[aled.sage] Move subscriptions() from Entity to BrooklynObject
[aled.sage] Adds Entity.groups(), for group-related methods
[aled.sage] Move entityLocal.subscribe(map, …) to SubscriptionSupport
[aled.sage] Simplify PolicySupport etc method names
[aled.sage] entity.policies() etc returns an Iterable
------------------------------------------
[...truncated 30224 lines...]
SUREFIRE-859: [GC 700042K->483221K(768704K), 0.0150731 secs]
2015-09-23 12:45:31,107 INFO TESTNG PASSED CONFIGURATION: "Surefire test" - @BeforeMethod org.apache.brooklyn.camp.brooklyn.catalog.CatalogYamlVersioningTest.setUp() finished in 1955 ms
2015-09-23 12:45:31,107 INFO TESTNG INVOKING: "Surefire test" - org.apache.brooklyn.camp.brooklyn.catalog.CatalogYamlVersioningTest.testVersionedReferenceJustAddedImplicitVersionSyntax()
2015-09-23 12:45:31,439 INFO CAMP placing 'BasicApplicationImpl{id=jYL8cloR}' under management
2015-09-23 12:45:31,576 INFO Test - created org.apache.brooklyn.camp.spi.Assembly@30aa637[id=jYL8cloR; type=Assembly]
2015-09-23 12:45:31,576 INFO App - BasicApplicationImpl{id=jYL8cloR}
2015-09-23 12:45:31,771 INFO Started application BasicApplicationImpl{id=jYL8cloR}
2015-09-23 12:45:31,772 INFO TESTNG PASSED: "Surefire test" - org.apache.brooklyn.camp.brooklyn.catalog.CatalogYamlVersioningTest.testVersionedReferenceJustAddedImplicitVersionSyntax() finished in 665 ms
2015-09-23 12:45:31,773 INFO TESTNG INVOKING CONFIGURATION: "Surefire test" - @AfterMethod org.apache.brooklyn.camp.brooklyn.AbstractYamlTest.tearDown()
2015-09-23 12:45:31,957 INFO Stopping application BasicApplicationImpl{id=jYL8cloR}
2015-09-23 12:45:31,960 INFO Stopped application BasicApplicationImpl{id=jYL8cloR}
2015-09-23 12:45:32,314 INFO TESTNG PASSED CONFIGURATION: "Surefire test" - @AfterMethod org.apache.brooklyn.camp.brooklyn.AbstractYamlTest.tearDown() finished in 541 ms
2015-09-23 12:45:32,315 INFO TESTNG INVOKING: "Surefire test" - org.apache.brooklyn.camp.brooklyn.spi.dsl.DslParseTest.testParseFunctionChain()
2015-09-23 12:45:32,315 INFO TESTNG PASSED: "Surefire test" - org.apache.brooklyn.camp.brooklyn.spi.dsl.DslParseTest.testParseFunctionChain() finished in 1 ms
2015-09-23 12:45:32,315 INFO TESTNG INVOKING: "Surefire test" - org.apache.brooklyn.camp.brooklyn.spi.dsl.DslParseTest.testParseMultiArgMultiTypeFunction()
2015-09-23 12:45:32,316 INFO TESTNG PASSED: "Surefire test" - org.apache.brooklyn.camp.brooklyn.spi.dsl.DslParseTest.testParseMultiArgMultiTypeFunction() finished in 1 ms
2015-09-23 12:45:32,316 INFO TESTNG INVOKING: "Surefire test" - org.apache.brooklyn.camp.brooklyn.spi.dsl.DslParseTest.testParseNoArgFunction()
2015-09-23 12:45:32,317 INFO TESTNG PASSED: "Surefire test" - org.apache.brooklyn.camp.brooklyn.spi.dsl.DslParseTest.testParseNoArgFunction() finished in 1 ms
2015-09-23 12:45:32,317 INFO TESTNG INVOKING: "Surefire test" - org.apache.brooklyn.camp.brooklyn.spi.dsl.DslParseTest.testParseOneArgFunction()
2015-09-23 12:45:32,317 INFO TESTNG PASSED: "Surefire test" - org.apache.brooklyn.camp.brooklyn.spi.dsl.DslParseTest.testParseOneArgFunction() finished in 0 ms
2015-09-23 12:45:32,318 INFO TESTNG INVOKING: "Surefire test" - org.apache.brooklyn.camp.brooklyn.spi.dsl.DslParseTest.testParseString()
2015-09-23 12:45:32,318 INFO TESTNG PASSED: "Surefire test" - org.apache.brooklyn.camp.brooklyn.spi.dsl.DslParseTest.testParseString() finished in 0 ms
2015-09-23 12:45:32,319 INFO TESTNG INVOKING CONFIGURATION: "Surefire test" - @BeforeMethod org.apache.brooklyn.camp.brooklyn.test.lite.CampYamlLiteTest.setUp()
SUREFIRE-859: [GC 708693K->482370K(767488K), 0.0153173 secs]
2015-09-23 12:45:34,143 INFO TESTNG PASSED CONFIGURATION: "Surefire test" - @BeforeMethod org.apache.brooklyn.camp.brooklyn.test.lite.CampYamlLiteTest.setUp() finished in 1825 ms
2015-09-23 12:45:34,144 INFO TESTNG INVOKING: "Surefire test" - org.apache.brooklyn.camp.brooklyn.test.lite.CampYamlLiteTest.testAddChildrenEffector()
2015-09-23 12:45:35,358 INFO TESTNG PASSED: "Surefire test" - org.apache.brooklyn.camp.brooklyn.test.lite.CampYamlLiteTest.testAddChildrenEffector() finished in 1213 ms
2015-09-23 12:45:35,358 INFO TESTNG INVOKING CONFIGURATION: "Surefire test" - @AfterMethod org.apache.brooklyn.camp.brooklyn.test.lite.CampYamlLiteTest.tearDown()
2015-09-23 12:45:35,813 INFO TESTNG PASSED CONFIGURATION: "Surefire test" - @AfterMethod org.apache.brooklyn.camp.brooklyn.test.lite.CampYamlLiteTest.tearDown() finished in 455 ms
2015-09-23 12:45:35,814 INFO TESTNG INVOKING CONFIGURATION: "Surefire test" - @BeforeMethod org.apache.brooklyn.camp.brooklyn.test.lite.CampYamlLiteTest.setUp()
SUREFIRE-859: [GC 707842K->482483K(770496K), 0.0113364 secs]
2015-09-23 12:45:38,003 INFO TESTNG PASSED CONFIGURATION: "Surefire test" - @BeforeMethod org.apache.brooklyn.camp.brooklyn.test.lite.CampYamlLiteTest.setUp() finished in 2189 ms
2015-09-23 12:45:38,003 INFO TESTNG INVOKING: "Surefire test" - org.apache.brooklyn.camp.brooklyn.test.lite.CampYamlLiteTest.testRegisterCustomEntityWithBundleWhereEntityIsFromCoreAndIconFromBundle()
2015-09-23 12:45:38,033 INFO TESTNG PASSED: "Surefire test" - org.apache.brooklyn.camp.brooklyn.test.lite.CampYamlLiteTest.testRegisterCustomEntityWithBundleWhereEntityIsFromCoreAndIconFromBundle() finished in 30 ms
2015-09-23 12:45:38,034 INFO TESTNG INVOKING CONFIGURATION: "Surefire test" - @AfterMethod org.apache.brooklyn.camp.brooklyn.test.lite.CampYamlLiteTest.tearDown()
2015-09-23 12:45:38,428 INFO TESTNG PASSED CONFIGURATION: "Surefire test" - @AfterMethod org.apache.brooklyn.camp.brooklyn.test.lite.CampYamlLiteTest.tearDown() finished in 395 ms
2015-09-23 12:45:38,429 INFO TESTNG INVOKING CONFIGURATION: "Surefire test" - @BeforeMethod org.apache.brooklyn.camp.brooklyn.test.lite.CampYamlLiteTest.setUp()
SUREFIRE-859: [GC 711923K->481265K(769664K), 0.0148994 secs]
2015-09-23 12:45:40,773 INFO TESTNG PASSED CONFIGURATION: "Surefire test" - @BeforeMethod org.apache.brooklyn.camp.brooklyn.test.lite.CampYamlLiteTest.setUp() finished in 2345 ms
2015-09-23 12:45:40,773 INFO TESTNG INVOKING: "Surefire test" - org.apache.brooklyn.camp.brooklyn.test.lite.CampYamlLiteTest.testResetXmlWithCustomEntity()
SUREFIRE-859: [GC 710705K->484246K(772032K), 0.2054278 secs]
SUREFIRE-859: [GC 716630K->489234K(771072K), 0.1419488 secs]
2015-09-23 12:45:59,042 INFO TESTNG PASSED: "Surefire test" - org.apache.brooklyn.camp.brooklyn.test.lite.CampYamlLiteTest.testResetXmlWithCustomEntity() finished in 18269 ms
2015-09-23 12:45:59,042 INFO TESTNG INVOKING CONFIGURATION: "Surefire test" - @AfterMethod org.apache.brooklyn.camp.brooklyn.test.lite.CampYamlLiteTest.tearDown()
2015-09-23 12:45:59,511 INFO TESTNG PASSED CONFIGURATION: "Surefire test" - @AfterMethod org.apache.brooklyn.camp.brooklyn.test.lite.CampYamlLiteTest.tearDown() finished in 469 ms
2015-09-23 12:45:59,511 INFO TESTNG INVOKING CONFIGURATION: "Surefire test" - @BeforeMethod org.apache.brooklyn.camp.brooklyn.test.lite.CampYamlLiteTest.setUp()
SUREFIRE-859: [GC 721618K->492829K(772672K), 0.0955216 secs]
2015-09-23 12:46:01,379 INFO TESTNG PASSED CONFIGURATION: "Surefire test" - @BeforeMethod org.apache.brooklyn.camp.brooklyn.test.lite.CampYamlLiteTest.setUp() finished in 1868 ms
2015-09-23 12:46:01,379 INFO TESTNG INVOKING: "Surefire test" - org.apache.brooklyn.camp.brooklyn.test.lite.CampYamlLiteTest.testYamlServiceForCatalog()
2015-09-23 12:46:01,395 INFO TESTNG PASSED: "Surefire test" - org.apache.brooklyn.camp.brooklyn.test.lite.CampYamlLiteTest.testYamlServiceForCatalog() finished in 16 ms
2015-09-23 12:46:01,395 INFO TESTNG INVOKING CONFIGURATION: "Surefire test" - @AfterMethod org.apache.brooklyn.camp.brooklyn.test.lite.CampYamlLiteTest.tearDown()
2015-09-23 12:46:01,784 INFO TESTNG PASSED CONFIGURATION: "Surefire test" - @AfterMethod org.apache.brooklyn.camp.brooklyn.test.lite.CampYamlLiteTest.tearDown() finished in 389 ms
2015-09-23 12:46:01,785 INFO TESTNG INVOKING CONFIGURATION: "Surefire test" - @BeforeMethod org.apache.brooklyn.camp.brooklyn.test.lite.CampYamlLiteTest.setUp()
SUREFIRE-859: [GC 727261K->492037K(772480K), 0.1152565 secs]
2015-09-23 12:46:03,564 INFO TESTNG PASSED CONFIGURATION: "Surefire test" - @BeforeMethod org.apache.brooklyn.camp.brooklyn.test.lite.CampYamlLiteTest.setUp() finished in 1779 ms
2015-09-23 12:46:03,564 INFO TESTNG INVOKING: "Surefire test" - org.apache.brooklyn.camp.brooklyn.test.lite.CampYamlLiteTest.testYamlServiceMatchAndBrooklynInstantiate()
2015-09-23 12:46:03,567 INFO AT is:
org.apache.brooklyn.camp.spi.AssemblyTemplate@147e57a8[id=M81y8IDF; type=AssemblyTemplate]
2015-09-23 12:46:03,840 INFO TESTNG PASSED: "Surefire test" - org.apache.brooklyn.camp.brooklyn.test.lite.CampYamlLiteTest.testYamlServiceMatchAndBrooklynInstantiate() finished in 276 ms
2015-09-23 12:46:03,840 INFO TESTNG INVOKING CONFIGURATION: "Surefire test" - @AfterMethod org.apache.brooklyn.camp.brooklyn.test.lite.CampYamlLiteTest.tearDown()
2015-09-23 12:46:04,377 INFO TESTNG PASSED CONFIGURATION: "Surefire test" - @AfterMethod org.apache.brooklyn.camp.brooklyn.test.lite.CampYamlLiteTest.tearDown() finished in 537 ms
2015-09-23 12:46:08,233 INFO TESTNG
===============================================
Surefire test
Tests run: 221, Failures: 1, Skips: 0
===============================================
2015-09-23 12:46:08,234 INFO BrooklynLeakListener.onFinish attempting to terminate all extant ManagementContexts: name=Surefire test; includedGroups=[]; excludedGroups=[Integration, Acceptance, Live, WIP]; suiteName=Surefire suite; outDir=F:\hudson\hudson-slave\workspace\incubator-brooklyn-master-windows\usage\camp\target\surefire-reports\Surefire suite: no org.apache.brooklyn.core.management.internal.LocalManagementContext available, so skipped
Tests run: 221, Failures: 1, Errors: 0, Skipped: 0, Time elapsed: 994.168 sec <<< FAILURE! - in TestSuite
testRebindWithCatalogPropertiesForDeprecationAndEnablementAbsent(org.apache.brooklyn.camp.brooklyn.catalog.CatalogYamlRebindTest) Time elapsed: 4.775 sec <<< FAILURE!
java.nio.file.InvalidPathException: Illegal char <:> at index 94: C:\Users\hudson\AppData\Local\Temp\1\CatalogYamlRebindTest-HyxC\catalog\my.catalog.app.id.load:0.1.0.FU3qn854.tmp
at sun.nio.fs.WindowsPathParser.normalize(WindowsPathParser.java:176)
at sun.nio.fs.WindowsPathParser.parse(WindowsPathParser.java:147)
at sun.nio.fs.WindowsPathParser.parse(WindowsPathParser.java:77)
at sun.nio.fs.WindowsPath.parse(WindowsPath.java:94)
at sun.nio.fs.WindowsFileSystem.getPath(WindowsFileSystem.java:255)
at java.io.File.toPath(File.java:2069)
at org.apache.brooklyn.util.io.FilePermissions.apply(FilePermissions.java:61)
at org.apache.brooklyn.util.io.FileUtil.setFilePermissionsTo600(FileUtil.java:72)
at org.apache.brooklyn.core.mgmt.persist.FileBasedStoreObjectAccessor.put(FileBasedStoreObjectAccessor.java:82)
at org.apache.brooklyn.camp.brooklyn.catalog.CatalogYamlRebindTest$1.apply(CatalogYamlRebindTest.java:216)
at org.apache.brooklyn.camp.brooklyn.catalog.CatalogYamlRebindTest$1.apply(CatalogYamlRebindTest.java:209)
at org.apache.brooklyn.core.mgmt.rebind.RebindTestUtils.rebindAll(RebindTestUtils.java:433)
at org.apache.brooklyn.core.mgmt.rebind.RebindTestUtils.rebind(RebindTestUtils.java:318)
at org.apache.brooklyn.core.mgmt.rebind.RebindTestFixture.rebind(RebindTestFixture.java:254)
at org.apache.brooklyn.camp.brooklyn.AbstractYamlRebindTest.rebind(AbstractYamlRebindTest.java:86)
at org.apache.brooklyn.camp.brooklyn.catalog.CatalogYamlRebindTest.runRebindWithCatalogAndApp(CatalogYamlRebindTest.java:208)
at org.apache.brooklyn.camp.brooklyn.catalog.CatalogYamlRebindTest.testRebindWithCatalogPropertiesForDeprecationAndEnablementAbsent(CatalogYamlRebindTest.java:123)
Results :
Failed tests:
CatalogYamlRebindTest.testRebindWithCatalogPropertiesForDeprecationAndEnablementAbsent:123->runRebindWithCatalogAndApp:208->AbstractYamlRebindTest.rebind:86->RebindTestFixture.rebind:254 » InvalidPath
Tests run: 221, Failures: 1, Errors: 0, Skipped: 0
[JENKINS] Recording test results
[JENKINS] Archiving disabled
[INFO]
[INFO] ------------------------------------------------------------------------
[INFO] Skipping Brooklyn REST Server
[INFO] This project has been banned from the build due to previous failures.
[INFO] ------------------------------------------------------------------------
[INFO]
[INFO] ------------------------------------------------------------------------
[INFO] Skipping Brooklyn REST JavaScript Web GUI
[INFO] This project has been banned from the build due to previous failures.
[INFO] ------------------------------------------------------------------------
[INFO]
[INFO] ------------------------------------------------------------------------
[INFO] Skipping Brooklyn Launcher
[INFO] This project has been banned from the build due to previous failures.
[INFO] ------------------------------------------------------------------------
[INFO]
[INFO] ------------------------------------------------------------------------
[INFO] Skipping Brooklyn Command Line Interface
[INFO] This project has been banned from the build due to previous failures.
[INFO] ------------------------------------------------------------------------
[INFO]
[INFO] ------------------------------------------------------------------------
[INFO] Skipping Brooklyn All Things
[INFO] This project has been banned from the build due to previous failures.
[INFO] ------------------------------------------------------------------------
[INFO]
[INFO] ------------------------------------------------------------------------
[INFO] Skipping Brooklyn Simple Web Cluster Example
[INFO] This project has been banned from the build due to previous failures.
[INFO] ------------------------------------------------------------------------
[INFO]
[INFO] ------------------------------------------------------------------------
[INFO] Skipping Brooklyn Global Web Fabric Example
[INFO] This project has been banned from the build due to previous failures.
[INFO] ------------------------------------------------------------------------
[INFO]
[INFO] ------------------------------------------------------------------------
[INFO] Skipping Brooklyn Simple Messaging Publish-Subscribe Example
[INFO] This project has been banned from the build due to previous failures.
[INFO] ------------------------------------------------------------------------
[INFO]
[INFO] ------------------------------------------------------------------------
[INFO] Skipping Brooklyn NoSQL Cluster Examples
[INFO] This project has been banned from the build due to previous failures.
[INFO] ------------------------------------------------------------------------
[INFO]
[INFO] ------------------------------------------------------------------------
[INFO] Skipping Brooklyn Distribution
[INFO] This project has been banned from the build due to previous failures.
[INFO] ------------------------------------------------------------------------
[INFO]
[INFO] ------------------------------------------------------------------------
[INFO] Skipping Brooklyn QA
[INFO] This project has been banned from the build due to previous failures.
[INFO] ------------------------------------------------------------------------
[INFO]
[INFO] ------------------------------------------------------------------------
[INFO] Skipping Brooklyn REST Client
[INFO] This project has been banned from the build due to previous failures.
[INFO] ------------------------------------------------------------------------
[INFO] ------------------------------------------------------------------------
[INFO] Reactor Summary:
[INFO]
[INFO] Brooklyn Root ..................................... SUCCESS [7.500s]
[INFO] Brooklyn Parent Project ........................... SUCCESS [10.879s]
[INFO] Brooklyn Logback Configuration .................... SUCCESS [12.307s]
[INFO] Brooklyn Test Support Utilities ................... SUCCESS [13.311s]
[INFO] Brooklyn Logback Includable Configuration ......... SUCCESS [4.135s]
[INFO] Brooklyn Common Utilities ......................... SUCCESS [1:25.183s]
[INFO] Brooklyn API ...................................... SUCCESS [11.871s]
[INFO] Brooklyn Test Support ............................. SUCCESS [7.716s]
[INFO] CAMP Server Parent Project ........................ SUCCESS [0.477s]
[INFO] CAMP Base ......................................... SUCCESS [45.068s]
[INFO] Brooklyn Groovy Utilities ......................... SUCCESS [56.508s]
[INFO] Brooklyn Core ..................................... SUCCESS [21:58.595s]
[INFO] Brooklyn Policies ................................. SUCCESS [7:41.317s]
[INFO] Brooklyn Jclouds Location Targets ................. SUCCESS [1:56.820s]
[INFO] Brooklyn Secure JMXMP Agent ....................... SUCCESS [1:36.973s]
[INFO] Brooklyn JMX RMI Agent ............................ SUCCESS [6.761s]
[INFO] Brooklyn Software Base ............................ SUCCESS [9:32.524s]
[INFO] Brooklyn Web App Software Entities ................ SUCCESS [6:12.927s]
[INFO] Brooklyn Database Software Entities ............... SUCCESS [37.690s]
[INFO] Brooklyn NoSQL Data Store Software Entities ....... SUCCESS [3:18.775s]
[INFO] Brooklyn CAMP REST API ............................ FAILURE [17:08.424s]
[INFO] Brooklyn REST Server .............................. SKIPPED
[INFO] Brooklyn REST JavaScript Web GUI .................. SKIPPED
[INFO] Brooklyn Launcher ................................. SKIPPED
[INFO] Brooklyn Command Line Interface ................... SKIPPED
[INFO] Brooklyn All Things ............................... SKIPPED
[INFO] Brooklyn Simple Web Cluster Example ............... SKIPPED
[INFO] Brooklyn Global Web Fabric Example ................ SKIPPED
[INFO] Brooklyn Simple Messaging Publish-Subscribe Example SKIPPED
[INFO] Brooklyn NoSQL Cluster Examples ................... SKIPPED
[INFO] Brooklyn Distribution ............................. SKIPPED
[INFO] Brooklyn QA ....................................... SKIPPED
[INFO] Brooklyn REST Client .............................. SKIPPED
[INFO] ------------------------------------------------------------------------
[INFO] BUILD FAILURE
[INFO] ------------------------------------------------------------------------
[INFO] Total time: 1:14:45.819s
[INFO] Finished at: Wed Sep 23 12:46:12 BST 2015
[INFO] Final Memory: 62M/238M
[INFO] ------------------------------------------------------------------------
[JENKINS] Archiving disabled
[JENKINS] Archiving disabled
[JENKINS] Archiving disabled
[JENKINS] Archiving disabled
[JENKINS] Archiving disabled
[JENKINS] Archiving disabled
[JENKINS] Archiving disabled
[JENKINS] Archiving disabled
[JENKINS] Archiving disabled
[JENKINS] Archiving disabled
[JENKINS] Archiving disabled
[JENKINS] Archiving disabled
[JENKINS] Archiving disabled
[JENKINS] Archiving disabled
[JENKINS] Archiving disabled
[JENKINS] Archiving disabled
[JENKINS] Archiving disabled
[JENKINS] Archiving disabled
[JENKINS] Archiving disabled
[JENKINS] Archiving disabled
[JENKINS] Archiving disabled
[JENKINS] Archiving disabled
[JENKINS] Archiving disabled
[JENKINS] Archiving disabled
[JENKINS] Archiving disabled
[JENKINS] Archiving disabled
[JENKINS] Archiving disabled
[JENKINS] Archiving disabled
[JENKINS] Archiving disabled
[JENKINS] Archiving disabled
[JENKINS] Archiving disabled
[JENKINS] Archiving disabled
[JENKINS] Archiving disabled
Waiting for Jenkins to finish collecting data
[ERROR] Failed to execute goal org.apache.maven.plugins:maven-surefire-plugin:2.18.1:test (default-test) on project brooklyn-camp: There are test failures.
[ERROR]
[ERROR] Please refer to F:\hudson\hudson-slave\workspace\incubator-brooklyn-master-windows\usage\camp\target\surefire-reports for the individual test results.
[ERROR] -> [Help 1]
[ERROR]
[ERROR] To see the full stack trace of the errors, re-run Maven with the -e switch.
[ERROR] Re-run Maven using the -X switch to enable full debug logging.
[ERROR]
[ERROR] For more information about the errors and possible solutions, please read the following articles:
[ERROR] [Help 1] http://cwiki.apache.org/confluence/display/MAVEN/MojoFailureException
[ERROR]
[ERROR] After correcting the problems, you can resume the build with the command
[ERROR] mvn <goals> -rf :brooklyn-camp
channel stopped
Build failed in Jenkins: incubator-brooklyn-master-windows #293
Posted by Apache Jenkins Server <je...@builds.apache.org>.
See <https://builds.apache.org/job/incubator-brooklyn-master-windows/293/changes>
Changes:
[aled.sage] Testing winrm exit codes
[aled.sage] service-not-up-diagnotics: don’t call driver.isRunning on creation
[aled.sage] WinRmDriver.copyTo: handle different url types
[aled.sage] winrm: avoid NPE if command==null && psCommand==null
[aled.sage] winrm: improve err msgs when no cmd set
[aled.sage] Add 7zip windows blueprint test
[aled.sage] winrm docs: add more tips+limitations
------------------------------------------
[...truncated 31396 lines...]
[INFO] skip non existing resourceDirectory F:\hudson\hudson-slave\workspace\incubator-brooklyn-master-windows\storage\hazelcast\src\main\resources
[INFO] Copying 4 resources
[INFO]
[INFO] --- maven-compiler-plugin:3.3:compile (default-compile) @ brooklyn-storage-hazelcast ---
[INFO] Changes detected - recompiling the module!
[INFO] Compiling 4 source files to F:\hudson\hudson-slave\workspace\incubator-brooklyn-master-windows\storage\hazelcast\target\classes
[INFO]
[INFO] --- maven-checkstyle-plugin:2.13:check (verify-style) @ brooklyn-storage-hazelcast ---
[INFO]
[INFO]
[INFO] --- buildnumber-maven-plugin:1.3:create (default) @ brooklyn-storage-hazelcast ---
[INFO]
[INFO] --- maven-enforcer-plugin:1.4:enforce (brooklyn-build-req) @ brooklyn-storage-hazelcast ---
[INFO]
[INFO] --- maven-remote-resources-plugin:1.5:process (default) @ brooklyn-storage-hazelcast ---
[INFO]
[INFO] --- maven-resources-plugin:2.7:resources (default-resources) @ brooklyn-storage-hazelcast ---
[INFO] Using 'UTF-8' encoding to copy filtered resources.
[INFO] skip non existing resourceDirectory F:\hudson\hudson-slave\workspace\incubator-brooklyn-master-windows\storage\hazelcast\src\main\resources
[INFO] Copying 4 resources
[INFO] Copying 4 resources
[INFO]
[INFO] --- maven-compiler-plugin:3.3:compile (default-compile) @ brooklyn-storage-hazelcast ---
[INFO] Nothing to compile - all classes are up to date
[INFO]
[INFO] --- maven-checkstyle-plugin:2.13:check (verify-style) @ brooklyn-storage-hazelcast ---
[INFO]
[WARNING] Failed to getClass for org.apache.felix.bundleplugin.ManifestPlugin
[INFO]
[INFO] --- maven-bundle-plugin:2.5.4:manifest (bundle-manifest) @ brooklyn-storage-hazelcast ---
[WARNING] Manifest org.apache.brooklyn:brooklyn-storage-hazelcast:jar:0.9.0-SNAPSHOT : Unused Export-Package instructions: [brooklyn.*]
[INFO]
[INFO] --- maven-resources-plugin:2.7:testResources (default-testResources) @ brooklyn-storage-hazelcast ---
[INFO] Using 'UTF-8' encoding to copy filtered resources.
[INFO] skip non existing resourceDirectory F:\hudson\hudson-slave\workspace\incubator-brooklyn-master-windows\storage\hazelcast\src\test\resources
[INFO] Copying 4 resources
[INFO]
[INFO] --- maven-compiler-plugin:3.3:testCompile (default-testCompile) @ brooklyn-storage-hazelcast ---
[INFO] Changes detected - recompiling the module!
[INFO] Compiling 1 source file to F:\hudson\hudson-slave\workspace\incubator-brooklyn-master-windows\storage\hazelcast\target\test-classes
[INFO]
[INFO] --- maven-surefire-plugin:2.18.1:test (default-test) @ brooklyn-storage-hazelcast ---
[INFO] Surefire report directory: F:\hudson\hudson-slave\workspace\incubator-brooklyn-master-windows\storage\hazelcast\target\surefire-reports
-------------------------------------------------------
T E S T S
-------------------------------------------------------
Running org.apache.brooklyn.storage.impl.hazelcast.HazelcastStorageTest
Configuring TestNG with: TestNG652Configurator
2015-09-23 11:29:54,018 INFO TESTNG RUNNING: Suite: "Surefire test" containing "0" Tests (config: null)
2015-09-23 11:29:54,024 INFO BrooklynLeakListener.onStart attempting to terminate all extant ManagementContexts: name=Surefire test; includedGroups=[]; excludedGroups=[Integration, Acceptance, Live, WIP]; suiteName=Surefire suite; outDir=F:\hudson\hudson-slave\workspace\incubator-brooklyn-master-windows\storage\hazelcast\target\surefire-reports\Surefire suite: no org.apache.brooklyn.core.management.internal.LocalManagementContext available, so skipped
2015-09-23 11:29:55,770 INFO TESTNG
===============================================
Surefire test
Tests run: 0, Failures: 0, Skips: 0
===============================================
2015-09-23 11:29:55,770 INFO BrooklynLeakListener.onFinish attempting to terminate all extant ManagementContexts: name=Surefire test; includedGroups=[]; excludedGroups=[Integration, Acceptance, Live, WIP]; suiteName=Surefire suite; outDir=F:\hudson\hudson-slave\workspace\incubator-brooklyn-master-windows\storage\hazelcast\target\surefire-reports\Surefire suite: no org.apache.brooklyn.core.management.internal.LocalManagementContext available, so skipped
Tests run: 0, Failures: 0, Errors: 0, Skipped: 0, Time elapsed: 8.204 sec - in org.apache.brooklyn.storage.impl.hazelcast.HazelcastStorageTest
Results :
Tests run: 0, Failures: 0, Errors: 0, Skipped: 0
[JENKINS] Recording test results
[INFO]
[INFO] --- maven-jar-plugin:2.6:jar (default-jar) @ brooklyn-storage-hazelcast ---
[INFO] Building jar: F:\hudson\hudson-slave\workspace\incubator-brooklyn-master-windows\storage\hazelcast\target\brooklyn-storage-hazelcast-0.9.0-SNAPSHOT.jar
[INFO]
[INFO] --- maven-site-plugin:3.4:attach-descriptor (attach-descriptor) @ brooklyn-storage-hazelcast ---
[INFO]
[INFO] --- maven-jar-plugin:2.6:test-jar (test-jar-creation) @ brooklyn-storage-hazelcast ---
[INFO] Building jar: F:\hudson\hudson-slave\workspace\incubator-brooklyn-master-windows\storage\hazelcast\target\brooklyn-storage-hazelcast-0.9.0-SNAPSHOT-tests.jar
[INFO]
[INFO] --- apache-rat-plugin:0.10:check (default) @ brooklyn-storage-hazelcast ---
[INFO] 51 implicit excludes (use -debug for more details).
[INFO] Exclude: sandbox/**
[INFO] Exclude: release/**
[INFO] Exclude: **/nbactions.xml
[INFO] Exclude: **/nb-configuration.xml
[INFO] Exclude: **/.git/**
[INFO] Exclude: **/.gitignore
[INFO] Exclude: **/.repository/**
[INFO] Exclude: **/.idea/**
[INFO] Exclude: **/*.iml
[INFO] Exclude: **/.classpath/**
[INFO] Exclude: **/.project
[INFO] Exclude: **/.settings/**
[INFO] Exclude: **/*.log
[INFO] Exclude: **/brooklyn*.log.*
[INFO] Exclude: **/target/**
[INFO] Exclude: ignored/**
[INFO] Exclude: LICENSE.md
[INFO] Exclude: **/src/main/license/**
[INFO] Exclude: **/src/test/license/**
[INFO] Exclude: **/MANIFEST.MF
[INFO] Exclude: **/test-output/**
[INFO] Exclude: **/*.pem.pub
[INFO] Exclude: **/*.pem
[INFO] Exclude: **/*_rsa.pub
[INFO] Exclude: **/*_rsa
[INFO] Exclude: **/*.svg
[INFO] Exclude: **/*.crt
[INFO] Exclude: **/*.csr
[INFO] Exclude: **/*.key
[INFO] Exclude: **/*.key.org
[INFO] Exclude: **/*.psd
[INFO] Exclude: **/*.json
[INFO] Exclude: **/*.plxarc
[INFO] Exclude: **/src/test/resources/org/apache/brooklyn/entity/software/base/template_with_extra_substitutions.txt
[INFO] Exclude: **/src/main/resources/banner.txt
[INFO] Exclude: **/src/test/resources/ssl/certs/localhost/info.txt
[INFO] Exclude: **/sandbox/examples/src/main/scripts/amis.txt
[INFO] Exclude: docs/**
[INFO] 6 resources included (use -debug for more details)
[INFO] Rat check: Summary of files. Unapproved: 0 unknown: 0 generated: 0 approved: 6 licence.
[INFO]
[INFO] --- maven-source-plugin:2.4:jar-no-fork (attach-sources) @ brooklyn-storage-hazelcast ---
[INFO] Building jar: F:\hudson\hudson-slave\workspace\incubator-brooklyn-master-windows\storage\hazelcast\target\brooklyn-storage-hazelcast-0.9.0-SNAPSHOT-sources.jar
[INFO]
[INFO] --- maven-install-plugin:2.5.2:install (default-install) @ brooklyn-storage-hazelcast ---
[INFO] Installing F:\hudson\hudson-slave\workspace\incubator-brooklyn-master-windows\storage\hazelcast\target\brooklyn-storage-hazelcast-0.9.0-SNAPSHOT.jar to f:\hudson\hudson-slave\maven-repositories\0\org\apache\brooklyn\brooklyn-storage-hazelcast\0.9.0-SNAPSHOT\brooklyn-storage-hazelcast-0.9.0-SNAPSHOT.jar
[INFO] Installing F:\hudson\hudson-slave\workspace\incubator-brooklyn-master-windows\storage\hazelcast\pom.xml to f:\hudson\hudson-slave\maven-repositories\0\org\apache\brooklyn\brooklyn-storage-hazelcast\0.9.0-SNAPSHOT\brooklyn-storage-hazelcast-0.9.0-SNAPSHOT.pom
[INFO] Installing F:\hudson\hudson-slave\workspace\incubator-brooklyn-master-windows\storage\hazelcast\target\brooklyn-storage-hazelcast-0.9.0-SNAPSHOT-tests.jar to f:\hudson\hudson-slave\maven-repositories\0\org\apache\brooklyn\brooklyn-storage-hazelcast\0.9.0-SNAPSHOT\brooklyn-storage-hazelcast-0.9.0-SNAPSHOT-tests.jar
[INFO] Installing F:\hudson\hudson-slave\workspace\incubator-brooklyn-master-windows\storage\hazelcast\target\brooklyn-storage-hazelcast-0.9.0-SNAPSHOT-sources.jar to f:\hudson\hudson-slave\maven-repositories\0\org\apache\brooklyn\brooklyn-storage-hazelcast\0.9.0-SNAPSHOT\brooklyn-storage-hazelcast-0.9.0-SNAPSHOT-sources.jar
[JENKINS] Archiving disabled
[INFO]
[INFO] ------------------------------------------------------------------------
[INFO] Skipping Brooklyn Distribution
[INFO] This project has been banned from the build due to previous failures.
[INFO] ------------------------------------------------------------------------
[INFO]
[INFO] ------------------------------------------------------------------------
[INFO] Skipping Brooklyn QA
[INFO] This project has been banned from the build due to previous failures.
[INFO] ------------------------------------------------------------------------
[INFO]
[INFO] ------------------------------------------------------------------------
[INFO] Skipping Brooklyn REST Client
[INFO] This project has been banned from the build due to previous failures.
[INFO] ------------------------------------------------------------------------
[INFO] ------------------------------------------------------------------------
[INFO] Reactor Summary:
[INFO]
[INFO] Brooklyn Root ..................................... SUCCESS [6.163s]
[INFO] Brooklyn Parent Project ........................... SUCCESS [16.922s]
[INFO] Brooklyn Logback Configuration .................... SUCCESS [19.740s]
[INFO] Brooklyn Test Support Utilities ................... SUCCESS [10.853s]
[INFO] Brooklyn Logback Includable Configuration ......... SUCCESS [4.706s]
[INFO] Brooklyn Common Utilities ......................... SUCCESS [2:49.268s]
[INFO] Brooklyn API ...................................... SUCCESS [10.930s]
[INFO] Brooklyn Test Support ............................. SUCCESS [6.942s]
[INFO] Brooklyn Downstream Project Parent ................ SUCCESS [0.193s]
[INFO] CAMP Server Parent Project ........................ SUCCESS [0.641s]
[INFO] CAMP Base ......................................... SUCCESS [14.637s]
[INFO] Brooklyn REST Swagger Apidoc Utilities ............ SUCCESS [11.963s]
[INFO] CAMP Server ....................................... SUCCESS [23.654s]
[INFO] Brooklyn Groovy Utilities ......................... SUCCESS [44.177s]
[INFO] Brooklyn Core ..................................... SUCCESS [24:20.589s]
[INFO] Brooklyn Policies ................................. SUCCESS [7:47.276s]
[INFO] Brooklyn Jclouds Location Targets ................. SUCCESS [2:01.162s]
[INFO] Brooklyn Secure JMXMP Agent ....................... SUCCESS [1:14.770s]
[INFO] Brooklyn JMX RMI Agent ............................ SUCCESS [6.708s]
[INFO] Brooklyn Software Base ............................ SUCCESS [11:13.265s]
[INFO] Brooklyn Web App Software Entities ................ SUCCESS [5:55.901s]
[INFO] Brooklyn Messaging Software Entities .............. SUCCESS [1:21.815s]
[INFO] Brooklyn Database Software Entities ............... SUCCESS [29.212s]
[INFO] Brooklyn Monitoring Software Entities ............. SUCCESS [21.553s]
[INFO] Brooklyn OSGi Software Entities ................... SUCCESS [32.367s]
[INFO] Brooklyn NoSQL Data Store Software Entities ....... SUCCESS [2:43.220s]
[INFO] Brooklyn Network Software Entities ................ SUCCESS [25.549s]
[INFO] Brooklyn REST API ................................. SUCCESS [23.220s]
[INFO] Brooklyn CAMP REST API ............................ FAILURE [15:44.320s]
[INFO] Brooklyn REST Server .............................. SKIPPED
[INFO] Brooklyn REST JavaScript Web GUI .................. SKIPPED
[INFO] Brooklyn Launcher ................................. SKIPPED
[INFO] Brooklyn Command Line Interface ................... SKIPPED
[INFO] Brooklyn All Things ............................... SKIPPED
[INFO] Brooklyn Simple Web Cluster Example ............... SKIPPED
[INFO] Brooklyn Global Web Fabric Example ................ SKIPPED
[INFO] Brooklyn Simple Messaging Publish-Subscribe Example SKIPPED
[INFO] Brooklyn NoSQL Cluster Examples ................... SKIPPED
[INFO] Brooklyn Hazelcast Storage ........................ SUCCESS [19.686s]
[INFO] Brooklyn Distribution ............................. SKIPPED
[INFO] Brooklyn QA ....................................... SKIPPED
[INFO] Brooklyn REST Client .............................. SKIPPED
[INFO] ------------------------------------------------------------------------
[INFO] BUILD FAILURE
[INFO] ------------------------------------------------------------------------
[INFO] Total time: 1:21:06.630s
[INFO] Finished at: Wed Sep 23 11:29:56 BST 2015
[INFO] Final Memory: 70M/240M
[INFO] ------------------------------------------------------------------------
[JENKINS] Archiving disabled
[JENKINS] Archiving disabled
[JENKINS] Archiving disabled
[JENKINS] Archiving disabled
[JENKINS] Archiving disabled
[JENKINS] Archiving disabled
[JENKINS] Archiving disabled
[JENKINS] Archiving disabled
[JENKINS] Archiving disabled
[JENKINS] Archiving disabled
[JENKINS] Archiving disabled
[JENKINS] Archiving disabled
[JENKINS] Archiving disabled
[JENKINS] Archiving disabled
[JENKINS] Archiving disabled
[JENKINS] Archiving disabled
[JENKINS] Archiving disabled
[JENKINS] Archiving disabled
[JENKINS] Archiving disabled
[JENKINS] Archiving disabled
[JENKINS] Archiving disabled
[JENKINS] Archiving disabled
[JENKINS] Archiving disabled
[JENKINS] Archiving disabled
[JENKINS] Archiving disabled
[JENKINS] Archiving disabled
[JENKINS] Archiving disabled
[JENKINS] Archiving disabled
[JENKINS] Archiving disabled
[JENKINS] Archiving disabled
[JENKINS] Archiving disabled
[JENKINS] Archiving disabled
[JENKINS] Archiving disabled
[JENKINS] Archiving disabled
[JENKINS] Archiving disabled
[JENKINS] Archiving disabled
[JENKINS] Archiving disabled
[JENKINS] Archiving disabled
[JENKINS] Archiving disabled
[JENKINS] Archiving disabled
[JENKINS] Archiving disabled
[JENKINS] Archiving disabled
Waiting for Jenkins to finish collecting data
[ERROR] Failed to execute goal org.apache.maven.plugins:maven-surefire-plugin:2.18.1:test (default-test) on project brooklyn-camp: There are test failures.
[ERROR]
[ERROR] Please refer to F:\hudson\hudson-slave\workspace\incubator-brooklyn-master-windows\usage\camp\target\surefire-reports for the individual test results.
[ERROR] -> [Help 1]
[ERROR]
[ERROR] To see the full stack trace of the errors, re-run Maven with the -e switch.
[ERROR] Re-run Maven using the -X switch to enable full debug logging.
[ERROR]
[ERROR] For more information about the errors and possible solutions, please read the following articles:
[ERROR] [Help 1] http://cwiki.apache.org/confluence/display/MAVEN/MojoFailureException
[ERROR]
[ERROR] After correcting the problems, you can resume the build with the command
[ERROR] mvn <goals> -rf :brooklyn-camp
channel stopped
Build failed in Jenkins: incubator-brooklyn-master-windows #292
Posted by Apache Jenkins Server <je...@builds.apache.org>.
See <https://builds.apache.org/job/incubator-brooklyn-master-windows/292/>
------------------------------------------
[...truncated 2386 lines...]
[INFO] Configuring TestNG with: TestNG652Configurator
[INFO] 2015-09-21 18:29:34,303 INFO TESTNG RUNNING: Suite: "Surefire test" containing "2" Tests (config: null)
[INFO] 2015-09-21 18:29:34,325 INFO TESTNG INVOKING CONFIGURATION: "Surefire test" - @BeforeMethod com.acme.sample.brooklyn.sample.app.SampleUnitTest.setup()
[INFO] 2015-09-21 18:29:57,529 INFO TESTNG PASSED CONFIGURATION: "Surefire test" - @BeforeMethod com.acme.sample.brooklyn.sample.app.SampleUnitTest.setup() finished in 23206 ms
[INFO] 2015-09-21 18:29:57,530 INFO TESTNG INVOKING: "Surefire test" - com.acme.sample.brooklyn.sample.app.SampleUnitTest.testSampleClusterStructure()
[INFO] 2015-09-21 18:30:01,593 INFO app from spec is: ClusterWebServerDatabaseSample{id=WCwsGEve}
[INFO] 2015-09-21 18:30:01,598 INFO TESTNG PASSED: "Surefire test" - com.acme.sample.brooklyn.sample.app.SampleUnitTest.testSampleClusterStructure() finished in 4068 ms
[INFO] 2015-09-21 18:30:01,599 INFO TESTNG INVOKING CONFIGURATION: "Surefire test" - @AfterMethod com.acme.sample.brooklyn.sample.app.SampleUnitTest.shutdown()
[INFO] 2015-09-21 18:30:02,315 INFO TESTNG PASSED CONFIGURATION: "Surefire test" - @AfterMethod com.acme.sample.brooklyn.sample.app.SampleUnitTest.shutdown() finished in 717 ms
[INFO] 2015-09-21 18:30:02,316 INFO TESTNG INVOKING CONFIGURATION: "Surefire test" - @BeforeMethod com.acme.sample.brooklyn.sample.app.SampleUnitTest.setup()
[INFO] 2015-09-21 18:30:06,387 INFO TESTNG PASSED CONFIGURATION: "Surefire test" - @BeforeMethod com.acme.sample.brooklyn.sample.app.SampleUnitTest.setup() finished in 4071 ms
[INFO] 2015-09-21 18:30:06,387 INFO TESTNG INVOKING: "Surefire test" - com.acme.sample.brooklyn.sample.app.SampleUnitTest.testSampleSingleStructure()
[INFO] 2015-09-21 18:30:06,853 INFO app from spec is: SingleWebServerSample{id=kmY1g5l4}
[INFO] 2015-09-21 18:30:06,855 INFO TESTNG PASSED: "Surefire test" - com.acme.sample.brooklyn.sample.app.SampleUnitTest.testSampleSingleStructure() finished in 467 ms
[INFO] 2015-09-21 18:30:06,855 INFO TESTNG INVOKING CONFIGURATION: "Surefire test" - @AfterMethod com.acme.sample.brooklyn.sample.app.SampleUnitTest.shutdown()
[INFO] 2015-09-21 18:30:07,366 INFO TESTNG PASSED CONFIGURATION: "Surefire test" - @AfterMethod com.acme.sample.brooklyn.sample.app.SampleUnitTest.shutdown() finished in 511 ms
[INFO] 2015-09-21 18:30:11,051 INFO TESTNG
[INFO] ===============================================
[INFO] Surefire test
[INFO] Tests run: 2, Failures: 0, Skips: 0
[INFO] ===============================================
[INFO] Tests run: 2, Failures: 0, Errors: 0, Skipped: 0, Time elapsed: 41.909 sec - in TestSuite
[INFO]
[INFO] Results :
[INFO]
[INFO] Tests run: 2, Failures: 0, Errors: 0, Skipped: 0
[INFO]
[INFO] [INFO]
[INFO] [INFO] --- maven-jar-plugin:2.6:jar (default-jar) @ brooklyn-sample ---
[INFO] [INFO] Building jar: F:\hudson\hudson-slave\workspace\incubator-brooklyn-master-windows\usage\archetypes\quickstart\target\test-classes\projects\integration-test-1\project\brooklyn-sample\target\brooklyn-sample-0.1.0-SNAPSHOT.jar
[INFO] [INFO]
[INFO] [INFO] --- maven-site-plugin:3.4:attach-descriptor (attach-descriptor) @ brooklyn-sample ---
[INFO] [INFO]
[INFO] [INFO] --- maven-jar-plugin:2.6:test-jar (test-jar-creation) @ brooklyn-sample ---
[INFO] [INFO] Building jar: F:\hudson\hudson-slave\workspace\incubator-brooklyn-master-windows\usage\archetypes\quickstart\target\test-classes\projects\integration-test-1\project\brooklyn-sample\target\brooklyn-sample-0.1.0-SNAPSHOT-tests.jar
[INFO] [INFO]
[INFO] [INFO] --- maven-install-plugin:2.5.2:install (default-install) @ brooklyn-sample ---
[INFO] [INFO] Installing F:\hudson\hudson-slave\workspace\incubator-brooklyn-master-windows\usage\archetypes\quickstart\target\test-classes\projects\integration-test-1\project\brooklyn-sample\target\brooklyn-sample-0.1.0-SNAPSHOT.jar to F:\hudson\hudson-slave\maven-repositories\1\com\acme\sample\brooklyn-sample\0.1.0-SNAPSHOT\brooklyn-sample-0.1.0-SNAPSHOT.jar
[INFO] [INFO] Installing F:\hudson\hudson-slave\workspace\incubator-brooklyn-master-windows\usage\archetypes\quickstart\target\test-classes\projects\integration-test-1\project\brooklyn-sample\pom.xml to F:\hudson\hudson-slave\maven-repositories\1\com\acme\sample\brooklyn-sample\0.1.0-SNAPSHOT\brooklyn-sample-0.1.0-SNAPSHOT.pom
[INFO] [INFO] Installing F:\hudson\hudson-slave\workspace\incubator-brooklyn-master-windows\usage\archetypes\quickstart\target\test-classes\projects\integration-test-1\project\brooklyn-sample\target\brooklyn-sample-0.1.0-SNAPSHOT-tests.jar to F:\hudson\hudson-slave\maven-repositories\1\com\acme\sample\brooklyn-sample\0.1.0-SNAPSHOT\brooklyn-sample-0.1.0-SNAPSHOT-tests.jar
[INFO] [INFO] ------------------------------------------------------------------------
[INFO] [INFO] BUILD SUCCESS
[INFO] [INFO] ------------------------------------------------------------------------
[INFO] [INFO] Total time: 3:20.346s
[INFO] [INFO] Finished at: Mon Sep 21 18:30:14 BST 2015
[INFO] [INFO] Final Memory: 43M/238M
[INFO] [INFO] ------------------------------------------------------------------------
[INFO] Post-archetype-generation invoker exit code: 0
[INFO]
[INFO] --- apache-rat-plugin:0.10:check (default) @ brooklyn-archetype-quickstart ---
[JENKINS] Recording test results
[INFO] 51 implicit excludes (use -debug for more details).
[INFO] Exclude: sandbox/**
[INFO] Exclude: release/**
[INFO] Exclude: **/nbactions.xml
[INFO] Exclude: **/nb-configuration.xml
[INFO] Exclude: **/src/main/resources/archetype-resources/**/*
[INFO] Exclude: **/src/test/resources/projects/integration-test-1/goal.txt
[INFO] Exclude: **/src/test/resources/projects/integration-test-1/reference/**/*
[INFO] Exclude: **/src/main/java/sample/**/*Sample*.java
[INFO] Exclude: **/src/main/resources/logback-custom.xml
[INFO] Exclude: **/src/brooklyn-sample/README.md
[INFO] Exclude: **/src/brooklyn-sample/pom.xml
[INFO] Exclude: **/src/brooklyn-sample/src/main/assembly/files/conf/*
[INFO] Exclude: **/src/brooklyn-sample/src/main/java/**/*.java
[INFO] Exclude: **/src/brooklyn-sample/src/main/resources/logback-custom.xml
[INFO] Exclude: **/src/brooklyn-sample/src/test/java/**/*.java
[INFO] Exclude: **/.git/**
[INFO] Exclude: **/.gitignore
[INFO] Exclude: **/.repository/**
[INFO] Exclude: **/.idea/**
[INFO] Exclude: **/*.iml
[INFO] Exclude: **/.classpath/**
[INFO] Exclude: **/.project
[INFO] Exclude: **/.settings/**
[INFO] Exclude: **/*.log
[INFO] Exclude: **/brooklyn*.log.*
[INFO] Exclude: **/target/**
[INFO] Exclude: ignored/**
[INFO] Exclude: LICENSE.md
[INFO] Exclude: **/src/main/license/**
[INFO] Exclude: **/src/test/license/**
[INFO] Exclude: **/MANIFEST.MF
[INFO] Exclude: **/test-output/**
[INFO] Exclude: **/*.pem.pub
[INFO] Exclude: **/*.pem
[INFO] Exclude: **/*_rsa.pub
[INFO] Exclude: **/*_rsa
[INFO] Exclude: **/*.svg
[INFO] Exclude: **/*.crt
[INFO] Exclude: **/*.csr
[INFO] Exclude: **/*.key
[INFO] Exclude: **/*.key.org
[INFO] Exclude: **/*.psd
[INFO] Exclude: **/*.json
[INFO] Exclude: **/*.plxarc
[INFO] Exclude: **/src/test/resources/org/apache/brooklyn/entity/software/base/template_with_extra_substitutions.txt
[INFO] Exclude: **/src/main/resources/banner.txt
[INFO] Exclude: **/src/test/resources/ssl/certs/localhost/info.txt
[INFO] Exclude: **/sandbox/examples/src/main/scripts/amis.txt
[INFO] Exclude: docs/**
[INFO] 9 resources included (use -debug for more details)
[INFO] Rat check: Summary of files. Unapproved: 0 unknown: 0 generated: 0 approved: 7 licence.
[INFO]
[INFO] --- maven-source-plugin:2.4:jar-no-fork (attach-sources) @ brooklyn-archetype-quickstart ---
[INFO] Building jar: F:\hudson\hudson-slave\workspace\incubator-brooklyn-master-windows\usage\archetypes\quickstart\target\brooklyn-archetype-quickstart-0.9.0-SNAPSHOT-sources.jar
[INFO]
[INFO] --- maven-install-plugin:2.5.2:install (default-install) @ brooklyn-archetype-quickstart ---
[INFO] Installing F:\hudson\hudson-slave\workspace\incubator-brooklyn-master-windows\usage\archetypes\quickstart\target\brooklyn-archetype-quickstart-0.9.0-SNAPSHOT.jar to f:\hudson\hudson-slave\maven-repositories\1\org\apache\brooklyn\brooklyn-archetype-quickstart\0.9.0-SNAPSHOT\brooklyn-archetype-quickstart-0.9.0-SNAPSHOT.jar
[INFO] Installing F:\hudson\hudson-slave\workspace\incubator-brooklyn-master-windows\usage\archetypes\quickstart\pom.xml to f:\hudson\hudson-slave\maven-repositories\1\org\apache\brooklyn\brooklyn-archetype-quickstart\0.9.0-SNAPSHOT\brooklyn-archetype-quickstart-0.9.0-SNAPSHOT.pom
[INFO] Installing F:\hudson\hudson-slave\workspace\incubator-brooklyn-master-windows\usage\archetypes\quickstart\target\brooklyn-archetype-quickstart-0.9.0-SNAPSHOT-tests.jar to f:\hudson\hudson-slave\maven-repositories\1\org\apache\brooklyn\brooklyn-archetype-quickstart\0.9.0-SNAPSHOT\brooklyn-archetype-quickstart-0.9.0-SNAPSHOT-tests.jar
[INFO] Installing F:\hudson\hudson-slave\workspace\incubator-brooklyn-master-windows\usage\archetypes\quickstart\target\brooklyn-archetype-quickstart-0.9.0-SNAPSHOT-sources.jar to f:\hudson\hudson-slave\maven-repositories\1\org\apache\brooklyn\brooklyn-archetype-quickstart\0.9.0-SNAPSHOT\brooklyn-archetype-quickstart-0.9.0-SNAPSHOT-sources.jar
[INFO]
[INFO] --- maven-archetype-plugin:2.3:update-local-catalog (default-update-local-catalog) @ brooklyn-archetype-quickstart ---
[JENKINS] Archiving disabled
[INFO]
[INFO] ------------------------------------------------------------------------
[INFO] Skipping Brooklyn Distribution
[INFO] This project has been banned from the build due to previous failures.
[INFO] ------------------------------------------------------------------------
[INFO]
[INFO] ------------------------------------------------------------------------
[INFO] Skipping Brooklyn QA
[INFO] This project has been banned from the build due to previous failures.
[INFO] ------------------------------------------------------------------------
[INFO]
[INFO] ------------------------------------------------------------------------
[INFO] Skipping Brooklyn REST Client
[INFO] This project has been banned from the build due to previous failures.
[INFO] ------------------------------------------------------------------------
[INFO] ------------------------------------------------------------------------
[INFO] Reactor Summary:
[INFO]
[INFO] Brooklyn Root ..................................... SUCCESS [1:02.512s]
[INFO] Brooklyn Parent Project ........................... SUCCESS [46.231s]
[INFO] Brooklyn Logback Configuration .................... SUCCESS [26.771s]
[INFO] Brooklyn Test Support Utilities ................... SUCCESS [15.482s]
[INFO] Brooklyn Logback Includable Configuration ......... SUCCESS [3.939s]
[INFO] Brooklyn Common Utilities ......................... FAILURE [2:56.040s]
[INFO] Brooklyn API ...................................... SKIPPED
[INFO] Brooklyn Test Support ............................. SKIPPED
[INFO] Brooklyn Downstream Project Parent ................ SKIPPED
[INFO] CAMP Server Parent Project ........................ SUCCESS [0.807s]
[INFO] CAMP Base ......................................... SKIPPED
[INFO] Brooklyn REST Swagger Apidoc Utilities ............ SKIPPED
[INFO] CAMP Server ....................................... SKIPPED
[INFO] Brooklyn Groovy Utilities ......................... SKIPPED
[INFO] Brooklyn Core ..................................... SKIPPED
[INFO] Brooklyn Examples Aggregator Project .............. SUCCESS [0.384s]
[INFO] Brooklyn Examples Aggregator Project - Webapps .... SUCCESS [0.513s]
[INFO] hello-world-webapp Maven Webapp ................... SUCCESS [4.369s]
[INFO] hello-world-sql-webapp Maven Webapp ............... SUCCESS [14.172s]
[INFO] Brooklyn Policies ................................. SKIPPED
[INFO] Brooklyn Jclouds Location Targets ................. SKIPPED
[INFO] Brooklyn Secure JMXMP Agent ....................... SKIPPED
[INFO] Brooklyn JMX RMI Agent ............................ SKIPPED
[INFO] Brooklyn Software Base ............................ SKIPPED
[INFO] Brooklyn Web App Software Entities ................ SKIPPED
[INFO] Brooklyn Messaging Software Entities .............. SKIPPED
[INFO] Brooklyn Database Software Entities ............... SKIPPED
[INFO] Brooklyn Monitoring Software Entities ............. SKIPPED
[INFO] Brooklyn OSGi Software Entities ................... SKIPPED
[INFO] Brooklyn NoSQL Data Store Software Entities ....... SKIPPED
[INFO] Brooklyn Network Software Entities ................ SKIPPED
[INFO] Brooklyn REST API ................................. SKIPPED
[INFO] Brooklyn CAMP REST API ............................ SKIPPED
[INFO] Brooklyn REST Server .............................. SKIPPED
[INFO] Brooklyn REST JavaScript Web GUI .................. SKIPPED
[INFO] Brooklyn Launcher ................................. SKIPPED
[INFO] Brooklyn Command Line Interface ................... SKIPPED
[INFO] Brooklyn All Things ............................... SKIPPED
[INFO] Brooklyn Simple Web Cluster Example ............... SKIPPED
[INFO] Brooklyn Global Web Fabric Example ................ SKIPPED
[INFO] Brooklyn Simple Messaging Publish-Subscribe Example SKIPPED
[INFO] Brooklyn NoSQL Cluster Examples ................... SKIPPED
[INFO] Brooklyn Hazelcast Storage ........................ SKIPPED
[INFO] Brooklyn Quick-Start Project Archetype ............ SUCCESS [3:28.427s]
[INFO] Brooklyn Distribution ............................. SKIPPED
[INFO] Brooklyn QA ....................................... SKIPPED
[INFO] Brooklyn REST Client .............................. SKIPPED
[INFO] ------------------------------------------------------------------------
[INFO] BUILD FAILURE
[INFO] ------------------------------------------------------------------------
[INFO] Total time: 10:13.992s
[INFO] Finished at: Mon Sep 21 18:30:15 BST 2015
[INFO] Final Memory: 59M/243M
[INFO] ------------------------------------------------------------------------
[JENKINS] Archiving disabled
[JENKINS] Archiving disabled
[JENKINS] Archiving disabled
[JENKINS] Archiving disabled
[JENKINS] Archiving disabled
[JENKINS] Archiving disabled
[JENKINS] Archiving disabled
[JENKINS] Archiving disabled
[JENKINS] Archiving disabled
[JENKINS] Archiving disabled
[JENKINS] Archiving disabled
[JENKINS] Archiving disabled
[JENKINS] Archiving disabled
[JENKINS] Archiving disabled
[JENKINS] Archiving disabled
[JENKINS] Archiving disabled
[JENKINS] Archiving disabled
[JENKINS] Archiving disabled
[JENKINS] Archiving disabled
[JENKINS] Archiving disabled
[JENKINS] Archiving disabled
[JENKINS] Archiving disabled
[JENKINS] Archiving disabled
[JENKINS] Archiving disabled
[JENKINS] Archiving disabled
[JENKINS] Archiving disabled
[JENKINS] Archiving disabled
[JENKINS] Archiving disabled
[JENKINS] Archiving disabled
[JENKINS] Archiving disabled
[JENKINS] Archiving disabled
[JENKINS] Archiving disabled
[JENKINS] Archiving disabled
[JENKINS] Archiving disabled
[JENKINS] Archiving disabled
[JENKINS] Archiving disabled
[JENKINS] Archiving disabled
[JENKINS] Archiving disabled
[JENKINS] Archiving disabled
[JENKINS] Archiving disabled
[JENKINS] Archiving disabled
[JENKINS] Archiving disabled
[JENKINS] Archiving disabled
[JENKINS] Archiving disabled
[JENKINS] Archiving disabled
[JENKINS] Archiving disabled
[JENKINS] Archiving disabled
Waiting for Jenkins to finish collecting data
[ERROR] Failed to execute goal org.apache.maven.plugins:maven-surefire-plugin:2.18.1:test (default-test) on project brooklyn-utils-common: There are test failures.
[ERROR]
[ERROR] Please refer to F:\hudson\hudson-slave\workspace\incubator-brooklyn-master-windows\utils\common\target\surefire-reports for the individual test results.
[ERROR] -> [Help 1]
[ERROR]
[ERROR] To see the full stack trace of the errors, re-run Maven with the -e switch.
[ERROR] Re-run Maven using the -X switch to enable full debug logging.
[ERROR]
[ERROR] For more information about the errors and possible solutions, please read the following articles:
[ERROR] [Help 1] http://cwiki.apache.org/confluence/display/MAVEN/MojoFailureException
[ERROR]
[ERROR] After correcting the problems, you can resume the build with the command
[ERROR] mvn <goals> -rf :brooklyn-utils-common
channel stopped
Build failed in Jenkins: incubator-brooklyn-master-windows #291
Posted by Apache Jenkins Server <je...@builds.apache.org>.
See <https://builds.apache.org/job/incubator-brooklyn-master-windows/291/changes>
Changes:
[thomas.bouron] Resolve DSL functions for a configuration key within any collection
------------------------------------------
[...truncated 30272 lines...]
2015-09-21 18:18:40,511 INFO TESTNG PASSED CONFIGURATION: "Surefire test" - @BeforeMethod org.apache.brooklyn.camp.brooklyn.catalog.CatalogYamlVersioningTest.setUp() finished in 664 ms
2015-09-21 18:18:40,511 INFO TESTNG INVOKING: "Surefire test" - org.apache.brooklyn.camp.brooklyn.catalog.CatalogYamlVersioningTest.testVersionedReferenceJustAddedImplicitVersionSyntax()
2015-09-21 18:18:40,914 INFO CAMP placing 'BasicApplicationImpl{id=SqGIDn2d}' under management
2015-09-21 18:18:40,917 INFO Test - created org.apache.brooklyn.camp.spi.Assembly@2ced16a8[id=SqGIDn2d; type=Assembly]
2015-09-21 18:18:40,917 INFO App - BasicApplicationImpl{id=SqGIDn2d}
2015-09-21 18:18:41,116 INFO Started application BasicApplicationImpl{id=SqGIDn2d}
2015-09-21 18:18:41,117 INFO TESTNG PASSED: "Surefire test" - org.apache.brooklyn.camp.brooklyn.catalog.CatalogYamlVersioningTest.testVersionedReferenceJustAddedImplicitVersionSyntax() finished in 606 ms
2015-09-21 18:18:41,117 INFO TESTNG INVOKING CONFIGURATION: "Surefire test" - @AfterMethod org.apache.brooklyn.camp.brooklyn.AbstractYamlTest.tearDown()
2015-09-21 18:18:41,150 INFO Stopping application BasicApplicationImpl{id=SqGIDn2d}
2015-09-21 18:18:41,152 INFO Stopped application BasicApplicationImpl{id=SqGIDn2d}
2015-09-21 18:18:41,428 INFO TESTNG PASSED CONFIGURATION: "Surefire test" - @AfterMethod org.apache.brooklyn.camp.brooklyn.AbstractYamlTest.tearDown() finished in 311 ms
2015-09-21 18:18:41,428 INFO TESTNG INVOKING: "Surefire test" - org.apache.brooklyn.camp.brooklyn.spi.dsl.DslParseTest.testParseFunctionChain()
2015-09-21 18:18:41,429 INFO TESTNG PASSED: "Surefire test" - org.apache.brooklyn.camp.brooklyn.spi.dsl.DslParseTest.testParseFunctionChain() finished in 1 ms
2015-09-21 18:18:41,429 INFO TESTNG INVOKING: "Surefire test" - org.apache.brooklyn.camp.brooklyn.spi.dsl.DslParseTest.testParseMultiArgMultiTypeFunction()
2015-09-21 18:18:41,430 INFO TESTNG PASSED: "Surefire test" - org.apache.brooklyn.camp.brooklyn.spi.dsl.DslParseTest.testParseMultiArgMultiTypeFunction() finished in 1 ms
2015-09-21 18:18:41,430 INFO TESTNG INVOKING: "Surefire test" - org.apache.brooklyn.camp.brooklyn.spi.dsl.DslParseTest.testParseNoArgFunction()
2015-09-21 18:18:41,430 INFO TESTNG PASSED: "Surefire test" - org.apache.brooklyn.camp.brooklyn.spi.dsl.DslParseTest.testParseNoArgFunction() finished in 0 ms
2015-09-21 18:18:41,431 INFO TESTNG INVOKING: "Surefire test" - org.apache.brooklyn.camp.brooklyn.spi.dsl.DslParseTest.testParseOneArgFunction()
2015-09-21 18:18:41,431 INFO TESTNG PASSED: "Surefire test" - org.apache.brooklyn.camp.brooklyn.spi.dsl.DslParseTest.testParseOneArgFunction() finished in 0 ms
2015-09-21 18:18:41,432 INFO TESTNG INVOKING: "Surefire test" - org.apache.brooklyn.camp.brooklyn.spi.dsl.DslParseTest.testParseString()
2015-09-21 18:18:41,432 INFO TESTNG PASSED: "Surefire test" - org.apache.brooklyn.camp.brooklyn.spi.dsl.DslParseTest.testParseString() finished in 0 ms
2015-09-21 18:18:41,433 INFO TESTNG INVOKING CONFIGURATION: "Surefire test" - @BeforeMethod org.apache.brooklyn.camp.brooklyn.test.lite.CampYamlLiteTest.setUp()
2015-09-21 18:18:42,035 INFO TESTNG PASSED CONFIGURATION: "Surefire test" - @BeforeMethod org.apache.brooklyn.camp.brooklyn.test.lite.CampYamlLiteTest.setUp() finished in 603 ms
2015-09-21 18:18:42,035 INFO TESTNG INVOKING: "Surefire test" - org.apache.brooklyn.camp.brooklyn.test.lite.CampYamlLiteTest.testAddChildrenEffector()
2015-09-21 18:18:43,260 INFO TESTNG PASSED: "Surefire test" - org.apache.brooklyn.camp.brooklyn.test.lite.CampYamlLiteTest.testAddChildrenEffector() finished in 1225 ms
2015-09-21 18:18:43,260 INFO TESTNG INVOKING CONFIGURATION: "Surefire test" - @AfterMethod org.apache.brooklyn.camp.brooklyn.test.lite.CampYamlLiteTest.tearDown()
2015-09-21 18:18:43,787 INFO TESTNG PASSED CONFIGURATION: "Surefire test" - @AfterMethod org.apache.brooklyn.camp.brooklyn.test.lite.CampYamlLiteTest.tearDown() finished in 527 ms
2015-09-21 18:18:43,787 INFO TESTNG INVOKING CONFIGURATION: "Surefire test" - @BeforeMethod org.apache.brooklyn.camp.brooklyn.test.lite.CampYamlLiteTest.setUp()
SUREFIRE-859: [GC 412787K->213691K(758656K), 0.0100490 secs]
2015-09-21 18:18:44,414 INFO TESTNG PASSED CONFIGURATION: "Surefire test" - @BeforeMethod org.apache.brooklyn.camp.brooklyn.test.lite.CampYamlLiteTest.setUp() finished in 627 ms
2015-09-21 18:18:44,414 INFO TESTNG INVOKING: "Surefire test" - org.apache.brooklyn.camp.brooklyn.test.lite.CampYamlLiteTest.testRegisterCustomEntityWithBundleWhereEntityIsFromCoreAndIconFromBundle()
2015-09-21 18:18:44,432 INFO TESTNG PASSED: "Surefire test" - org.apache.brooklyn.camp.brooklyn.test.lite.CampYamlLiteTest.testRegisterCustomEntityWithBundleWhereEntityIsFromCoreAndIconFromBundle() finished in 18 ms
2015-09-21 18:18:44,432 INFO TESTNG INVOKING CONFIGURATION: "Surefire test" - @AfterMethod org.apache.brooklyn.camp.brooklyn.test.lite.CampYamlLiteTest.tearDown()
2015-09-21 18:18:44,891 INFO TESTNG PASSED CONFIGURATION: "Surefire test" - @AfterMethod org.apache.brooklyn.camp.brooklyn.test.lite.CampYamlLiteTest.tearDown() finished in 459 ms
2015-09-21 18:18:44,892 INFO TESTNG INVOKING CONFIGURATION: "Surefire test" - @BeforeMethod org.apache.brooklyn.camp.brooklyn.test.lite.CampYamlLiteTest.setUp()
2015-09-21 18:18:45,365 INFO TESTNG PASSED CONFIGURATION: "Surefire test" - @BeforeMethod org.apache.brooklyn.camp.brooklyn.test.lite.CampYamlLiteTest.setUp() finished in 473 ms
2015-09-21 18:18:45,366 INFO TESTNG INVOKING: "Surefire test" - org.apache.brooklyn.camp.brooklyn.test.lite.CampYamlLiteTest.testResetXmlWithCustomEntity()
SUREFIRE-859: [GC 418811K->215628K(757184K), 0.1515570 secs]
2015-09-21 18:18:47,804 INFO TESTNG PASSED: "Surefire test" - org.apache.brooklyn.camp.brooklyn.test.lite.CampYamlLiteTest.testResetXmlWithCustomEntity() finished in 2439 ms
2015-09-21 18:18:47,804 INFO TESTNG INVOKING CONFIGURATION: "Surefire test" - @AfterMethod org.apache.brooklyn.camp.brooklyn.test.lite.CampYamlLiteTest.tearDown()
2015-09-21 18:18:48,136 INFO TESTNG PASSED CONFIGURATION: "Surefire test" - @AfterMethod org.apache.brooklyn.camp.brooklyn.test.lite.CampYamlLiteTest.tearDown() finished in 332 ms
2015-09-21 18:18:48,137 INFO TESTNG INVOKING CONFIGURATION: "Surefire test" - @BeforeMethod org.apache.brooklyn.camp.brooklyn.test.lite.CampYamlLiteTest.setUp()
2015-09-21 18:18:48,810 INFO TESTNG PASSED CONFIGURATION: "Surefire test" - @BeforeMethod org.apache.brooklyn.camp.brooklyn.test.lite.CampYamlLiteTest.setUp() finished in 673 ms
2015-09-21 18:18:48,811 INFO TESTNG INVOKING: "Surefire test" - org.apache.brooklyn.camp.brooklyn.test.lite.CampYamlLiteTest.testYamlServiceForCatalog()
2015-09-21 18:18:48,825 INFO TESTNG PASSED: "Surefire test" - org.apache.brooklyn.camp.brooklyn.test.lite.CampYamlLiteTest.testYamlServiceForCatalog() finished in 14 ms
2015-09-21 18:18:48,825 INFO TESTNG INVOKING CONFIGURATION: "Surefire test" - @AfterMethod org.apache.brooklyn.camp.brooklyn.test.lite.CampYamlLiteTest.tearDown()
2015-09-21 18:18:49,372 INFO TESTNG PASSED CONFIGURATION: "Surefire test" - @AfterMethod org.apache.brooklyn.camp.brooklyn.test.lite.CampYamlLiteTest.tearDown() finished in 547 ms
2015-09-21 18:18:49,373 INFO TESTNG INVOKING CONFIGURATION: "Surefire test" - @BeforeMethod org.apache.brooklyn.camp.brooklyn.test.lite.CampYamlLiteTest.setUp()
SUREFIRE-859: [GC 420748K->215523K(761472K), 0.0100435 secs]
2015-09-21 18:18:50,151 INFO TESTNG PASSED CONFIGURATION: "Surefire test" - @BeforeMethod org.apache.brooklyn.camp.brooklyn.test.lite.CampYamlLiteTest.setUp() finished in 778 ms
2015-09-21 18:18:50,152 INFO TESTNG INVOKING: "Surefire test" - org.apache.brooklyn.camp.brooklyn.test.lite.CampYamlLiteTest.testYamlServiceMatchAndBrooklynInstantiate()
2015-09-21 18:18:50,154 INFO AT is:
org.apache.brooklyn.camp.spi.AssemblyTemplate@8a46a62[id=kEPH4e4I; type=AssemblyTemplate]
2015-09-21 18:18:50,534 INFO TESTNG PASSED: "Surefire test" - org.apache.brooklyn.camp.brooklyn.test.lite.CampYamlLiteTest.testYamlServiceMatchAndBrooklynInstantiate() finished in 382 ms
2015-09-21 18:18:50,537 INFO TESTNG INVOKING CONFIGURATION: "Surefire test" - @AfterMethod org.apache.brooklyn.camp.brooklyn.test.lite.CampYamlLiteTest.tearDown()
2015-09-21 18:18:50,539 WARN Error processing subscriptions to LSM.publish(Application[LJqHOz9U].Sensor: service.notUp.indicators (java.util.Map)={service.state=Application created but not yet started, at 2015-09-21 18:18:50.345} @ 1442855930346): java.lang.IllegalStateException: Management context no longer running
java.lang.IllegalStateException: Management context no longer running
at org.apache.brooklyn.core.mgmt.internal.LocalManagementContext.getSubscriptionManager(LocalManagementContext.java:298) ~[brooklyn-core-0.9.0-SNAPSHOT.jar:0.9.0-SNAPSHOT]
2015-09-21 18:18:50,860 INFO TESTNG PASSED CONFIGURATION: "Surefire test" - @AfterMethod org.apache.brooklyn.camp.brooklyn.test.lite.CampYamlLiteTest.tearDown() finished in 325 ms
2015-09-21 18:18:50,944 INFO TESTNG
===============================================
Surefire test
Tests run: 221, Failures: 1, Skips: 0
===============================================
2015-09-21 18:18:50,945 INFO BrooklynLeakListener.onFinish attempting to terminate all extant ManagementContexts: name=Surefire test; includedGroups=[]; excludedGroups=[Integration, Acceptance, Live, WIP]; suiteName=Surefire suite; outDir=F:\hudson\hudson-slave\workspace\incubator-brooklyn-master-windows\usage\camp\target\surefire-reports\Surefire suite: no org.apache.brooklyn.core.management.internal.LocalManagementContext available, so skipped
Tests run: 221, Failures: 1, Errors: 0, Skipped: 0, Time elapsed: 514.127 sec <<< FAILURE! - in TestSuite
testRebindWithCatalogPropertiesForDeprecationAndEnablementAbsent(org.apache.brooklyn.camp.brooklyn.catalog.CatalogYamlRebindTest) Time elapsed: 1.877 sec <<< FAILURE!
java.nio.file.InvalidPathException: Illegal char <:> at index 94: C:\Users\hudson\AppData\Local\Temp\1\CatalogYamlRebindTest-S3Sn\catalog\my.catalog.app.id.load:0.1.0.sYGB7WNq.tmp
at sun.nio.fs.WindowsPathParser.normalize(WindowsPathParser.java:176)
at sun.nio.fs.WindowsPathParser.parse(WindowsPathParser.java:147)
at sun.nio.fs.WindowsPathParser.parse(WindowsPathParser.java:77)
at sun.nio.fs.WindowsPath.parse(WindowsPath.java:94)
at sun.nio.fs.WindowsFileSystem.getPath(WindowsFileSystem.java:255)
at java.io.File.toPath(File.java:2069)
at org.apache.brooklyn.util.io.FilePermissions.apply(FilePermissions.java:61)
at org.apache.brooklyn.util.io.FileUtil.setFilePermissionsTo600(FileUtil.java:72)
at org.apache.brooklyn.core.mgmt.persist.FileBasedStoreObjectAccessor.put(FileBasedStoreObjectAccessor.java:82)
at org.apache.brooklyn.camp.brooklyn.catalog.CatalogYamlRebindTest$1.apply(CatalogYamlRebindTest.java:216)
at org.apache.brooklyn.camp.brooklyn.catalog.CatalogYamlRebindTest$1.apply(CatalogYamlRebindTest.java:209)
at org.apache.brooklyn.core.mgmt.rebind.RebindTestUtils.rebindAll(RebindTestUtils.java:433)
at org.apache.brooklyn.core.mgmt.rebind.RebindTestUtils.rebind(RebindTestUtils.java:318)
at org.apache.brooklyn.core.mgmt.rebind.RebindTestFixture.rebind(RebindTestFixture.java:254)
at org.apache.brooklyn.camp.brooklyn.AbstractYamlRebindTest.rebind(AbstractYamlRebindTest.java:86)
at org.apache.brooklyn.camp.brooklyn.catalog.CatalogYamlRebindTest.runRebindWithCatalogAndApp(CatalogYamlRebindTest.java:208)
at org.apache.brooklyn.camp.brooklyn.catalog.CatalogYamlRebindTest.testRebindWithCatalogPropertiesForDeprecationAndEnablementAbsent(CatalogYamlRebindTest.java:123)
Results :
Failed tests:
CatalogYamlRebindTest.testRebindWithCatalogPropertiesForDeprecationAndEnablementAbsent:123->runRebindWithCatalogAndApp:208->AbstractYamlRebindTest.rebind:86->RebindTestFixture.rebind:254 » InvalidPath
Tests run: 221, Failures: 1, Errors: 0, Skipped: 0
[JENKINS] Recording test results
[JENKINS] Archiving disabled
[INFO]
[INFO] ------------------------------------------------------------------------
[INFO] Skipping Brooklyn REST Server
[INFO] This project has been banned from the build due to previous failures.
[INFO] ------------------------------------------------------------------------
[INFO]
[INFO] ------------------------------------------------------------------------
[INFO] Skipping Brooklyn REST JavaScript Web GUI
[INFO] This project has been banned from the build due to previous failures.
[INFO] ------------------------------------------------------------------------
[INFO]
[INFO] ------------------------------------------------------------------------
[INFO] Skipping Brooklyn Launcher
[INFO] This project has been banned from the build due to previous failures.
[INFO] ------------------------------------------------------------------------
[INFO]
[INFO] ------------------------------------------------------------------------
[INFO] Skipping Brooklyn Command Line Interface
[INFO] This project has been banned from the build due to previous failures.
[INFO] ------------------------------------------------------------------------
[INFO]
[INFO] ------------------------------------------------------------------------
[INFO] Skipping Brooklyn All Things
[INFO] This project has been banned from the build due to previous failures.
[INFO] ------------------------------------------------------------------------
[INFO]
[INFO] ------------------------------------------------------------------------
[INFO] Skipping Brooklyn Simple Web Cluster Example
[INFO] This project has been banned from the build due to previous failures.
[INFO] ------------------------------------------------------------------------
[INFO]
[INFO] ------------------------------------------------------------------------
[INFO] Skipping Brooklyn Global Web Fabric Example
[INFO] This project has been banned from the build due to previous failures.
[INFO] ------------------------------------------------------------------------
[INFO]
[INFO] ------------------------------------------------------------------------
[INFO] Skipping Brooklyn Simple Messaging Publish-Subscribe Example
[INFO] This project has been banned from the build due to previous failures.
[INFO] ------------------------------------------------------------------------
[INFO]
[INFO] ------------------------------------------------------------------------
[INFO] Skipping Brooklyn NoSQL Cluster Examples
[INFO] This project has been banned from the build due to previous failures.
[INFO] ------------------------------------------------------------------------
[INFO]
[INFO] ------------------------------------------------------------------------
[INFO] Skipping Brooklyn Distribution
[INFO] This project has been banned from the build due to previous failures.
[INFO] ------------------------------------------------------------------------
[INFO]
[INFO] ------------------------------------------------------------------------
[INFO] Skipping Brooklyn QA
[INFO] This project has been banned from the build due to previous failures.
[INFO] ------------------------------------------------------------------------
[INFO]
[INFO] ------------------------------------------------------------------------
[INFO] Skipping Brooklyn REST Client
[INFO] This project has been banned from the build due to previous failures.
[INFO] ------------------------------------------------------------------------
[INFO] ------------------------------------------------------------------------
[INFO] Reactor Summary:
[INFO]
[INFO] Brooklyn Root ..................................... SUCCESS [4.076s]
[INFO] Brooklyn Parent Project ........................... SUCCESS [9.607s]
[INFO] Brooklyn Test Support Utilities ................... SUCCESS [16.012s]
[INFO] Brooklyn Logback Includable Configuration ......... SUCCESS [4.260s]
[INFO] Brooklyn Common Utilities ......................... SUCCESS [1:40.835s]
[INFO] Brooklyn API ...................................... SUCCESS [13.689s]
[INFO] Brooklyn Test Support ............................. SUCCESS [7.059s]
[INFO] Brooklyn Groovy Utilities ......................... SUCCESS [25.480s]
[INFO] Brooklyn Core ..................................... SUCCESS [21:08.865s]
[INFO] Brooklyn Policies ................................. SUCCESS [7:20.865s]
[INFO] Brooklyn Jclouds Location Targets ................. SUCCESS [1:49.268s]
[INFO] Brooklyn Secure JMXMP Agent ....................... SUCCESS [29.288s]
[INFO] Brooklyn JMX RMI Agent ............................ SUCCESS [7.784s]
[INFO] Brooklyn Software Base ............................ SUCCESS [10:38.185s]
[INFO] Brooklyn Web App Software Entities ................ SUCCESS [4:34.393s]
[INFO] Brooklyn Messaging Software Entities .............. SUCCESS [46.282s]
[INFO] Brooklyn Database Software Entities ............... SUCCESS [24.978s]
[INFO] Brooklyn Monitoring Software Entities ............. SUCCESS [17.414s]
[INFO] Brooklyn OSGi Software Entities ................... SUCCESS [19.182s]
[INFO] Brooklyn NoSQL Data Store Software Entities ....... SUCCESS [1:29.077s]
[INFO] Brooklyn Network Software Entities ................ SUCCESS [22.279s]
[INFO] Brooklyn CAMP REST API ............................ FAILURE [9:16.350s]
[INFO] Brooklyn REST Server .............................. SKIPPED
[INFO] Brooklyn REST JavaScript Web GUI .................. SKIPPED
[INFO] Brooklyn Launcher ................................. SKIPPED
[INFO] Brooklyn Command Line Interface ................... SKIPPED
[INFO] Brooklyn All Things ............................... SKIPPED
[INFO] Brooklyn Simple Web Cluster Example ............... SKIPPED
[INFO] Brooklyn Global Web Fabric Example ................ SKIPPED
[INFO] Brooklyn Simple Messaging Publish-Subscribe Example SKIPPED
[INFO] Brooklyn NoSQL Cluster Examples ................... SKIPPED
[INFO] Brooklyn Distribution ............................. SKIPPED
[INFO] Brooklyn QA ....................................... SKIPPED
[INFO] Brooklyn REST Client .............................. SKIPPED
[INFO] ------------------------------------------------------------------------
[INFO] BUILD FAILURE
[INFO] ------------------------------------------------------------------------
[INFO] Total time: 1:02:21.362s
[INFO] Finished at: Mon Sep 21 18:18:55 BST 2015
[INFO] Final Memory: 65M/240M
[INFO] ------------------------------------------------------------------------
[JENKINS] Archiving disabled
[JENKINS] Archiving disabled
[JENKINS] Archiving disabled
[JENKINS] Archiving disabled
[JENKINS] Archiving disabled
[JENKINS] Archiving disabled
[JENKINS] Archiving disabled
[JENKINS] Archiving disabled
[JENKINS] Archiving disabled
[JENKINS] Archiving disabled
[JENKINS] Archiving disabled
[JENKINS] Archiving disabled
[JENKINS] Archiving disabled
[JENKINS] Archiving disabled
[JENKINS] Archiving disabled
[JENKINS] Archiving disabled
[JENKINS] Archiving disabled
[JENKINS] Archiving disabled
[JENKINS] Archiving disabled
[JENKINS] Archiving disabled
[JENKINS] Archiving disabled
[JENKINS] Archiving disabled
[JENKINS] Archiving disabled
[JENKINS] Archiving disabled
[JENKINS] Archiving disabled
[JENKINS] Archiving disabled
[JENKINS] Archiving disabled
[JENKINS] Archiving disabled
[JENKINS] Archiving disabled
[JENKINS] Archiving disabled
[JENKINS] Archiving disabled
[JENKINS] Archiving disabled
[JENKINS] Archiving disabled
[JENKINS] Archiving disabled
Waiting for Jenkins to finish collecting data
[ERROR] Failed to execute goal org.apache.maven.plugins:maven-surefire-plugin:2.18.1:test (default-test) on project brooklyn-camp: There are test failures.
[ERROR]
[ERROR] Please refer to F:\hudson\hudson-slave\workspace\incubator-brooklyn-master-windows\usage\camp\target\surefire-reports for the individual test results.
[ERROR] -> [Help 1]
[ERROR]
[ERROR] To see the full stack trace of the errors, re-run Maven with the -e switch.
[ERROR] Re-run Maven using the -X switch to enable full debug logging.
[ERROR]
[ERROR] For more information about the errors and possible solutions, please read the following articles:
[ERROR] [Help 1] http://cwiki.apache.org/confluence/display/MAVEN/MojoFailureException
[ERROR]
[ERROR] After correcting the problems, you can resume the build with the command
[ERROR] mvn <goals> -rf :brooklyn-camp
channel stopped
Build failed in Jenkins: incubator-brooklyn-master-windows #290
Posted by Apache Jenkins Server <je...@builds.apache.org>.
See <https://builds.apache.org/job/incubator-brooklyn-master-windows/290/changes>
Changes:
[cheepeero] Use java7 Files.setPosixFilePermissions on posix filesystems
[cheepeero] Remove unneeded imports
[cheepeero] Optimize Os.isMicrosoftWindows()
[aled.sage] Improve winrm docs
------------------------------------------
[...truncated 22456 lines...]
[INFO] --- maven-clean-plugin:2.6.1:clean (default-clean) @ brooklyn-storage-hazelcast ---
[INFO] Deleting F:\hudson\hudson-slave\workspace\incubator-brooklyn-master-windows\storage\hazelcast\target
[INFO] Deleting F:\hudson\hudson-slave\workspace\incubator-brooklyn-master-windows\storage\hazelcast (includes = [brooklyn*.log, brooklyn*.log.*, stacktrace.log, test-output, prodDb.*], excludes = [])
[INFO]
[INFO] --- maven-replacer-plugin:1.4.1:replace (fix-eclipse-dot-classpath-mangling) @ brooklyn-storage-hazelcast ---
[INFO] Ignoring missing file
[INFO] Replacement run on 0 file.
[INFO]
[INFO] --- buildnumber-maven-plugin:1.3:create (default) @ brooklyn-storage-hazelcast ---
[INFO]
[INFO] --- maven-enforcer-plugin:1.4:enforce (brooklyn-build-req) @ brooklyn-storage-hazelcast ---
[INFO]
[INFO] --- maven-remote-resources-plugin:1.5:process (default) @ brooklyn-storage-hazelcast ---
[INFO]
[INFO] --- maven-resources-plugin:2.7:resources (default-resources) @ brooklyn-storage-hazelcast ---
[INFO] Using 'UTF-8' encoding to copy filtered resources.
[INFO] skip non existing resourceDirectory F:\hudson\hudson-slave\workspace\incubator-brooklyn-master-windows\storage\hazelcast\src\main\resources
[INFO] Copying 4 resources
[INFO]
[INFO] --- maven-compiler-plugin:3.3:compile (default-compile) @ brooklyn-storage-hazelcast ---
[INFO] Changes detected - recompiling the module!
[INFO] Compiling 4 source files to F:\hudson\hudson-slave\workspace\incubator-brooklyn-master-windows\storage\hazelcast\target\classes
[INFO]
[INFO] --- maven-checkstyle-plugin:2.13:check (verify-style) @ brooklyn-storage-hazelcast ---
[INFO]
[INFO]
[INFO] --- buildnumber-maven-plugin:1.3:create (default) @ brooklyn-storage-hazelcast ---
[INFO]
[INFO] --- maven-enforcer-plugin:1.4:enforce (brooklyn-build-req) @ brooklyn-storage-hazelcast ---
[INFO]
[INFO] --- maven-remote-resources-plugin:1.5:process (default) @ brooklyn-storage-hazelcast ---
[INFO]
[INFO] --- maven-resources-plugin:2.7:resources (default-resources) @ brooklyn-storage-hazelcast ---
[INFO] Using 'UTF-8' encoding to copy filtered resources.
[INFO] skip non existing resourceDirectory F:\hudson\hudson-slave\workspace\incubator-brooklyn-master-windows\storage\hazelcast\src\main\resources
[INFO] Copying 4 resources
[INFO] Copying 4 resources
[INFO]
[INFO] --- maven-compiler-plugin:3.3:compile (default-compile) @ brooklyn-storage-hazelcast ---
[INFO] Nothing to compile - all classes are up to date
[INFO]
[INFO] --- maven-checkstyle-plugin:2.13:check (verify-style) @ brooklyn-storage-hazelcast ---
[INFO]
[WARNING] Failed to getClass for org.apache.felix.bundleplugin.ManifestPlugin
[INFO]
[INFO] --- maven-bundle-plugin:2.5.4:manifest (bundle-manifest) @ brooklyn-storage-hazelcast ---
[WARNING] Manifest org.apache.brooklyn:brooklyn-storage-hazelcast:jar:0.9.0-SNAPSHOT : Unused Export-Package instructions: [brooklyn.*]
[INFO]
[INFO] --- maven-resources-plugin:2.7:testResources (default-testResources) @ brooklyn-storage-hazelcast ---
[INFO] Using 'UTF-8' encoding to copy filtered resources.
[INFO] skip non existing resourceDirectory F:\hudson\hudson-slave\workspace\incubator-brooklyn-master-windows\storage\hazelcast\src\test\resources
[INFO] Copying 4 resources
[INFO]
[INFO] --- maven-compiler-plugin:3.3:testCompile (default-testCompile) @ brooklyn-storage-hazelcast ---
[INFO] Changes detected - recompiling the module!
[INFO] Compiling 1 source file to F:\hudson\hudson-slave\workspace\incubator-brooklyn-master-windows\storage\hazelcast\target\test-classes
[INFO]
[INFO] --- maven-surefire-plugin:2.18.1:test (default-test) @ brooklyn-storage-hazelcast ---
[INFO] Surefire report directory: F:\hudson\hudson-slave\workspace\incubator-brooklyn-master-windows\storage\hazelcast\target\surefire-reports
-------------------------------------------------------
T E S T S
-------------------------------------------------------
Running org.apache.brooklyn.storage.impl.hazelcast.HazelcastStorageTest
Configuring TestNG with: TestNG652Configurator
2015-09-21 17:15:26,463 INFO TESTNG RUNNING: Suite: "Surefire test" containing "0" Tests (config: null)
2015-09-21 17:15:26,468 INFO BrooklynLeakListener.onStart attempting to terminate all extant ManagementContexts: name=Surefire test; includedGroups=[]; excludedGroups=[Integration, Acceptance, Live, WIP]; suiteName=Surefire suite; outDir=F:\hudson\hudson-slave\workspace\incubator-brooklyn-master-windows\storage\hazelcast\target\surefire-reports\Surefire suite: no org.apache.brooklyn.core.management.internal.LocalManagementContext available, so skipped
2015-09-21 17:15:33,690 INFO TESTNG
===============================================
Surefire test
Tests run: 0, Failures: 0, Skips: 0
===============================================
2015-09-21 17:15:33,691 INFO BrooklynLeakListener.onFinish attempting to terminate all extant ManagementContexts: name=Surefire test; includedGroups=[]; excludedGroups=[Integration, Acceptance, Live, WIP]; suiteName=Surefire suite; outDir=F:\hudson\hudson-slave\workspace\incubator-brooklyn-master-windows\storage\hazelcast\target\surefire-reports\Surefire suite: no org.apache.brooklyn.core.management.internal.LocalManagementContext available, so skipped
Tests run: 0, Failures: 0, Errors: 0, Skipped: 0, Time elapsed: 13.163 sec - in org.apache.brooklyn.storage.impl.hazelcast.HazelcastStorageTest
Results :
Tests run: 0, Failures: 0, Errors: 0, Skipped: 0
[JENKINS] Recording test results
[INFO]
[INFO] --- maven-jar-plugin:2.6:jar (default-jar) @ brooklyn-storage-hazelcast ---
[INFO] Building jar: F:\hudson\hudson-slave\workspace\incubator-brooklyn-master-windows\storage\hazelcast\target\brooklyn-storage-hazelcast-0.9.0-SNAPSHOT.jar
[INFO]
[INFO] --- maven-site-plugin:3.4:attach-descriptor (attach-descriptor) @ brooklyn-storage-hazelcast ---
[INFO]
[INFO] --- maven-jar-plugin:2.6:test-jar (test-jar-creation) @ brooklyn-storage-hazelcast ---
[INFO] Building jar: F:\hudson\hudson-slave\workspace\incubator-brooklyn-master-windows\storage\hazelcast\target\brooklyn-storage-hazelcast-0.9.0-SNAPSHOT-tests.jar
[INFO]
[INFO] --- apache-rat-plugin:0.10:check (default) @ brooklyn-storage-hazelcast ---
[INFO] 51 implicit excludes (use -debug for more details).
[INFO] Exclude: sandbox/**
[INFO] Exclude: release/**
[INFO] Exclude: **/nbactions.xml
[INFO] Exclude: **/nb-configuration.xml
[INFO] Exclude: **/.git/**
[INFO] Exclude: **/.gitignore
[INFO] Exclude: **/.repository/**
[INFO] Exclude: **/.idea/**
[INFO] Exclude: **/*.iml
[INFO] Exclude: **/.classpath/**
[INFO] Exclude: **/.project
[INFO] Exclude: **/.settings/**
[INFO] Exclude: **/*.log
[INFO] Exclude: **/brooklyn*.log.*
[INFO] Exclude: **/target/**
[INFO] Exclude: ignored/**
[INFO] Exclude: LICENSE.md
[INFO] Exclude: **/src/main/license/**
[INFO] Exclude: **/src/test/license/**
[INFO] Exclude: **/MANIFEST.MF
[INFO] Exclude: **/test-output/**
[INFO] Exclude: **/*.pem.pub
[INFO] Exclude: **/*.pem
[INFO] Exclude: **/*_rsa.pub
[INFO] Exclude: **/*_rsa
[INFO] Exclude: **/*.svg
[INFO] Exclude: **/*.crt
[INFO] Exclude: **/*.csr
[INFO] Exclude: **/*.key
[INFO] Exclude: **/*.key.org
[INFO] Exclude: **/*.psd
[INFO] Exclude: **/*.json
[INFO] Exclude: **/*.plxarc
[INFO] Exclude: **/src/test/resources/org/apache/brooklyn/entity/software/base/template_with_extra_substitutions.txt
[INFO] Exclude: **/src/main/resources/banner.txt
[INFO] Exclude: **/src/test/resources/ssl/certs/localhost/info.txt
[INFO] Exclude: **/sandbox/examples/src/main/scripts/amis.txt
[INFO] Exclude: docs/**
[INFO] 6 resources included (use -debug for more details)
[INFO] Rat check: Summary of files. Unapproved: 0 unknown: 0 generated: 0 approved: 6 licence.
[INFO]
[INFO] --- maven-source-plugin:2.4:jar-no-fork (attach-sources) @ brooklyn-storage-hazelcast ---
[INFO] Building jar: F:\hudson\hudson-slave\workspace\incubator-brooklyn-master-windows\storage\hazelcast\target\brooklyn-storage-hazelcast-0.9.0-SNAPSHOT-sources.jar
[INFO]
[INFO] --- maven-install-plugin:2.5.2:install (default-install) @ brooklyn-storage-hazelcast ---
[INFO] Installing F:\hudson\hudson-slave\workspace\incubator-brooklyn-master-windows\storage\hazelcast\target\brooklyn-storage-hazelcast-0.9.0-SNAPSHOT.jar to f:\hudson\hudson-slave\maven-repositories\0\org\apache\brooklyn\brooklyn-storage-hazelcast\0.9.0-SNAPSHOT\brooklyn-storage-hazelcast-0.9.0-SNAPSHOT.jar
[INFO] Installing F:\hudson\hudson-slave\workspace\incubator-brooklyn-master-windows\storage\hazelcast\pom.xml to f:\hudson\hudson-slave\maven-repositories\0\org\apache\brooklyn\brooklyn-storage-hazelcast\0.9.0-SNAPSHOT\brooklyn-storage-hazelcast-0.9.0-SNAPSHOT.pom
[INFO] Installing F:\hudson\hudson-slave\workspace\incubator-brooklyn-master-windows\storage\hazelcast\target\brooklyn-storage-hazelcast-0.9.0-SNAPSHOT-tests.jar to f:\hudson\hudson-slave\maven-repositories\0\org\apache\brooklyn\brooklyn-storage-hazelcast\0.9.0-SNAPSHOT\brooklyn-storage-hazelcast-0.9.0-SNAPSHOT-tests.jar
[INFO] Installing F:\hudson\hudson-slave\workspace\incubator-brooklyn-master-windows\storage\hazelcast\target\brooklyn-storage-hazelcast-0.9.0-SNAPSHOT-sources.jar to f:\hudson\hudson-slave\maven-repositories\0\org\apache\brooklyn\brooklyn-storage-hazelcast\0.9.0-SNAPSHOT\brooklyn-storage-hazelcast-0.9.0-SNAPSHOT-sources.jar
[JENKINS] Archiving disabled
[INFO]
[INFO] ------------------------------------------------------------------------
[INFO] Skipping Brooklyn Distribution
[INFO] This project has been banned from the build due to previous failures.
[INFO] ------------------------------------------------------------------------
[INFO]
[INFO] ------------------------------------------------------------------------
[INFO] Skipping Brooklyn QA
[INFO] This project has been banned from the build due to previous failures.
[INFO] ------------------------------------------------------------------------
[INFO]
[INFO] ------------------------------------------------------------------------
[INFO] Skipping Brooklyn REST Client
[INFO] This project has been banned from the build due to previous failures.
[INFO] ------------------------------------------------------------------------
[INFO] ------------------------------------------------------------------------
[INFO] Reactor Summary:
[INFO]
[INFO] Brooklyn Root ..................................... SUCCESS [6.601s]
[INFO] Brooklyn Parent Project ........................... SUCCESS [9.031s]
[INFO] Brooklyn Test Support Utilities ................... SUCCESS [13.460s]
[INFO] Brooklyn Logback Includable Configuration ......... SUCCESS [4.044s]
[INFO] Brooklyn Common Utilities ......................... SUCCESS [48.457s]
[INFO] Brooklyn API ...................................... SUCCESS [12.128s]
[INFO] Brooklyn Test Support ............................. SUCCESS [6.693s]
[INFO] Brooklyn Groovy Utilities ......................... SUCCESS [25.135s]
[INFO] Brooklyn Core ..................................... SUCCESS [20:03.132s]
[INFO] Brooklyn Policies ................................. SUCCESS [7:33.516s]
[INFO] Brooklyn Jclouds Location Targets ................. SUCCESS [2:11.969s]
[INFO] Brooklyn Secure JMXMP Agent ....................... SUCCESS [1:46.355s]
[INFO] Brooklyn Software Base ............................ FAILURE [7:11.256s]
[INFO] Brooklyn Web App Software Entities ................ SKIPPED
[INFO] Brooklyn Messaging Software Entities .............. SKIPPED
[INFO] Brooklyn Database Software Entities ............... SKIPPED
[INFO] Brooklyn Monitoring Software Entities ............. SKIPPED
[INFO] Brooklyn OSGi Software Entities ................... SKIPPED
[INFO] Brooklyn NoSQL Data Store Software Entities ....... SKIPPED
[INFO] Brooklyn Network Software Entities ................ SKIPPED
[INFO] Brooklyn CAMP REST API ............................ SKIPPED
[INFO] Brooklyn REST Server .............................. SKIPPED
[INFO] Brooklyn REST JavaScript Web GUI .................. SKIPPED
[INFO] Brooklyn Launcher ................................. SKIPPED
[INFO] Brooklyn Command Line Interface ................... SKIPPED
[INFO] Brooklyn All Things ............................... SKIPPED
[INFO] Brooklyn Simple Web Cluster Example ............... SKIPPED
[INFO] Brooklyn Global Web Fabric Example ................ SKIPPED
[INFO] Brooklyn Simple Messaging Publish-Subscribe Example SKIPPED
[INFO] Brooklyn NoSQL Cluster Examples ................... SKIPPED
[INFO] Brooklyn Hazelcast Storage ........................ SUCCESS [26.425s]
[INFO] Brooklyn Distribution ............................. SKIPPED
[INFO] Brooklyn QA ....................................... SKIPPED
[INFO] Brooklyn REST Client .............................. SKIPPED
[INFO] ------------------------------------------------------------------------
[INFO] BUILD FAILURE
[INFO] ------------------------------------------------------------------------
[INFO] Total time: 41:32.957s
[INFO] Finished at: Mon Sep 21 17:15:35 BST 2015
[INFO] Final Memory: 58M/241M
[INFO] ------------------------------------------------------------------------
[JENKINS] Archiving disabled
[JENKINS] Archiving disabled
[JENKINS] Archiving disabled
[JENKINS] Archiving disabled
[JENKINS] Archiving disabled
[JENKINS] Archiving disabled
[JENKINS] Archiving disabled
[JENKINS] Archiving disabled
[JENKINS] Archiving disabled
[JENKINS] Archiving disabled
[JENKINS] Archiving disabled
[JENKINS] Archiving disabled
[JENKINS] Archiving disabled
[JENKINS] Archiving disabled
[JENKINS] Archiving disabled
[JENKINS] Archiving disabled
[JENKINS] Archiving disabled
[JENKINS] Archiving disabled
[JENKINS] Archiving disabled
[JENKINS] Archiving disabled
[JENKINS] Archiving disabled
[JENKINS] Archiving disabled
[JENKINS] Archiving disabled
[JENKINS] Archiving disabled
[JENKINS] Archiving disabled
[JENKINS] Archiving disabled
[JENKINS] Archiving disabled
[JENKINS] Archiving disabled
[JENKINS] Archiving disabled
[JENKINS] Archiving disabled
[JENKINS] Archiving disabled
[JENKINS] Archiving disabled
[JENKINS] Archiving disabled
[JENKINS] Archiving disabled
Waiting for Jenkins to finish collecting data
[ERROR] Failed to execute goal org.apache.maven.plugins:maven-surefire-plugin:2.18.1:test (default-test) on project brooklyn-software-base: There are test failures.
[ERROR]
[ERROR] Please refer to F:\hudson\hudson-slave\workspace\incubator-brooklyn-master-windows\software\base\target\surefire-reports for the individual test results.
[ERROR] -> [Help 1]
[ERROR]
[ERROR] To see the full stack trace of the errors, re-run Maven with the -e switch.
[ERROR] Re-run Maven using the -X switch to enable full debug logging.
[ERROR]
[ERROR] For more information about the errors and possible solutions, please read the following articles:
[ERROR] [Help 1] http://cwiki.apache.org/confluence/display/MAVEN/MojoFailureException
[ERROR]
[ERROR] After correcting the problems, you can resume the build with the command
[ERROR] mvn <goals> -rf :brooklyn-software-base
channel stopped