You are viewing a plain text version of this content. The canonical link for it is here.
Posted to builds@cassandra.apache.org by Apache Jenkins Server <je...@builds.apache.org> on 2026/08/23 17:35:10 UTC
Build complete: Cassandra-6.0 #111 [ABORTED] 74d32dc66f22a047f3f16d9b99d62840cdad8fef
-------------------------------------------------------------------------------
Build Cassandra-6.0 #111 Aborted
URL: https://ci-cassandra.apache.org/job/Cassandra-6.0/111/
-------------------------------------------------------------------------------
Changes:
[Michael Semb Wever] Remove the unused timeout pre-condition from the docker build scripts
-------------------------------------------------------------------------------
Failed Tests:
8 tests failed.
FAILED: dtest-novnode.materialized_views_test.TestMaterializedViews.Tests / dtest-novnode jdk17 5/64 / test_drop_with_stopped_build
FAILED: org.apache.cassandra.db.commitlog.CommitLogSegmentManagerCDCTest.Tests / test-latest jdk11 7/20 / testSegmentFlaggingWithNonblockingOnCreation-cassandra.testtag_IS_UNDEFINED
FAILED: org.apache.cassandra.db.virtual.AccordDebugKeyspaceTest.Tests / test-compression jdk21 6/20 / tracing-compression_jdk21_x86_64
FAILED: org.apache.cassandra.distributed.test.accord.AccordMigrationTest.Tests / jvm-dtest jdk21 4/16 / testPaxosToAccordCAS-_jdk21_x86_64
FAILED: org.apache.cassandra.distributed.test.accord.AccordMigrationTest.Tests / jvm-dtest jdk21 4/16 / testPaxosToAccordSerialRead-_jdk21_x86_64
FAILED: org.apache.cassandra.simulator.test.AccordHarrySimulationTest.Tests / simulator-dtest jdk11 2/2 / test-_jdk11_x86_64
FAILED: org.apache.cassandra.simulator.test.ShortPaxosSimulationTest.Tests / simulator-dtest jdk11 2/2 / selfReconcileTest-cassandra.testtag_IS_UNDEFINED
FAILED: org.apache.cassandra.simulator.test.EpochStressTest.Tests / simulator-dtest jdk11 2/2 / manyEpochsAndAccordConverges-cassandra.testtag_IS_UNDEFINED
-------------------------------------------------------------------------------
For complete test report and logs see https://nightlies.apache.org/cassandra/Cassandra-6.0/111/