You are viewing a plain text version of this content. The canonical link for it is here.
Posted to dev@lucene.apache.org by Apache Jenkins Server <je...@builds.apache.org> on 2019/06/09 15:44:27 UTC

[JENKINS] Lucene-Solr-BadApples-Tests-8.x - Build # 120 - Failure

Build: https://builds.apache.org/job/Lucene-Solr-BadApples-Tests-8.x/120/

All tests passed

Build Log:
[...truncated 4320 lines...]
    [javac] Compiling 11 source files to /home/jenkins/jenkins-slave/workspace/Lucene-Solr-BadApples-Tests-8.x/lucene/build/analysis/nori/classes/test
    [javac] /home/jenkins/jenkins-slave/workspace/Lucene-Solr-BadApples-Tests-8.x/lucene/analysis/nori/src/test/org/apache/lucene/analysis/ko/TestKoreanNumberFilter.java:52: error: <identifier> expected
    [javac]     try (reader) {
    [javac]                ^
    [javac] /home/jenkins/jenkins-slave/workspace/Lucene-Solr-BadApples-Tests-8.x/lucene/analysis/nori/src/test/org/apache/lucene/analysis/ko/TestKoreanNumberFilter.java:52: error: ')' expected
    [javac]     try (reader) {
    [javac]                 ^
    [javac] /home/jenkins/jenkins-slave/workspace/Lucene-Solr-BadApples-Tests-8.x/lucene/analysis/nori/src/test/org/apache/lucene/analysis/ko/TestKoreanNumberFilter.java:52: error: '{' expected
    [javac]     try (reader) {
    [javac]                   ^
    [javac] 3 errors

BUILD FAILED
/home/jenkins/jenkins-slave/workspace/Lucene-Solr-BadApples-Tests-8.x/build.xml:643: The following error occurred while executing this line:
/home/jenkins/jenkins-slave/workspace/Lucene-Solr-BadApples-Tests-8.x/build.xml:578: The following error occurred while executing this line:
/home/jenkins/jenkins-slave/workspace/Lucene-Solr-BadApples-Tests-8.x/build.xml:59: The following error occurred while executing this line:
/home/jenkins/jenkins-slave/workspace/Lucene-Solr-BadApples-Tests-8.x/lucene/build.xml:481: The following error occurred while executing this line:
/home/jenkins/jenkins-slave/workspace/Lucene-Solr-BadApples-Tests-8.x/lucene/common-build.xml:2270: The following error occurred while executing this line:
/home/jenkins/jenkins-slave/workspace/Lucene-Solr-BadApples-Tests-8.x/lucene/analysis/build.xml:110: The following error occurred while executing this line:
/home/jenkins/jenkins-slave/workspace/Lucene-Solr-BadApples-Tests-8.x/lucene/analysis/build.xml:38: The following error occurred while executing this line:
/home/jenkins/jenkins-slave/workspace/Lucene-Solr-BadApples-Tests-8.x/lucene/module-build.xml:67: The following error occurred while executing this line:
/home/jenkins/jenkins-slave/workspace/Lucene-Solr-BadApples-Tests-8.x/lucene/module-build.xml:64: The following error occurred while executing this line:
/home/jenkins/jenkins-slave/workspace/Lucene-Solr-BadApples-Tests-8.x/lucene/common-build.xml:903: The following error occurred while executing this line:
/home/jenkins/jenkins-slave/workspace/Lucene-Solr-BadApples-Tests-8.x/lucene/common-build.xml:915: The following error occurred while executing this line:
/home/jenkins/jenkins-slave/workspace/Lucene-Solr-BadApples-Tests-8.x/lucene/common-build.xml:2056: Compile failed; see the compiler error output for details.

Total time: 48 minutes 1 second
Build step 'Invoke Ant' marked build as failure
Archiving artifacts
Recording test results
Email was triggered for: Failure - Any
Sending email for trigger: Failure - Any