You are viewing a plain text version of this content. The canonical link for it is here.
Posted to dev@zookeeper.apache.org by Apache Jenkins Server <je...@builds.apache.org> on 2017/02/10 16:36:34 UTC
ZooKeeper_branch35_solaris - Build # 430 - Failure
See https://builds.apache.org/job/ZooKeeper_branch35_solaris/430/
###################################################################################
########################## LAST 60 LINES OF THE CONSOLE ###########################
[...truncated 34713 lines...]
[junit] 2017-02-10 16:37:00,517 [myid:] - INFO [main:ZKTestCase$1@55] - STARTING syncTest
[junit] 2017-02-10 16:37:00,517 [myid:] - INFO [main:JUnit4ZKTestRunner$LoggedInvokeMethod@77] - RUNNING TEST METHOD syncTest
[junit] 2017-02-10 16:37:09,676 [myid:] - INFO [main:Environment@109] - Server environment:zookeeper.version=3.5.3-alpha-SNAPSHOT--1, built on 02/10/2017 16:11 GMT
[junit] 2017-02-10 16:37:09,676 [myid:] - INFO [main:Environment@109] - Server environment:host.name=hudson-solaris
[junit] 2017-02-10 16:37:09,677 [myid:] - INFO [main:Environment@109] - Server environment:java.version=1.7.0_79
[junit] 2017-02-10 16:37:09,677 [myid:] - INFO [main:Environment@109] - Server environment:java.vendor=Oracle Corporation
[junit] 2017-02-10 16:37:09,677 [myid:] - INFO [main:Environment@109] - Server environment:java.home=/zonestorage/hudson_solaris/home/hudson/tools/java/jdk1.7.0_79/jre
[junit] 2017-02-10 16:37:09,677 [myid:] - INFO [main:Environment@109] - Server environment:java.class.path=/zonestorage/hudson_solaris/home/hudson/hudson-slave/workspace/ZooKeeper_branch35_solaris/build/test/classes:/zonestorage/hudson_solaris/home/hudson/hudson-slave/workspace/ZooKeeper_branch35_solaris/build/test/lib/antlr-2.7.7.jar:/zonestorage/hudson_solaris/home/hudson/hudson-slave/workspace/ZooKeeper_branch35_solaris/build/test/lib/antlr4-runtime-4.5.1-1.jar:/zonestorage/hudson_solaris/home/hudson/hudson-slave/workspace/ZooKeeper_branch35_solaris/build/test/lib/checkstyle-6.13.jar:/zonestorage/hudson_solaris/home/hudson/hudson-slave/workspace/ZooKeeper_branch35_solaris/build/test/lib/commons-beanutils-1.9.2.jar:/zonestorage/hudson_solaris/home/hudson/hudson-slave/workspace/ZooKeeper_branch35_solaris/build/test/lib/commons-cli-1.3.1.jar:/zonestorage/hudson_solaris/home/hudson/hudson-slave/workspace/ZooKeeper_branch35_solaris/build/test/lib/commons-collections-3.2.2.jar:/zonestorage/hudson_solaris/home/hudson/hudson-slave/workspace/ZooKeeper_branch35_solaris/build/test/lib/commons-lang3-3.4.jar:/zonestorage/hudson_solaris/home/hudson/hudson-slave/workspace/ZooKeeper_branch35_solaris/build/test/lib/commons-logging-1.1.1.jar:/zonestorage/hudson_solaris/home/hudson/hudson-slave/workspace/ZooKeeper_branch35_solaris/build/test/lib/guava-18.0.jar:/zonestorage/hudson_solaris/home/hudson/hudson-slave/workspace/ZooKeeper_branch35_solaris/build/test/lib/hamcrest-core-1.3.jar:/zonestorage/hudson_solaris/home/hudson/hudson-slave/workspace/ZooKeeper_branch35_solaris/build/test/lib/junit-4.12.jar:/zonestorage/hudson_solaris/home/hudson/hudson-slave/workspace/ZooKeeper_branch35_solaris/build/test/lib/mockito-all-1.8.2.jar:/zonestorage/hudson_solaris/home/hudson/hudson-slave/workspace/ZooKeeper_branch35_solaris/build/classes:/zonestorage/hudson_solaris/home/hudson/hudson-slave/workspace/ZooKeeper_branch35_solaris/src/java/lib/ivy-2.4.0.jar:/home/jenkins/tools/ant/latest/lib/ant.jar:/zonestorage/hudson_solaris/home/hudson/hudson-slave/workspace/ZooKeeper_branch35_solaris/build/lib/commons-cli-1.2.jar:/zonestorage/hudson_solaris/home/hudson/hudson-slave/workspace/ZooKeeper_branch35_solaris/build/lib/jackson-core-asl-1.9.11.jar:/zonestorage/hudson_solaris/home/hudson/hudson-slave/workspace/ZooKeeper_branch35_solaris/build/lib/jackson-mapper-asl-1.9.11.jar:/zonestorage/hudson_solaris/home/hudson/hudson-slave/workspace/ZooKeeper_branch35_solaris/build/lib/javacc.jar:/zonestorage/hudson_solaris/home/hudson/hudson-slave/workspace/ZooKeeper_branch35_solaris/build/lib/javax.servlet-api-3.1.0.jar:/zonestorage/hudson_solaris/home/hudson/hudson-slave/workspace/ZooKeeper_branch35_solaris/build/lib/jetty-http-9.2.18.v20160721.jar:/zonestorage/hudson_solaris/home/hudson/hudson-slave/workspace/ZooKeeper_branch35_solaris/build/lib/jetty-io-9.2.18.v20160721.jar:/zonestorage/hudson_solaris/home/hudson/hudson-slave/workspace/ZooKeeper_branch35_solaris/build/lib/jetty-security-9.2.18.v20160721.jar:/zonestorage/hudson_solaris/home/hudson/hudson-slave/workspace/ZooKeeper_branch35_solaris/build/lib/jetty-server-9.2.18.v20160721.jar:/zonestorage/hudson_solaris/home/hudson/hudson-slave/workspace/ZooKeeper_branch35_solaris/build/lib/jetty-servlet-9.2.18.v20160721.jar:/zonestorage/hudson_solaris/home/hudson/hudson-slave/workspace/ZooKeeper_branch35_solaris/build/lib/jetty-util-9.2.18.v20160721.jar:/zonestorage/hudson_solaris/home/hudson/hudson-slave/workspace/ZooKeeper_branch35_solaris/build/lib/jline-2.11.jar:/zonestorage/hudson_solaris/home/hudson/hudson-slave/workspace/ZooKeeper_branch35_solaris/build/lib/log4j-1.2.17.jar:/zonestorage/hudson_solaris/home/hudson/hudson-slave/workspace/ZooKeeper_branch35_solaris/build/lib/netty-3.10.5.Final.jar:/zonestorage/hudson_solaris/home/hudson/hudson-slave/workspace/ZooKeeper_branch35_solaris/build/lib/slf4j-api-1.7.5.jar:/zonestorage/hudson_solaris/home/hudson/hudson-slave/workspace/ZooKeeper_branch35_solaris/build/lib/slf4j-log4j12-1.7.5.jar:/zonestorage/hudson_solaris/home/hudson/tools/ant/apache-ant-1.8.2/lib/ant-launcher.jar:/home/jenkins/tools/ant/latest/lib/ant-junit.jar:/home/jenkins/tools/ant/latest/lib/ant-junit4.jar
[junit] 2017-02-10 16:37:09,678 [myid:] - INFO [main:Environment@109] - Server environment:java.library.path=/usr/jdk/packages/lib/i386:/lib:/usr/lib
[junit] 2017-02-10 16:37:09,678 [myid:] - INFO [main:Environment@109] - Server environment:java.io.tmpdir=/var/tmp/
[junit] 2017-02-10 16:37:09,678 [myid:] - INFO [main:Environment@109] - Server environment:java.compiler=<NA>
[junit] 2017-02-10 16:37:09,678 [myid:] - INFO [main:Environment@109] - Server environment:os.name=SunOS
[junit] 2017-02-10 16:37:09,678 [myid:] - INFO [main:Environment@109] - Server environment:os.arch=x86
[junit] 2017-02-10 16:37:09,678 [myid:] - INFO [main:Environment@109] - Server environment:os.version=5.10
[junit] 2017-02-10 16:37:09,678 [myid:] - INFO [main:Environment@109] - Server environment:user.name=hudson
[junit] 2017-02-10 16:37:09,679 [myid:] - INFO [main:Environment@109] - Server environment:user.home=/export/home/hudson
[junit] 2017-02-10 16:37:09,679 [myid:] - INFO [main:Environment@109] - Server environment:user.dir=/zonestorage/hudson_solaris/home/hudson/hudson-slave/workspace/ZooKeeper_branch35_solaris/build/test
[junit] 2017-02-10 16:37:09,679 [myid:] - INFO [main:Environment@109] - Server environment:os.memory.free=47MB
[junit] 2017-02-10 16:37:09,679 [myid:] - INFO [main:Environment@109] - Server environment:os.memory.max=454MB
[junit] 2017-02-10 16:37:09,679 [myid:] - INFO [main:Environment@109] - Server environment:os.memory.total=61MB
[junit] 2017-02-10 16:37:10,043 [myid:] - INFO [main:ZooKeeperServer@893] - minSessionTimeout set to 2000
[junit] 2017-02-10 16:37:10,044 [myid:] - INFO [main:ZooKeeperServer@902] - maxSessionTimeout set to 2000
[junit] 2017-02-10 16:37:10,054 [myid:] - INFO [main:ZooKeeperServer@159] - Created server with tickTime 2000 minSessionTimeout 2000 maxSessionTimeout 2000 datadir /zonestorage/hudson_solaris/home/hudson/hudson-slave/workspace/ZooKeeper_branch35_solaris/build/test/data/test7391747207294105162.dir/version-2 snapdir /zonestorage/hudson_solaris/home/hudson/hudson-slave/workspace/ZooKeeper_branch35_solaris/build/test/data/test7391747207294105162.dir/version-2
[junit] 2017-02-10 16:37:10,380 [myid:] - INFO [main:Learner@369] - Getting a snapshot from leader
[junit] 2017-02-10 16:37:10,661 [myid:] - WARN [main:Learner@417] - Got zxid 0x0 expected 0x1
[junit] 2017-02-10 16:37:10,662 [myid:] - INFO [main:ZooKeeperServer@893] - minSessionTimeout set to 2000
[junit] 2017-02-10 16:37:10,663 [myid:] - INFO [main:ZooKeeperServer@902] - maxSessionTimeout set to 2000
[junit] 2017-02-10 16:37:10,663 [myid:] - INFO [main:ZooKeeperServer@159] - Created server with tickTime 2000 minSessionTimeout 2000 maxSessionTimeout 2000 datadir /zonestorage/hudson_solaris/home/hudson/hudson-slave/workspace/ZooKeeper_branch35_solaris/build/test/data/test7391747207294105162.dir/version-2 snapdir /zonestorage/hudson_solaris/home/hudson/hudson-slave/workspace/ZooKeeper_branch35_solaris/build/test/data/test7391747207294105162.dir/version-2
[junit] 2017-02-10 16:37:11,008 [myid:] - INFO [main:JUnit4ZKTestRunner$LoggedInvokeMethod@82] - Memory used 14706
[junit] 2017-02-10 16:37:11,008 [myid:] - INFO [main:JUnit4ZKTestRunner$LoggedInvokeMethod@87] - Number of threads 4
[junit] 2017-02-10 16:37:11,008 [myid:] - INFO [main:JUnit4ZKTestRunner$LoggedInvokeMethod@102] - FINISHED TEST METHOD syncTest
[junit] 2017-02-10 16:37:11,008 [myid:] - INFO [main:ZKTestCase$1@65] - SUCCEEDED syncTest
[junit] 2017-02-10 16:37:11,009 [myid:] - INFO [main:ZKTestCase$1@60] - FINISHED syncTest
[junit] Tests run: 3, Failures: 0, Errors: 0, Time elapsed: 19.355 sec
[junit] Running org.apache.zookeeper.server.quorum.LocalPeerBeanTest
[junit] 2017-02-10 16:37:30,506 [myid:] - INFO [main:Log@186] - Logging initialized @12947ms
[junit] 2017-02-10 16:37:32,996 [myid:] - WARN [main:ContextHandler@1339] - o.e.j.s.ServletContextHandler@4c98f4{/,null,null} contextPath ends with /*
[junit] 2017-02-10 16:37:32,997 [myid:] - WARN [main:ContextHandler@1350] - Empty contextPath
[junit] 2017-02-10 16:37:33,929 [myid:] - INFO [main:PortAssignment@157] - Single test process using ports from 11221 - 32767.
[junit] 2017-02-10 16:37:33,986 [myid:] - INFO [main:PortAssignment@85] - Assigned port 11222 from range 11221 - 32767.
[junit] 2017-02-10 16:37:34,335 [myid:] - INFO [main:NIOServerCnxnFactory@673] - Configuring NIO connection handler with 10s sessionless connection timeout, 2 selector thread(s), 16 worker threads, and 64 kB direct buffers.
[junit] 2017-02-10 16:37:34,990 [myid:] - INFO [main:NIOServerCnxnFactory@686] - binding to port 0.0.0.0/0.0.0.0:11222
[junit] 2017-02-10 16:37:35,072 [myid:] - INFO [main:PortAssignment@85] - Assigned port 11223 from range 11221 - 32767.
[junit] 2017-02-10 16:37:35,073 [myid:] - INFO [main:NIOServerCnxnFactory@673] - Configuring NIO connection handler with 10s sessionless connection timeout, 2 selector thread(s), 16 worker threads, and 64 kB direct buffers.
[junit] 2017-02-10 16:37:35,108 [myid:] - INFO [main:NIOServerCnxnFactory@686] - binding to port localhost/127.0.0.1:11223
[junit] Tests run: 1, Failures: 0, Errors: 0, Time elapsed: 11.343 sec
[junit] Running org.apache.zookeeper.server.quorum.QuorumPeerConfigTest
[junit] Tests run: 1, Failures: 0, Errors: 1, Time elapsed: 0 sec
BUILD FAILED
/zonestorage/hudson_solaris/home/hudson/hudson-slave/workspace/ZooKeeper_branch35_solaris/build.xml:1227: Process fork failed.
Total time: 26 minutes 25 seconds
Build step 'Invoke Ant' marked build as failure
[locks-and-latches] Releasing all the locks
[locks-and-latches] All the locks released
Recording test results
Email was triggered for: Failure - Any
Sending email for trigger: Failure - Any
###################################################################################
############################## FAILED TESTS (if any) ##############################
2 tests failed.
FAILED: org.apache.zookeeper.server.admin.JettyAdminServerTest.testQuorum
Error Message:
Connection refused
Stack Trace:
java.net.ConnectException: Connection refused
at java.net.PlainSocketImpl.socketConnect(Native Method)
at java.net.AbstractPlainSocketImpl.doConnect(AbstractPlainSocketImpl.java:339)
at java.net.AbstractPlainSocketImpl.connectToAddress(AbstractPlainSocketImpl.java:200)
at java.net.AbstractPlainSocketImpl.connect(AbstractPlainSocketImpl.java:182)
at java.net.SocksSocketImpl.connect(SocksSocketImpl.java:392)
at java.net.Socket.connect(Socket.java:579)
at java.net.Socket.connect(Socket.java:528)
at sun.net.NetworkClient.doConnect(NetworkClient.java:180)
at sun.net.www.http.HttpClient.openServer(HttpClient.java:432)
at sun.net.www.http.HttpClient.openServer(HttpClient.java:527)
at sun.net.www.http.HttpClient.<init>(HttpClient.java:211)
at sun.net.www.http.HttpClient.New(HttpClient.java:308)
at sun.net.www.http.HttpClient.New(HttpClient.java:326)
at sun.net.www.protocol.http.HttpURLConnection.getNewHttpClient(HttpURLConnection.java:997)
at sun.net.www.protocol.http.HttpURLConnection.plainConnect(HttpURLConnection.java:933)
at sun.net.www.protocol.http.HttpURLConnection.connect(HttpURLConnection.java:851)
at sun.net.www.protocol.http.HttpURLConnection.getInputStream(HttpURLConnection.java:1301)
at java.net.URL.openStream(URL.java:1037)
at org.apache.zookeeper.server.admin.JettyAdminServerTest.queryAdminServer(JettyAdminServerTest.java:158)
at org.apache.zookeeper.server.admin.JettyAdminServerTest.queryAdminServer(JettyAdminServerTest.java:150)
at org.apache.zookeeper.server.admin.JettyAdminServerTest.testQuorum(JettyAdminServerTest.java:131)
at org.apache.zookeeper.JUnit4ZKTestRunner$LoggedInvokeMethod.evaluate(JUnit4ZKTestRunner.java:79)
FAILED: org.apache.zookeeper.server.quorum.QuorumPeerConfigTest.unknown
Error Message:
Forked Java VM exited abnormally. Please note the time in the report does not reflect the time until the VM exit.
Stack Trace:
junit.framework.AssertionFailedError: Forked Java VM exited abnormally. Please note the time in the report does not reflect the time until the VM exit.
ZooKeeper_branch35_solaris - Build # 433 - Still Failing
Posted by Apache Jenkins Server <je...@builds.apache.org>.
See https://builds.apache.org/job/ZooKeeper_branch35_solaris/433/
###################################################################################
########################## LAST 60 LINES OF THE CONSOLE ###########################
[...truncated 991 lines...]
[junit] 2017-02-12 01:40:44,078 [myid:] - INFO [main:JMXEnv@249] - found:StandaloneServer_port org.apache.ZooKeeperService:name0=StandaloneServer_port11228
[junit] 2017-02-12 01:40:44,078 [myid:] - INFO [main:ClientBase@462] - Client test setup finished
[junit] 2017-02-12 01:40:44,079 [myid:] - INFO [main:ZooKeeper@863] - Initiating client connection, connectString=127.0.0.1:11228 sessionTimeout=30000 watcher=org.apache.zookeeper.test.ClientBase$CountdownWatcher@9a5c34
[junit] 2017-02-12 01:40:44,080 [myid:] - INFO [main:ClientCnxnSocket@236] - jute.maxbuffer value is 4194304 Bytes
[junit] 2017-02-12 01:40:44,080 [myid:127.0.0.1:11228] - INFO [main-SendThread(127.0.0.1:11228):ClientCnxn$SendThread@1113] - Opening socket connection to server 127.0.0.1/127.0.0.1:11228. Will not attempt to authenticate using SASL (unknown error)
[junit] 2017-02-12 01:40:44,081 [myid:127.0.0.1:11228] - INFO [main-SendThread(127.0.0.1:11228):ClientCnxn$SendThread@948] - Socket connection established, initiating session, client: null, server: null
[junit] 2017-02-12 01:40:44,086 [myid:] - INFO [NIOServerCxnFactory.AcceptThread:0.0.0.0/0.0.0.0:11228:NIOServerCnxnFactory$AcceptThread@296] - Accepted socket connection from /127.0.0.1:45495
[junit] 2017-02-12 01:40:44,096 [myid:] - INFO [NIOWorkerThread-2:ZooKeeperServer@999] - Client attempting to establish new session at /127.0.0.1:45495
[junit] 2017-02-12 01:40:44,097 [myid:] - INFO [SyncThread:0:FileTxnLog@204] - Creating new log file: log.1
[junit] 2017-02-12 01:40:44,102 [myid:] - INFO [SyncThread:0:ZooKeeperServer@713] - Established session 0x126acf3b45e0000 with negotiated timeout 30000 for client /127.0.0.1:45495
[junit] 2017-02-12 01:40:44,103 [myid:127.0.0.1:11228] - INFO [main-SendThread(127.0.0.1:11228):ClientCnxn$SendThread@1381] - Session establishment complete on server null, sessionid = 0x126acf3b45e0000, negotiated timeout = 30000
[junit] 2017-02-12 01:40:44,104 [myid:] - INFO [main:JMXEnv@117] - expect:0x126acf3b45e0000
[junit] 2017-02-12 01:40:44,104 [myid:] - INFO [main:JMXEnv@120] - found:0x126acf3b45e0000 org.apache.ZooKeeperService:name0=StandaloneServer_port11228,name1=Connections,name2=127.0.0.1,name3=0x126acf3b45e0000
[junit] 2017-02-12 01:40:44,104 [myid:] - INFO [Time-limited test:JUnit4ZKTestRunner$LoggedInvokeMethod@77] - RUNNING TEST METHOD testRemoveNodeChildrenChangedWatches
[junit] 2017-02-12 01:40:44,107 [myid:] - INFO [Time-limited test:RemoveWatchesCmdTest@181] - Adding child changed watcher
[junit] 2017-02-12 01:40:44,109 [myid:] - INFO [Time-limited test:RemoveWatchesCmdTest@185] - Remove watchers using shell command : removewatches /testnode1 -c
[junit] 2017-02-12 01:40:44,110 [myid:] - INFO [Time-limited test:JUnit4ZKTestRunner$LoggedInvokeMethod@82] - Memory used 6443
[junit] 2017-02-12 01:40:44,111 [myid:] - INFO [Time-limited test:JUnit4ZKTestRunner$LoggedInvokeMethod@87] - Number of threads 37
[junit] 2017-02-12 01:40:44,111 [myid:] - INFO [Time-limited test:JUnit4ZKTestRunner$LoggedInvokeMethod@102] - FINISHED TEST METHOD testRemoveNodeChildrenChangedWatches
[junit] 2017-02-12 01:40:44,111 [myid:] - INFO [ProcessThread(sid:0 cport:11228)::PrepRequestProcessor@655] - Processed session termination for sessionid: 0x126acf3b45e0000
[junit] 2017-02-12 01:40:44,113 [myid:] - INFO [main:ZooKeeper@1324] - Session: 0x126acf3b45e0000 closed
[junit] 2017-02-12 01:40:44,113 [myid:] - INFO [main:ClientBase@543] - tearDown starting
[junit] 2017-02-12 01:40:44,113 [myid:] - INFO [main-EventThread:ClientCnxn$EventThread@513] - EventThread shut down for session: 0x126acf3b45e0000
[junit] 2017-02-12 01:40:44,113 [myid:] - INFO [NIOWorkerThread-11:MBeanRegistry@128] - Unregister MBean [org.apache.ZooKeeperService:name0=StandaloneServer_port11228,name1=Connections,name2=127.0.0.1,name3=0x126acf3b45e0000]
[junit] 2017-02-12 01:40:44,113 [myid:] - INFO [main:ClientBase@513] - STOPPING server
[junit] 2017-02-12 01:40:44,114 [myid:] - INFO [NIOWorkerThread-11:NIOServerCnxn@614] - Closed socket connection for client /127.0.0.1:45495 which had sessionid 0x126acf3b45e0000
[junit] 2017-02-12 01:40:44,121 [myid:] - INFO [ConnnectionExpirer:NIOServerCnxnFactory$ConnectionExpirerThread@583] - ConnnectionExpirerThread interrupted
[junit] 2017-02-12 01:40:44,122 [myid:] - INFO [NIOServerCxnFactory.SelectorThread-1:NIOServerCnxnFactory$SelectorThread@420] - selector thread exitted run method
[junit] 2017-02-12 01:40:44,122 [myid:] - INFO [NIOServerCxnFactory.SelectorThread-0:NIOServerCnxnFactory$SelectorThread@420] - selector thread exitted run method
[junit] 2017-02-12 01:40:44,161 [myid:] - INFO [NIOServerCxnFactory.AcceptThread:0.0.0.0/0.0.0.0:11228:NIOServerCnxnFactory$AcceptThread@219] - accept thread exitted run method
[junit] 2017-02-12 01:40:44,161 [myid:] - INFO [main:ZooKeeperServer@533] - shutting down
[junit] 2017-02-12 01:40:44,161 [myid:] - ERROR [main:ZooKeeperServer@505] - ZKShutdownHandler is not registered, so ZooKeeper server won't take any action on ERROR or SHUTDOWN server state changes
[junit] 2017-02-12 01:40:44,161 [myid:] - INFO [main:SessionTrackerImpl@232] - Shutting down
[junit] 2017-02-12 01:40:44,162 [myid:] - INFO [main:PrepRequestProcessor@973] - Shutting down
[junit] 2017-02-12 01:40:44,162 [myid:] - INFO [main:SyncRequestProcessor@191] - Shutting down
[junit] 2017-02-12 01:40:44,162 [myid:] - INFO [ProcessThread(sid:0 cport:11228)::PrepRequestProcessor@154] - PrepRequestProcessor exited loop!
[junit] 2017-02-12 01:40:44,162 [myid:] - INFO [SyncThread:0:SyncRequestProcessor@169] - SyncRequestProcessor exited!
[junit] 2017-02-12 01:40:44,162 [myid:] - INFO [main:FinalRequestProcessor@479] - shutdown of request processor complete
[junit] 2017-02-12 01:40:44,163 [myid:] - INFO [main:MBeanRegistry@128] - Unregister MBean [org.apache.ZooKeeperService:name0=StandaloneServer_port11228,name1=InMemoryDataTree]
[junit] 2017-02-12 01:40:44,163 [myid:] - INFO [main:MBeanRegistry@128] - Unregister MBean [org.apache.ZooKeeperService:name0=StandaloneServer_port11228]
[junit] 2017-02-12 01:40:44,163 [myid:] - INFO [main:FourLetterWordMain@85] - connecting to 127.0.0.1 11228
[junit] 2017-02-12 01:40:44,164 [myid:] - INFO [main:JMXEnv@146] - ensureOnly:[]
[junit] 2017-02-12 01:40:44,173 [myid:] - INFO [main:ClientBase@568] - fdcount after test is: 62 at start it was 62
[junit] 2017-02-12 01:40:44,173 [myid:] - INFO [main:ZKTestCase$1@65] - SUCCEEDED testRemoveNodeChildrenChangedWatches
[junit] 2017-02-12 01:40:44,173 [myid:] - INFO [main:ZKTestCase$1@60] - FINISHED testRemoveNodeChildrenChangedWatches
[junit] Tests run: 7, Failures: 0, Errors: 0, Time elapsed: 23.078 sec
[junit] Running org.apache.zookeeper.RemoveWatchesTest
[junit] Tests run: 1, Failures: 0, Errors: 1, Time elapsed: 0 sec
BUILD FAILED
/zonestorage/hudson_solaris/home/hudson/hudson-slave/workspace/ZooKeeper_branch35_solaris/build.xml:1227: Process fork failed.
Total time: 3 minutes 50 seconds
Build step 'Invoke Ant' marked build as failure
[locks-and-latches] Releasing all the locks
[locks-and-latches] All the locks released
Recording test results
Email was triggered for: Failure - Any
Sending email for trigger: Failure - Any
###################################################################################
############################## FAILED TESTS (if any) ##############################
1 tests failed.
FAILED: org.apache.zookeeper.RemoveWatchesTest.unknown
Error Message:
Forked Java VM exited abnormally. Please note the time in the report does not reflect the time until the VM exit.
Stack Trace:
junit.framework.AssertionFailedError: Forked Java VM exited abnormally. Please note the time in the report does not reflect the time until the VM exit.
ZooKeeper_branch35_solaris - Build # 432 - Still Failing
Posted by Apache Jenkins Server <je...@builds.apache.org>.
See https://builds.apache.org/job/ZooKeeper_branch35_solaris/432/
###################################################################################
########################## LAST 60 LINES OF THE CONSOLE ###########################
[...truncated 119411 lines...]
[junit] 2017-02-11 16:42:02,303 [myid:] - INFO [main:WatchLeakTest$FakeSK@237] - Channel is ready for reading and writing
[junit] 2017-02-11 16:42:03,421 [myid:] - INFO [main:WatchLeakTest@158] - Watches processed
[junit] 2017-02-11 16:42:03,421 [myid:] - INFO [main:WatchLeakTest@167] - session is valid, watches = 1
[junit] 2017-02-11 16:42:03,422 [myid:] - INFO [main:LearnerZooKeeperServer@165] - Shutting down
[junit] 2017-02-11 16:42:03,422 [myid:] - INFO [main:ZooKeeperServer@533] - shutting down
[junit] 2017-02-11 16:42:03,422 [myid:] - INFO [main:FollowerRequestProcessor@138] - Shutting down
[junit] 2017-02-11 16:42:03,422 [myid:] - INFO [main:CommitProcessor@358] - Shutting down
[junit] 2017-02-11 16:42:03,422 [myid:] - INFO [FollowerRequestProcessor:0:FollowerRequestProcessor@109] - FollowerRequestProcessor exited loop!
[junit] 2017-02-11 16:42:03,422 [myid:] - INFO [CommitProcessor:0:CommitProcessor@193] - CommitProcessor exited loop!
[junit] 2017-02-11 16:42:03,472 [myid:] - INFO [main:FinalRequestProcessor@479] - shutdown of request processor complete
[junit] 2017-02-11 16:42:03,472 [myid:] - INFO [main:MBeanRegistry@128] - Unregister MBean [org.apache.ZooKeeperService:name0=InMemoryDataTree]
[junit] 2017-02-11 16:42:03,473 [myid:] - INFO [main:SyncRequestProcessor@191] - Shutting down
[junit] 2017-02-11 16:42:03,473 [myid:] - INFO [SyncThread:0:SyncRequestProcessor@169] - SyncRequestProcessor exited!
[junit] 2017-02-11 16:42:03,473 [myid:] - INFO [main:JUnit4ZKTestRunner$LoggedInvokeMethod@82] - Memory used 13666
[junit] 2017-02-11 16:42:03,473 [myid:] - INFO [main:JUnit4ZKTestRunner$LoggedInvokeMethod@87] - Number of threads 4
[junit] 2017-02-11 16:42:03,473 [myid:] - INFO [main:JUnit4ZKTestRunner$LoggedInvokeMethod@102] - FINISHED TEST METHOD testWatchesLeak
[junit] 2017-02-11 16:42:04,517 [myid:] - INFO [main:JUnit4ZKTestRunner$LoggedInvokeMethod@77] - RUNNING TEST METHOD testWatchesLeak
[junit] 2017-02-11 16:42:04,522 [myid:] - INFO [main:ZooKeeperServer@893] - minSessionTimeout set to 0
[junit] 2017-02-11 16:42:04,522 [myid:] - INFO [main:ZooKeeperServer@902] - maxSessionTimeout set to 0
[junit] 2017-02-11 16:42:04,524 [myid:] - INFO [main:ZooKeeperServer@159] - Created server with tickTime 0 minSessionTimeout 0 maxSessionTimeout 0 datadir snapdir
[junit] 2017-02-11 16:42:04,525 [myid:] - INFO [main:CommitProcessor@254] - Configuring CommitProcessor with 8 worker threads.
[junit] 2017-02-11 16:42:04,526 [myid:] - INFO [main:WatchLeakTest@139] - Follower created
[junit] 2017-02-11 16:42:04,529 [myid:] - INFO [main:WatchLeakTest$FakeSK@237] - Channel is ready for reading and writing
[junit] 2017-02-11 16:42:04,531 [myid:] - INFO [main:ZooKeeperServer@1004] - Client attempting to renew session 0xbabe at null
[junit] 2017-02-11 16:42:04,532 [myid:] - INFO [main:Learner@110] - Revalidating client: 0xbabe
[junit] 2017-02-11 16:42:04,533 [myid:] - INFO [main:WatchLeakTest@148] - Client connection sent
[junit] 2017-02-11 16:42:04,534 [myid:] - INFO [main:ZooKeeperServer@721] - Invalid session 0xbabe for client null, probably expired
[junit] 2017-02-11 16:42:04,535 [myid:] - INFO [main:WatchLeakTest@152] - Session validation sent
[junit] 2017-02-11 16:42:04,535 [myid:] - INFO [main:WatchLeakTest$FakeSK@241] - Channel is ready for writing only
[junit] 2017-02-11 16:42:04,536 [myid:] - INFO [main:WatchLeakTest$FakeSK@241] - Channel is ready for writing only
[junit] 2017-02-11 16:42:05,541 [myid:] - INFO [main:WatchLeakTest@158] - Watches processed
[junit] 2017-02-11 16:42:05,541 [myid:] - INFO [main:WatchLeakTest@163] - session is not valid, watches = 0
[junit] 2017-02-11 16:42:05,541 [myid:] - INFO [main:LearnerZooKeeperServer@165] - Shutting down
[junit] 2017-02-11 16:42:05,541 [myid:] - INFO [main:ZooKeeperServer@533] - shutting down
[junit] 2017-02-11 16:42:05,541 [myid:] - INFO [main:FollowerRequestProcessor@138] - Shutting down
[junit] 2017-02-11 16:42:05,542 [myid:] - INFO [main:CommitProcessor@358] - Shutting down
[junit] 2017-02-11 16:42:05,542 [myid:] - INFO [FollowerRequestProcessor:0:FollowerRequestProcessor@109] - FollowerRequestProcessor exited loop!
[junit] 2017-02-11 16:42:05,542 [myid:] - INFO [main:FinalRequestProcessor@479] - shutdown of request processor complete
[junit] 2017-02-11 16:42:05,542 [myid:] - INFO [CommitProcessor:0:CommitProcessor@193] - CommitProcessor exited loop!
[junit] 2017-02-11 16:42:05,543 [myid:] - INFO [main:MBeanRegistry@128] - Unregister MBean [org.apache.ZooKeeperService:name0=InMemoryDataTree]
[junit] 2017-02-11 16:42:05,543 [myid:] - INFO [main:SyncRequestProcessor@191] - Shutting down
[junit] 2017-02-11 16:42:05,543 [myid:] - INFO [SyncThread:0:SyncRequestProcessor@169] - SyncRequestProcessor exited!
[junit] 2017-02-11 16:42:05,543 [myid:] - INFO [main:JUnit4ZKTestRunner$LoggedInvokeMethod@82] - Memory used 14508
[junit] 2017-02-11 16:42:05,543 [myid:] - INFO [main:JUnit4ZKTestRunner$LoggedInvokeMethod@87] - Number of threads 4
[junit] 2017-02-11 16:42:05,543 [myid:] - INFO [main:JUnit4ZKTestRunner$LoggedInvokeMethod@102] - FINISHED TEST METHOD testWatchesLeak
[junit] Tests run: 2, Failures: 0, Errors: 0, Time elapsed: 30.215 sec
[junit] Running org.apache.zookeeper.server.quorum.Zab1_0Test
[junit] Tests run: 1, Failures: 0, Errors: 1, Time elapsed: 0 sec
BUILD FAILED
/zonestorage/hudson_solaris/home/hudson/hudson-slave/workspace/ZooKeeper_branch35_solaris/build.xml:1227: Process fork failed.
Total time: 32 minutes 36 seconds
Build step 'Invoke Ant' marked build as failure
[locks-and-latches] Releasing all the locks
[locks-and-latches] All the locks released
Recording test results
Email was triggered for: Failure - Any
Sending email for trigger: Failure - Any
###################################################################################
############################## FAILED TESTS (if any) ##############################
5 tests failed.
FAILED: org.apache.zookeeper.server.quorum.RaceConditionTest.testRaceConditionBetweenLeaderAndAckRequestProcessor
Error Message:
test timed out after 30000 milliseconds
Stack Trace:
at java.lang.Thread.sleep(Native Method)
at org.apache.zookeeper.test.ClientBase.waitForServerUp(ClientBase.java:257)
at org.apache.zookeeper.test.ClientBase.waitForServerUp(ClientBase.java:232)
at org.apache.zookeeper.server.quorum.RaceConditionTest.startQuorum(RaceConditionTest.java:121)
at org.apache.zookeeper.server.quorum.RaceConditionTest.testRaceConditionBetweenLeaderAndAckRequestProcessor(RaceConditionTest.java:67)
at org.apache.zookeeper.JUnit4ZKTestRunner$LoggedInvokeMethod.evaluate(JUnit4ZKTestRunner.java:79)
at java.util.concurrent.FutureTask.run(FutureTask.java:262)
at java.lang.Thread.run(Thread.java:745)
FAILED: org.apache.zookeeper.server.quorum.ReconfigBackupTest.testReconfigCreateNewVersionFile
Error Message:
waiting for server 0 being up
Stack Trace:
junit.framework.AssertionFailedError: waiting for server 0 being up
at org.apache.zookeeper.server.quorum.ReconfigBackupTest.testReconfigCreateNewVersionFile(ReconfigBackupTest.java:169)
at org.apache.zookeeper.JUnit4ZKTestRunner$LoggedInvokeMethod.evaluate(JUnit4ZKTestRunner.java:79)
FAILED: org.apache.zookeeper.server.quorum.ReconfigDuringLeaderSyncTest.testDuringLeaderSync
Error Message:
null
Stack Trace:
java.lang.NullPointerException
at org.apache.zookeeper.server.quorum.ReconfigDuringLeaderSyncTest.tearDown(ReconfigDuringLeaderSyncTest.java:199)
FAILED: org.apache.zookeeper.server.quorum.ReconfigRecoveryTest.testNextConfigAlreadyActive
Error Message:
waiting for server 2 being up
Stack Trace:
junit.framework.AssertionFailedError: waiting for server 2 being up
at org.apache.zookeeper.server.quorum.ReconfigRecoveryTest.testNextConfigAlreadyActive(ReconfigRecoveryTest.java:333)
at org.apache.zookeeper.JUnit4ZKTestRunner$LoggedInvokeMethod.evaluate(JUnit4ZKTestRunner.java:79)
FAILED: org.apache.zookeeper.server.quorum.Zab1_0Test.unknown
Error Message:
Forked Java VM exited abnormally. Please note the time in the report does not reflect the time until the VM exit.
Stack Trace:
junit.framework.AssertionFailedError: Forked Java VM exited abnormally. Please note the time in the report does not reflect the time until the VM exit.
ZooKeeper_branch35_solaris - Build # 431 - Still Failing
Posted by Apache Jenkins Server <je...@builds.apache.org>.
See https://builds.apache.org/job/ZooKeeper_branch35_solaris/431/
###################################################################################
########################## LAST 60 LINES OF THE CONSOLE ###########################
[...truncated 209563 lines...]
[junit] at org.apache.zookeeper.server.quorum.Leader.lead(Leader.java:563)
[junit] at org.apache.zookeeper.server.quorum.QuorumPeer.run(QuorumPeer.java:1146)
[junit] 2017-02-10 20:35:56,830 [myid:] - INFO [main:QuorumBase@403] - Waiting for QuorumPeer[myid=5](plain=/127.0.0.1:11253)(secure=disabled) to exit thread
[junit] 2017-02-10 20:35:56,830 [myid:] - INFO [QuorumPeer[myid=5](plain=/127.0.0.1:11253)(secure=disabled):Leader@625] - Shutting down
[junit] 2017-02-10 20:35:56,831 [myid:] - WARN [QuorumPeer[myid=5](plain=/127.0.0.1:11253)(secure=disabled):QuorumPeer@1180] - PeerState set to LOOKING
[junit] 2017-02-10 20:35:56,831 [myid:] - WARN [QuorumPeer[myid=5](plain=/127.0.0.1:11253)(secure=disabled):QuorumPeer@1162] - QuorumPeer main thread exited
[junit] 2017-02-10 20:35:56,831 [myid:] - INFO [QuorumPeer[myid=5](plain=/127.0.0.1:11253)(secure=disabled):MBeanRegistry@128] - Unregister MBean [org.apache.ZooKeeperService:name0=ReplicatedServer_id5]
[junit] 2017-02-10 20:35:56,831 [myid:] - INFO [QuorumPeer[myid=5](plain=/127.0.0.1:11253)(secure=disabled):MBeanRegistry@128] - Unregister MBean [org.apache.ZooKeeperService:name0=ReplicatedServer_id5,name1=replica.5]
[junit] 2017-02-10 20:35:56,831 [myid:] - INFO [QuorumPeer[myid=5](plain=/127.0.0.1:11253)(secure=disabled):MBeanRegistry@128] - Unregister MBean [org.apache.ZooKeeperService:name0=ReplicatedServer_id5,name1=replica.1]
[junit] 2017-02-10 20:35:56,831 [myid:] - INFO [QuorumPeer[myid=5](plain=/127.0.0.1:11253)(secure=disabled):MBeanRegistry@128] - Unregister MBean [org.apache.ZooKeeperService:name0=ReplicatedServer_id5,name1=replica.2]
[junit] 2017-02-10 20:35:56,831 [myid:] - INFO [QuorumPeer[myid=5](plain=/127.0.0.1:11253)(secure=disabled):MBeanRegistry@128] - Unregister MBean [org.apache.ZooKeeperService:name0=ReplicatedServer_id5,name1=replica.3]
[junit] 2017-02-10 20:35:56,831 [myid:] - INFO [QuorumPeer[myid=5](plain=/127.0.0.1:11253)(secure=disabled):MBeanRegistry@128] - Unregister MBean [org.apache.ZooKeeperService:name0=ReplicatedServer_id5,name1=replica.4]
[junit] 2017-02-10 20:35:56,831 [myid:] - INFO [main:JUnit4ZKTestRunner$LoggedInvokeMethod@82] - Memory used 19810
[junit] 2017-02-10 20:35:56,832 [myid:] - INFO [main:JUnit4ZKTestRunner$LoggedInvokeMethod@87] - Number of threads 20
[junit] 2017-02-10 20:35:56,832 [myid:] - INFO [main:JUnit4ZKTestRunner$LoggedInvokeMethod@102] - FINISHED TEST METHOD testLocalSessionsOnFollower
[junit] 2017-02-10 20:35:56,832 [myid:] - INFO [main:LocalSessionRequestTest@59] - STOPPING quorum org.apache.zookeeper.test.LocalSessionRequestTest
[junit] 2017-02-10 20:35:56,832 [myid:] - INFO [main:QuorumBase@362] - TearDown started
[junit] 2017-02-10 20:35:56,832 [myid:] - INFO [main:QuorumBase@366] - fdcount after test is: 60
[junit] 2017-02-10 20:35:56,832 [myid:] - INFO [main:QuorumBase@394] - Shutting down quorum peer QuorumPeer[myid=1](plain=/127.0.0.1:11249)(secure=disabled)
[junit] 2017-02-10 20:35:56,832 [myid:] - INFO [main:QuorumBase@398] - Shutting down leader election QuorumPeer[myid=1](plain=/127.0.0.1:11249)(secure=disabled)
[junit] 2017-02-10 20:35:56,832 [myid:] - INFO [main:QuorumBase@403] - Waiting for QuorumPeer[myid=1](plain=/127.0.0.1:11249)(secure=disabled) to exit thread
[junit] 2017-02-10 20:35:56,832 [myid:] - INFO [main:QuorumBase@394] - Shutting down quorum peer QuorumPeer[myid=2](plain=/127.0.0.1:11250)(secure=disabled)
[junit] 2017-02-10 20:35:56,833 [myid:] - INFO [main:QuorumBase@398] - Shutting down leader election QuorumPeer[myid=2](plain=/127.0.0.1:11250)(secure=disabled)
[junit] 2017-02-10 20:35:56,833 [myid:] - INFO [main:QuorumBase@403] - Waiting for QuorumPeer[myid=2](plain=/127.0.0.1:11250)(secure=disabled) to exit thread
[junit] 2017-02-10 20:35:56,833 [myid:] - INFO [main:QuorumBase@394] - Shutting down quorum peer QuorumPeer[myid=3](plain=/127.0.0.1:11251)(secure=disabled)
[junit] 2017-02-10 20:35:56,833 [myid:] - INFO [main:QuorumBase@398] - Shutting down leader election QuorumPeer[myid=3](plain=/127.0.0.1:11251)(secure=disabled)
[junit] 2017-02-10 20:35:56,833 [myid:] - INFO [main:QuorumBase@403] - Waiting for QuorumPeer[myid=3](plain=/127.0.0.1:11251)(secure=disabled) to exit thread
[junit] 2017-02-10 20:35:56,833 [myid:] - INFO [main:QuorumBase@394] - Shutting down quorum peer QuorumPeer[myid=4](plain=/127.0.0.1:11252)(secure=disabled)
[junit] 2017-02-10 20:35:56,833 [myid:] - INFO [main:QuorumBase@398] - Shutting down leader election QuorumPeer[myid=4](plain=/127.0.0.1:11252)(secure=disabled)
[junit] 2017-02-10 20:35:56,833 [myid:] - INFO [main:QuorumBase@403] - Waiting for QuorumPeer[myid=4](plain=/127.0.0.1:11252)(secure=disabled) to exit thread
[junit] 2017-02-10 20:35:56,833 [myid:] - INFO [main:QuorumBase@394] - Shutting down quorum peer QuorumPeer[myid=5](plain=/127.0.0.1:11253)(secure=disabled)
[junit] 2017-02-10 20:35:56,834 [myid:] - INFO [main:QuorumBase@398] - Shutting down leader election QuorumPeer[myid=5](plain=/127.0.0.1:11253)(secure=disabled)
[junit] 2017-02-10 20:35:56,834 [myid:] - INFO [main:QuorumBase@403] - Waiting for QuorumPeer[myid=5](plain=/127.0.0.1:11253)(secure=disabled) to exit thread
[junit] 2017-02-10 20:35:56,834 [myid:] - INFO [main:FourLetterWordMain@85] - connecting to 127.0.0.1 11249
[junit] 2017-02-10 20:35:56,834 [myid:] - INFO [main:QuorumBase@376] - 127.0.0.1:11249 is no longer accepting client connections
[junit] 2017-02-10 20:35:56,834 [myid:] - INFO [main:FourLetterWordMain@85] - connecting to 127.0.0.1 11250
[junit] 2017-02-10 20:35:56,834 [myid:] - INFO [main:QuorumBase@376] - 127.0.0.1:11250 is no longer accepting client connections
[junit] 2017-02-10 20:35:56,835 [myid:] - INFO [main:FourLetterWordMain@85] - connecting to 127.0.0.1 11251
[junit] 2017-02-10 20:35:56,835 [myid:] - INFO [main:QuorumBase@376] - 127.0.0.1:11251 is no longer accepting client connections
[junit] 2017-02-10 20:35:56,891 [myid:] - INFO [main:FourLetterWordMain@85] - connecting to 127.0.0.1 11252
[junit] 2017-02-10 20:35:56,891 [myid:] - INFO [main:QuorumBase@376] - 127.0.0.1:11252 is no longer accepting client connections
[junit] 2017-02-10 20:35:56,891 [myid:] - INFO [main:FourLetterWordMain@85] - connecting to 127.0.0.1 11253
[junit] 2017-02-10 20:35:56,891 [myid:] - INFO [main:QuorumBase@376] - 127.0.0.1:11253 is no longer accepting client connections
[junit] 2017-02-10 20:35:56,892 [myid:] - INFO [main:ZKTestCase$1@65] - SUCCEEDED testLocalSessionsOnFollower
[junit] 2017-02-10 20:35:56,893 [myid:] - INFO [main:ZKTestCase$1@60] - FINISHED testLocalSessionsOnFollower
[junit] Tests run: 2, Failures: 0, Errors: 0, Time elapsed: 70.651 sec
[junit] Running org.apache.zookeeper.test.LocalSessionsOnlyTest
[junit] Tests run: 1, Failures: 0, Errors: 1, Time elapsed: 0 sec
BUILD FAILED
/zonestorage/hudson_solaris/home/hudson/hudson-slave/workspace/ZooKeeper_branch35_solaris/build.xml:1227: Process fork failed.
Total time: 66 minutes 22 seconds
Build step 'Invoke Ant' marked build as failure
[locks-and-latches] Releasing all the locks
[locks-and-latches] All the locks released
Recording test results
Email was triggered for: Failure - Any
Sending email for trigger: Failure - Any
###################################################################################
############################## FAILED TESTS (if any) ##############################
8 tests failed.
FAILED: org.apache.zookeeper.server.quorum.StandaloneDisabledTest.startSingleServerTest
Error Message:
Timeout occurred. Please note the time in the report does not reflect the time until the timeout.
Stack Trace:
junit.framework.AssertionFailedError: Timeout occurred. Please note the time in the report does not reflect the time until the timeout.
FAILED: org.apache.zookeeper.test.FLENewEpochTest.testLENewEpoch
Error Message:
First leader election failed
Stack Trace:
junit.framework.AssertionFailedError: First leader election failed
at org.apache.zookeeper.test.FLENewEpochTest.testLENewEpoch(FLENewEpochTest.java:175)
at org.apache.zookeeper.JUnit4ZKTestRunner$LoggedInvokeMethod.evaluate(JUnit4ZKTestRunner.java:79)
FAILED: org.apache.zookeeper.test.FourLetterWordsTest.testFourLetterWords
Error Message:
test timed out after 30000 milliseconds
Stack Trace:
at java.net.SocketInputStream.socketRead0(Native Method)
at java.net.SocketInputStream.read(SocketInputStream.java:152)
at java.net.SocketInputStream.read(SocketInputStream.java:122)
at sun.nio.cs.StreamDecoder.readBytes(StreamDecoder.java:283)
at sun.nio.cs.StreamDecoder.implRead(StreamDecoder.java:325)
at sun.nio.cs.StreamDecoder.read(StreamDecoder.java:177)
at java.io.InputStreamReader.read(InputStreamReader.java:184)
at java.io.BufferedReader.fill(BufferedReader.java:154)
at java.io.BufferedReader.readLine(BufferedReader.java:317)
at java.io.BufferedReader.readLine(BufferedReader.java:382)
at org.apache.zookeeper.client.FourLetterWordMain.send4LetterWord(FourLetterWordMain.java:119)
at org.apache.zookeeper.client.FourLetterWordMain.send4LetterWord(FourLetterWordMain.java:69)
at org.apache.zookeeper.test.ClientBase.waitForServerUp(ClientBase.java:241)
at org.apache.zookeeper.test.ClientBase.startServerInstance(ClientBase.java:364)
at org.apache.zookeeper.test.ClientBase.startServer(ClientBase.java:469)
at org.apache.zookeeper.test.ClientBase.setUp(ClientBase.java:460)
at java.util.concurrent.FutureTask.run(FutureTask.java:262)
at java.lang.Thread.run(Thread.java:745)
FAILED: org.apache.zookeeper.test.FourLetterWordsTest.testSetTraceMask
Error Message:
Unexpected bean exists! expected:<0> but was:<2>
Stack Trace:
junit.framework.AssertionFailedError: Unexpected bean exists! expected:<0> but was:<2>
at org.apache.zookeeper.test.ClientBase.verifyUnexpectedBeans(ClientBase.java:498)
at org.apache.zookeeper.test.ClientBase.startServer(ClientBase.java:477)
at org.apache.zookeeper.test.ClientBase.setUp(ClientBase.java:460)
at java.util.concurrent.FutureTask.run(FutureTask.java:262)
at java.lang.Thread.run(Thread.java:745)
FAILED: org.apache.zookeeper.test.FourLetterWordsTest.testValidateConsOutput
Error Message:
Unexpected bean exists! expected:<0> but was:<2>
Stack Trace:
junit.framework.AssertionFailedError: Unexpected bean exists! expected:<0> but was:<2>
at org.apache.zookeeper.test.ClientBase.verifyUnexpectedBeans(ClientBase.java:498)
at org.apache.zookeeper.test.ClientBase.startServer(ClientBase.java:477)
at org.apache.zookeeper.test.ClientBase.setUp(ClientBase.java:460)
at java.util.concurrent.FutureTask.run(FutureTask.java:262)
at java.lang.Thread.run(Thread.java:745)
FAILED: org.apache.zookeeper.test.FourLetterWordsTest.testValidateSocketTimeout
Error Message:
Unexpected bean exists! expected:<0> but was:<2>
Stack Trace:
junit.framework.AssertionFailedError: Unexpected bean exists! expected:<0> but was:<2>
at org.apache.zookeeper.test.ClientBase.verifyUnexpectedBeans(ClientBase.java:498)
at org.apache.zookeeper.test.ClientBase.startServer(ClientBase.java:477)
at org.apache.zookeeper.test.ClientBase.setUp(ClientBase.java:460)
at java.util.concurrent.FutureTask.run(FutureTask.java:262)
at java.lang.Thread.run(Thread.java:745)
FAILED: org.apache.zookeeper.test.FourLetterWordsTest.testValidateStatOutput
Error Message:
Unexpected bean exists! expected:<0> but was:<2>
Stack Trace:
junit.framework.AssertionFailedError: Unexpected bean exists! expected:<0> but was:<2>
at org.apache.zookeeper.test.ClientBase.verifyUnexpectedBeans(ClientBase.java:498)
at org.apache.zookeeper.test.ClientBase.startServer(ClientBase.java:477)
at org.apache.zookeeper.test.ClientBase.setUp(ClientBase.java:460)
at java.util.concurrent.FutureTask.run(FutureTask.java:262)
at java.lang.Thread.run(Thread.java:745)
FAILED: org.apache.zookeeper.test.LocalSessionsOnlyTest.unknown
Error Message:
Forked Java VM exited abnormally. Please note the time in the report does not reflect the time until the VM exit.
Stack Trace:
junit.framework.AssertionFailedError: Forked Java VM exited abnormally. Please note the time in the report does not reflect the time until the VM exit.