You are viewing a plain text version of this content. The canonical link for it is here.
Posted to issues@tez.apache.org by Apache Jenkins Server <je...@builds.apache.org> on 2016/05/10 23:48:36 UTC
Failed: TEZ-3250 PreCommit Build #1712
Jira: https://issues.apache.org/jira/browse/TEZ-3250
Build: https://builds.apache.org/job/PreCommit-TEZ-Build/1712/
###################################################################################
########################## LAST 60 LINES OF THE CONSOLE ###########################
[...truncated 4087 lines...]
[INFO] Total time: 57:25 min
[INFO] Finished at: 2016-05-10T23:48:36+00:00
[INFO] Final Memory: 81M/1276M
[INFO] ------------------------------------------------------------------------
{color:red}-1 overall{color}. Here are the results of testing the latest attachment
http://issues.apache.org/jira/secure/attachment/12803309/TEZ-3250.1.patch
against master revision 50ea2de.
{color:green}+1 @author{color}. The patch does not contain any @author tags.
{color:red}-1 tests included{color}. The patch doesn't appear to include any new or modified tests.
Please justify why no new tests are needed for this patch.
Also please list what manual steps were performed to verify this patch.
{color:green}+1 javac{color}. The applied patch does not increase the total number of javac compiler warnings.
{color:green}+1 javadoc{color}. There were no new javadoc warning messages.
{color:green}+1 findbugs{color}. The patch does not introduce any new Findbugs (version 3.0.1) warnings.
{color:green}+1 release audit{color}. The applied patch does not increase the total number of release audit warnings.
{color:green}+1 core tests{color}. The patch passed unit tests in .
Test results: https://builds.apache.org/job/PreCommit-TEZ-Build/1712//testReport/
Console output: https://builds.apache.org/job/PreCommit-TEZ-Build/1712//console
This message is automatically generated.
======================================================================
======================================================================
Adding comment to Jira.
======================================================================
======================================================================
Comment added.
5ca23632479a6c47df0fe4541b5013e41cf33b54 logged out
======================================================================
======================================================================
Finished build.
======================================================================
======================================================================
Build step 'Execute shell' marked build as failure
Archiving artifacts
Compressed 3.19 MB of artifacts by 29.4% relative to #1711
[description-setter] Could not determine description.
Recording test results
Email was triggered for: Failure - Any
Sending email for trigger: Failure - Any
###################################################################################
############################## FAILED TESTS (if any) ##############################
All tests passed
Success: TEZ-3254 PreCommit Build #1714
Posted by Apache Jenkins Server <je...@builds.apache.org>.
Jira: https://issues.apache.org/jira/browse/TEZ-3254
Build: https://builds.apache.org/job/PreCommit-TEZ-Build/1714/
###################################################################################
########################## LAST 60 LINES OF THE CONSOLE ###########################
[...truncated 4099 lines...]
[INFO] Tez ............................................... SUCCESS [ 0.026 s]
[INFO] ------------------------------------------------------------------------
[INFO] BUILD SUCCESS
[INFO] ------------------------------------------------------------------------
[INFO] Total time: 53:36 min
[INFO] Finished at: 2016-05-11T14:41:07+00:00
[INFO] Final Memory: 76M/793M
[INFO] ------------------------------------------------------------------------
{color:green}+1 overall{color}. Here are the results of testing the latest attachment
http://issues.apache.org/jira/secure/attachment/12803422/TEZ-3254.1.patch
against master revision 5d509d8.
{color:green}+1 @author{color}. The patch does not contain any @author tags.
{color:green}+1 tests included{color}. The patch appears to include 5 new or modified test files.
{color:green}+1 javac{color}. The applied patch does not increase the total number of javac compiler warnings.
{color:green}+1 javadoc{color}. There were no new javadoc warning messages.
{color:green}+1 findbugs{color}. The patch does not introduce any new Findbugs (version 3.0.1) warnings.
{color:green}+1 release audit{color}. The applied patch does not increase the total number of release audit warnings.
{color:green}+1 core tests{color}. The patch passed unit tests in .
Test results: https://builds.apache.org/job/PreCommit-TEZ-Build/1714//testReport/
Console output: https://builds.apache.org/job/PreCommit-TEZ-Build/1714//console
This message is automatically generated.
======================================================================
======================================================================
Adding comment to Jira.
======================================================================
======================================================================
Comment added.
aa00317da6b4252594c5d7ad5590fe995035318e logged out
======================================================================
======================================================================
Finished build.
======================================================================
======================================================================
Archiving artifacts
[description-setter] Description set: TEZ-3254
Recording test results
Email was triggered for: Success
Sending email for trigger: Success
###################################################################################
############################## FAILED TESTS (if any) ##############################
All tests passed
Failed: TEZ-3251 PreCommit Build #1713
Posted by Apache Jenkins Server <je...@builds.apache.org>.
Jira: https://issues.apache.org/jira/browse/TEZ-3251
Build: https://builds.apache.org/job/PreCommit-TEZ-Build/1713/
###################################################################################
########################## LAST 60 LINES OF THE CONSOLE ###########################
[...truncated 4090 lines...]
[INFO] Total time: 54:17 min
[INFO] Finished at: 2016-05-11T06:40:13+00:00
[INFO] Final Memory: 87M/1141M
[INFO] ------------------------------------------------------------------------
{color:red}-1 overall{color}. Here are the results of testing the latest attachment
http://issues.apache.org/jira/secure/attachment/12803358/TEZ-3151.1.patch
against master revision 69b8e06.
{color:green}+1 @author{color}. The patch does not contain any @author tags.
{color:red}-1 tests included{color}. The patch doesn't appear to include any new or modified tests.
Please justify why no new tests are needed for this patch.
Also please list what manual steps were performed to verify this patch.
{color:green}+1 javac{color}. The applied patch does not increase the total number of javac compiler warnings.
{color:green}+1 javadoc{color}. There were no new javadoc warning messages.
{color:green}+1 findbugs{color}. The patch does not introduce any new Findbugs (version 3.0.1) warnings.
{color:green}+1 release audit{color}. The applied patch does not increase the total number of release audit warnings.
{color:green}+1 core tests{color}. The patch passed unit tests in .
Test results: https://builds.apache.org/job/PreCommit-TEZ-Build/1713//testReport/
Console output: https://builds.apache.org/job/PreCommit-TEZ-Build/1713//console
This message is automatically generated.
======================================================================
======================================================================
Adding comment to Jira.
======================================================================
======================================================================
Comment added.
c654e292f02fd3dba0cbb7f9680d7596128d4559 logged out
======================================================================
======================================================================
Finished build.
======================================================================
======================================================================
Build step 'Execute shell' marked build as failure
Archiving artifacts
Compressed 3.20 MB of artifacts by 29.3% relative to #1711
[description-setter] Could not determine description.
Recording test results
Email was triggered for: Failure - Any
Sending email for trigger: Failure - Any
###################################################################################
############################## FAILED TESTS (if any) ##############################
All tests passed