You are viewing a plain text version of this content. The canonical link for it is here.
Posted to dev@poi.apache.org by Apache Jenkins Server <je...@builds.apache.org> on 2025/01/12 05:52:17 UTC
Build failed in Jenkins: POI » POI-DSL-1.24 #9
See <https://ci-builds.apache.org/job/POI/job/POI-DSL-1.24/9/display/redirect?page=changes>
Changes:
[Axel Howind] remove unused import
[Axel Howind] Support long month names, dot after day, single digit day of month
[PJ Fanning] reimplement SXSSFSheet arbitrary extra width support (5.4.0 code does not work)
[Dominik Stadler] Ensure that test which changes static value does not run at the same time as other tests
Otherwise we get strange test-failures in other places.
[Dominik Stadler] Adjust one more JavaDoc link for JDK 23+
[Dominik Stadler] Add initial changelog for 5.4.1, list some changes, add note about JDK 24
[Dominik Stadler] Bug 58805: Adjust reproducer test-case some more
Do not write a local temp-file
It seems even parsing the resulting document fails
[Dominik Stadler] Try to make javadoc building work on JDK 23 and newer
[Dominik Stadler] Bug 66425: Avoid exceptions found via poi-fuzz
Prevent a NullPointerException
Fixes https://issues.oss-fuzz.com/issues/42537720
[Dominik Stadler] Bug 66425: Avoid exceptions found via poi-fuzz
Prevent a NullPointerException
Fixes https://issues.oss-fuzz.com/issues/42537550
[Dominik Stadler] Bug 66425: Avoid exceptions found via poi-fuzz
Prevent a NullPointerException
Fixes https://issues.oss-fuzz.com/issues/379574870
[Dominik Stadler] Bug 66425: Avoid exceptions found via poi-fuzz
Prevent a NullPointerException
Fixes https://issues.oss-fuzz.com/issues/42538163
[Dominik Stadler] Add a missing xsb which shows up as missing in oss-fuzz runs
Fixes https://issues.oss-fuzz.com/issues/384757273
[Dominik Stadler] Bug 65190: Handle decimal format '0#' the same way as Excel
[Dominik Stadler] Add test for bug 58805
[Dominik Stadler] Apply IDE suggestions, code-formating, tests, ...
Add test for DefaultTempFileCreationStrategy
Adjust comments, add test, improve error message
[Dominik Stadler] Bug 58571: Add test which shows a workaround
[Dominik Stadler] Bug 57603: Apply suggested patch
[Dominik Stadler] Bug 69315: HSMF: At least continue processing properties after multivalued properties
Currently processing stops at multivalued properties.
This at least continues processing, so other properties are processed properly.
[Dominik Stadler] Bug 69265: Add test which verifies that Hyperlink Type "Email" is not supported for HSSF
Also update JavaDoc slightly to describe
the special handling of HyperlinkType.EMAIL
[Dominik Stadler] Ant: Update XMLBeans to 5.3.0
[Dominik Stadler] Set version to 5.4.1-SNAPSHOT
[PJ Fanning] poi release
[PJ Fanning] poi release
[PJ Fanning] [bug-69529] relax exception check
[PJ Fanning] [bug-69529] try to workaround cells with numeric type whose format cannot be applied
[PJ Fanning] [bug-69529] try to workaround cells with numeric type whose format cannot be applied
[PJ Fanning] commons-codec 1.17.2
[PJ Fanning] commons-codec 1.17.2
------------------------------------------
[...truncated 9.39 MiB...]
[spotbugs] At edu.umd.cs.findbugs.FindBugs2.execute(FindBugs2.java:252)
[spotbugs] At edu.umd.cs.findbugs.FindBugs.runMain(FindBugs.java:395)
[spotbugs] At edu.umd.cs.findbugs.FindBugs2.main(FindBugs2.java:1231)
[spotbugs] Couldn't get class info for java/util/regex/MatchResult
[spotbugs] java.lang.IllegalArgumentException: Unsupported class file major version 68
[spotbugs] At org.objectweb.asm.ClassReader.<init>(ClassReader.java:200)
[spotbugs] At org.objectweb.asm.ClassReader.<init>(ClassReader.java:180)
[spotbugs] At org.objectweb.asm.ClassReader.<init>(ClassReader.java:166)
[spotbugs] At edu.umd.cs.findbugs.asm.FBClassReader.<init>(FBClassReader.java:35)
[spotbugs] At edu.umd.cs.findbugs.classfile.engine.asm.ClassReaderAnalysisEngine.analyze(ClassReaderAnalysisEngine.java:48)
[spotbugs] At edu.umd.cs.findbugs.classfile.engine.asm.ClassReaderAnalysisEngine.analyze(ClassReaderAnalysisEngine.java:34)
[spotbugs] At edu.umd.cs.findbugs.classfile.impl.AnalysisCache.getClassAnalysis(AnalysisCache.java:261)
[spotbugs] At edu.umd.cs.findbugs.classfile.engine.ClassInfoAnalysisEngine.analyze(ClassInfoAnalysisEngine.java:75)
[spotbugs] At edu.umd.cs.findbugs.classfile.engine.ClassInfoAnalysisEngine.analyze(ClassInfoAnalysisEngine.java:38)
[spotbugs] At edu.umd.cs.findbugs.classfile.impl.AnalysisCache.getClassAnalysis(AnalysisCache.java:261)
[spotbugs] At edu.umd.cs.findbugs.ba.XFactory.getXClass(XFactory.java:693)
[spotbugs] At edu.umd.cs.findbugs.ba.AnalysisContext.setAppClassList(AnalysisContext.java:975)
[spotbugs] At edu.umd.cs.findbugs.FindBugs2.setAppClassList(FindBugs2.java:909)
[spotbugs] At edu.umd.cs.findbugs.FindBugs2.execute(FindBugs2.java:252)
[spotbugs] At edu.umd.cs.findbugs.FindBugs.runMain(FindBugs.java:395)
[spotbugs] At edu.umd.cs.findbugs.FindBugs2.main(FindBugs2.java:1231)
[spotbugs] Couldn't get class info for javax/xml/crypto/dsig/spec/SignatureMethodParameterSpec
[spotbugs] java.lang.IllegalArgumentException: Unsupported class file major version 68
[spotbugs] At org.objectweb.asm.ClassReader.<init>(ClassReader.java:200)
[spotbugs] At org.objectweb.asm.ClassReader.<init>(ClassReader.java:180)
[spotbugs] At org.objectweb.asm.ClassReader.<init>(ClassReader.java:166)
[spotbugs] At edu.umd.cs.findbugs.asm.FBClassReader.<init>(FBClassReader.java:35)
[spotbugs] At edu.umd.cs.findbugs.classfile.engine.asm.ClassReaderAnalysisEngine.analyze(ClassReaderAnalysisEngine.java:48)
[spotbugs] At edu.umd.cs.findbugs.classfile.engine.asm.ClassReaderAnalysisEngine.analyze(ClassReaderAnalysisEngine.java:34)
[spotbugs] At edu.umd.cs.findbugs.classfile.impl.AnalysisCache.getClassAnalysis(AnalysisCache.java:261)
[spotbugs] At edu.umd.cs.findbugs.classfile.engine.ClassInfoAnalysisEngine.analyze(ClassInfoAnalysisEngine.java:75)
[spotbugs] At edu.umd.cs.findbugs.classfile.engine.ClassInfoAnalysisEngine.analyze(ClassInfoAnalysisEngine.java:38)
[spotbugs] At edu.umd.cs.findbugs.classfile.impl.AnalysisCache.getClassAnalysis(AnalysisCache.java:261)
[spotbugs] At edu.umd.cs.findbugs.ba.XFactory.getXClass(XFactory.java:693)
[spotbugs] At edu.umd.cs.findbugs.ba.AnalysisContext.setAppClassList(AnalysisContext.java:975)
[spotbugs] At edu.umd.cs.findbugs.FindBugs2.setAppClassList(FindBugs2.java:909)
[spotbugs] At edu.umd.cs.findbugs.FindBugs2.execute(FindBugs2.java:252)
[spotbugs] At edu.umd.cs.findbugs.FindBugs.runMain(FindBugs.java:395)
[spotbugs] At edu.umd.cs.findbugs.FindBugs2.main(FindBugs2.java:1231)
[spotbugs] Couldn't get class info for java/util/Random
[spotbugs] java.lang.IllegalArgumentException: Unsupported class file major version 68
[spotbugs] At org.objectweb.asm.ClassReader.<init>(ClassReader.java:200)
[spotbugs] At org.objectweb.asm.ClassReader.<init>(ClassReader.java:180)
[spotbugs] At org.objectweb.asm.ClassReader.<init>(ClassReader.java:166)
[spotbugs] At edu.umd.cs.findbugs.asm.FBClassReader.<init>(FBClassReader.java:35)
[spotbugs] At edu.umd.cs.findbugs.classfile.engine.asm.ClassReaderAnalysisEngine.analyze(ClassReaderAnalysisEngine.java:48)
[spotbugs] At edu.umd.cs.findbugs.classfile.engine.asm.ClassReaderAnalysisEngine.analyze(ClassReaderAnalysisEngine.java:34)
[spotbugs] At edu.umd.cs.findbugs.classfile.impl.AnalysisCache.getClassAnalysis(AnalysisCache.java:261)
[spotbugs] At edu.umd.cs.findbugs.classfile.engine.ClassInfoAnalysisEngine.analyze(ClassInfoAnalysisEngine.java:75)
[spotbugs] At edu.umd.cs.findbugs.classfile.engine.ClassInfoAnalysisEngine.analyze(ClassInfoAnalysisEngine.java:38)
[spotbugs] At edu.umd.cs.findbugs.classfile.impl.AnalysisCache.getClassAnalysis(AnalysisCache.java:261)
[spotbugs] At edu.umd.cs.findbugs.ba.XFactory.getXClass(XFactory.java:693)
[spotbugs] At edu.umd.cs.findbugs.ba.AnalysisContext.setAppClassList(AnalysisContext.java:975)
[spotbugs] At edu.umd.cs.findbugs.FindBugs2.setAppClassList(FindBugs2.java:909)
[spotbugs] At edu.umd.cs.findbugs.FindBugs2.execute(FindBugs2.java:252)
[spotbugs] At edu.umd.cs.findbugs.FindBugs.runMain(FindBugs.java:395)
[spotbugs] At edu.umd.cs.findbugs.FindBugs2.main(FindBugs2.java:1231)
[spotbugs] Couldn't get class info for java/nio/file/attribute/BasicFileAttributes
[spotbugs] java.lang.IllegalArgumentException: Unsupported class file major version 68
[spotbugs] At org.objectweb.asm.ClassReader.<init>(ClassReader.java:200)
[spotbugs] At org.objectweb.asm.ClassReader.<init>(ClassReader.java:180)
[spotbugs] At org.objectweb.asm.ClassReader.<init>(ClassReader.java:166)
[spotbugs] At edu.umd.cs.findbugs.asm.FBClassReader.<init>(FBClassReader.java:35)
[spotbugs] At edu.umd.cs.findbugs.classfile.engine.asm.ClassReaderAnalysisEngine.analyze(ClassReaderAnalysisEngine.java:48)
[spotbugs] At edu.umd.cs.findbugs.classfile.engine.asm.ClassReaderAnalysisEngine.analyze(ClassReaderAnalysisEngine.java:34)
[spotbugs] At edu.umd.cs.findbugs.classfile.impl.AnalysisCache.getClassAnalysis(AnalysisCache.java:261)
[spotbugs] At edu.umd.cs.findbugs.classfile.engine.ClassInfoAnalysisEngine.analyze(ClassInfoAnalysisEngine.java:75)
[spotbugs] At edu.umd.cs.findbugs.classfile.engine.ClassInfoAnalysisEngine.analyze(ClassInfoAnalysisEngine.java:38)
[spotbugs] At edu.umd.cs.findbugs.classfile.impl.AnalysisCache.getClassAnalysis(AnalysisCache.java:261)
[spotbugs] At edu.umd.cs.findbugs.ba.XFactory.getXClass(XFactory.java:693)
[spotbugs] At edu.umd.cs.findbugs.ba.AnalysisContext.setAppClassList(AnalysisContext.java:975)
[spotbugs] At edu.umd.cs.findbugs.FindBugs2.setAppClassList(FindBugs2.java:909)
[spotbugs] At edu.umd.cs.findbugs.FindBugs2.execute(FindBugs2.java:252)
[spotbugs] At edu.umd.cs.findbugs.FindBugs.runMain(FindBugs.java:395)
[spotbugs] At edu.umd.cs.findbugs.FindBugs2.main(FindBugs2.java:1231)
[spotbugs] Couldn't get class info for java/util/Locale
[spotbugs] java.lang.IllegalArgumentException: Unsupported class file major version 68
[spotbugs] At org.objectweb.asm.ClassReader.<init>(ClassReader.java:200)
[spotbugs] At org.objectweb.asm.ClassReader.<init>(ClassReader.java:180)
[spotbugs] At org.objectweb.asm.ClassReader.<init>(ClassReader.java:166)
[spotbugs] At edu.umd.cs.findbugs.asm.FBClassReader.<init>(FBClassReader.java:35)
[spotbugs] At edu.umd.cs.findbugs.classfile.engine.asm.ClassReaderAnalysisEngine.analyze(ClassReaderAnalysisEngine.java:48)
[spotbugs] At edu.umd.cs.findbugs.classfile.engine.asm.ClassReaderAnalysisEngine.analyze(ClassReaderAnalysisEngine.java:34)
[spotbugs] At edu.umd.cs.findbugs.classfile.impl.AnalysisCache.getClassAnalysis(AnalysisCache.java:261)
[spotbugs] At edu.umd.cs.findbugs.classfile.engine.ClassInfoAnalysisEngine.analyze(ClassInfoAnalysisEngine.java:75)
[spotbugs] At edu.umd.cs.findbugs.classfile.engine.ClassInfoAnalysisEngine.analyze(ClassInfoAnalysisEngine.java:38)
[spotbugs] At edu.umd.cs.findbugs.classfile.impl.AnalysisCache.getClassAnalysis(AnalysisCache.java:261)
[spotbugs] At edu.umd.cs.findbugs.ba.XFactory.getXClass(XFactory.java:693)
[spotbugs] At edu.umd.cs.findbugs.ba.AnalysisContext.setAppClassList(AnalysisContext.java:975)
[spotbugs] At edu.umd.cs.findbugs.FindBugs2.setAppClassList(FindBugs2.java:909)
[spotbugs] At edu.umd.cs.findbugs.FindBugs2.execute(FindBugs2.java:252)
[spotbugs] At edu.umd.cs.findbugs.FindBugs.runMain(FindBugs.java:395)
[spotbugs] At edu.umd.cs.findbugs.FindBugs2.main(FindBugs2.java:1231)
[spotbugs] Couldn't get class info for java/util/zip/Deflater
[spotbugs] java.lang.IllegalArgumentException: Unsupported class file major version 68
[spotbugs] At org.objectweb.asm.ClassReader.<init>(ClassReader.java:200)
[spotbugs] At org.objectweb.asm.ClassReader.<init>(ClassReader.java:180)
[spotbugs] At org.objectweb.asm.ClassReader.<init>(ClassReader.java:166)
[spotbugs] At edu.umd.cs.findbugs.asm.FBClassReader.<init>(FBClassReader.java:35)
[spotbugs] At edu.umd.cs.findbugs.classfile.engine.asm.ClassReaderAnalysisEngine.analyze(ClassReaderAnalysisEngine.java:48)
[spotbugs] At edu.umd.cs.findbugs.classfile.engine.asm.ClassReaderAnalysisEngine.analyze(ClassReaderAnalysisEngine.java:34)
[spotbugs] At edu.umd.cs.findbugs.classfile.impl.AnalysisCache.getClassAnalysis(AnalysisCache.java:261)
[spotbugs] At edu.umd.cs.findbugs.classfile.engine.ClassInfoAnalysisEngine.analyze(ClassInfoAnalysisEngine.java:75)
[spotbugs] At edu.umd.cs.findbugs.classfile.engine.ClassInfoAnalysisEngine.analyze(ClassInfoAnalysisEngine.java:38)
[spotbugs] At edu.umd.cs.findbugs.classfile.impl.AnalysisCache.getClassAnalysis(AnalysisCache.java:261)
[spotbugs] At edu.umd.cs.findbugs.ba.XFactory.getXClass(XFactory.java:693)
[spotbugs] At edu.umd.cs.findbugs.ba.AnalysisContext.setAppClassList(AnalysisContext.java:975)
[spotbugs] At edu.umd.cs.findbugs.FindBugs2.setAppClassList(FindBugs2.java:909)
[spotbugs] At edu.umd.cs.findbugs.FindBugs2.execute(FindBugs2.java:252)
[spotbugs] At edu.umd.cs.findbugs.FindBugs.runMain(FindBugs.java:395)
[spotbugs] At edu.umd.cs.findbugs.FindBugs2.main(FindBugs2.java:1231)
[spotbugs] Couldn't get class info for java/lang/AssertionError
[spotbugs] java.lang.IllegalArgumentException: Unsupported class file major version 68
[spotbugs] At org.objectweb.asm.ClassReader.<init>(ClassReader.java:200)
[spotbugs] At org.objectweb.asm.ClassReader.<init>(ClassReader.java:180)
[spotbugs] At org.objectweb.asm.ClassReader.<init>(ClassReader.java:166)
[spotbugs] At edu.umd.cs.findbugs.asm.FBClassReader.<init>(FBClassReader.java:35)
[spotbugs] At edu.umd.cs.findbugs.classfile.engine.asm.ClassReaderAnalysisEngine.analyze(ClassReaderAnalysisEngine.java:48)
[spotbugs] At edu.umd.cs.findbugs.classfile.engine.asm.ClassReaderAnalysisEngine.analyze(ClassReaderAnalysisEngine.java:34)
[spotbugs] At edu.umd.cs.findbugs.classfile.impl.AnalysisCache.getClassAnalysis(AnalysisCache.java:261)
[spotbugs] At edu.umd.cs.findbugs.classfile.engine.ClassInfoAnalysisEngine.analyze(ClassInfoAnalysisEngine.java:75)
[spotbugs] At edu.umd.cs.findbugs.classfile.engine.ClassInfoAnalysisEngine.analyze(ClassInfoAnalysisEngine.java:38)
[spotbugs] At edu.umd.cs.findbugs.classfile.impl.AnalysisCache.getClassAnalysis(AnalysisCache.java:261)
[spotbugs] At edu.umd.cs.findbugs.ba.XFactory.getXClass(XFactory.java:693)
[spotbugs] At edu.umd.cs.findbugs.ba.AnalysisContext.setAppClassList(AnalysisContext.java:975)
[spotbugs] At edu.umd.cs.findbugs.FindBugs2.setAppClassList(FindBugs2.java:909)
[spotbugs] At edu.umd.cs.findbugs.FindBugs2.execute(FindBugs2.java:252)
[spotbugs] At edu.umd.cs.findbugs.FindBugs.runMain(FindBugs.java:395)
[spotbugs] At edu.umd.cs.findbugs.FindBugs2.main(FindBugs2.java:1231)
[spotbugs] Couldn't get class info for java/util/Set
[spotbugs] java.lang.IllegalArgumentException: Unsupported class file major version 68
[spotbugs] At org.objectweb.asm.ClassReader.<init>(ClassReader.java:200)
[spotbugs] At org.objectweb.asm.ClassReader.<init>(ClassReader.java:180)
[spotbugs] At org.objectweb.asm.ClassReader.<init>(ClassReader.java:166)
[spotbugs] At edu.umd.cs.findbugs.asm.FBClassReader.<init>(FBClassReader.java:35)
[spotbugs] At edu.umd.cs.findbugs.classfile.engine.asm.ClassReaderAnalysisEngine.analyze(ClassReaderAnalysisEngine.java:48)
[spotbugs] At edu.umd.cs.findbugs.classfile.engine.asm.ClassReaderAnalysisEngine.analyze(ClassReaderAnalysisEngine.java:34)
[spotbugs] At edu.umd.cs.findbugs.classfile.impl.AnalysisCache.getClassAnalysis(AnalysisCache.java:261)
[spotbugs] At edu.umd.cs.findbugs.classfile.engine.ClassInfoAnalysisEngine.analyze(ClassInfoAnalysisEngine.java:75)
[spotbugs] At edu.umd.cs.findbugs.classfile.engine.ClassInfoAnalysisEngine.analyze(ClassInfoAnalysisEngine.java:38)
[spotbugs] At edu.umd.cs.findbugs.classfile.impl.AnalysisCache.getClassAnalysis(AnalysisCache.java:261)
[spotbugs] At edu.umd.cs.findbugs.ba.XFactory.getXClass(XFactory.java:693)
[spotbugs] At edu.umd.cs.findbugs.ba.AnalysisContext.setAppClassList(AnalysisContext.java:975)
[spotbugs] At edu.umd.cs.findbugs.FindBugs2.setAppClassList(FindBugs2.java:909)
[spotbugs] At edu.umd.cs.findbugs.FindBugs2.execute(FindBugs2.java:252)
[spotbugs] At edu.umd.cs.findbugs.FindBugs.runMain(FindBugs.java:395)
[spotbugs] At edu.umd.cs.findbugs.FindBugs2.main(FindBugs2.java:1231)
[spotbugs] Couldn't get class info for java/io/FilterInputStream
[spotbugs] java.lang.IllegalArgumentException: Unsupported class file major version 68
[spotbugs] At org.objectweb.asm.ClassReader.<init>(ClassReader.java:200)
[spotbugs] At org.objectweb.asm.ClassReader.<init>(ClassReader.java:180)
[spotbugs] At org.objectweb.asm.ClassReader.<init>(ClassReader.java:166)
[spotbugs] At edu.umd.cs.findbugs.asm.FBClassReader.<init>(FBClassReader.java:35)
[spotbugs] At edu.umd.cs.findbugs.classfile.engine.asm.ClassReaderAnalysisEngine.analyze(ClassReaderAnalysisEngine.java:48)
[spotbugs] At edu.umd.cs.findbugs.classfile.engine.asm.ClassReaderAnalysisEngine.analyze(ClassReaderAnalysisEngine.java:34)
[spotbugs] At edu.umd.cs.findbugs.classfile.impl.AnalysisCache.getClassAnalysis(AnalysisCache.java:261)
[spotbugs] At edu.umd.cs.findbugs.classfile.engine.ClassInfoAnalysisEngine.analyze(ClassInfoAnalysisEngine.java:75)
[spotbugs] At edu.umd.cs.findbugs.classfile.engine.ClassInfoAnalysisEngine.analyze(ClassInfoAnalysisEngine.java:38)
[spotbugs] At edu.umd.cs.findbugs.classfile.impl.AnalysisCache.getClassAnalysis(AnalysisCache.java:261)
[spotbugs] At edu.umd.cs.findbugs.FindBugs2.buildReferencedClassSet(FindBugs2.java:806)
[spotbugs] At edu.umd.cs.findbugs.FindBugs2.execute(FindBugs2.java:249)
[spotbugs] At edu.umd.cs.findbugs.FindBugs.runMain(FindBugs.java:395)
[spotbugs] At edu.umd.cs.findbugs.FindBugs2.main(FindBugs2.java:1231)
[spotbugs] Couldn't get class info for java/awt/AlphaComposite
[spotbugs] java.lang.IllegalArgumentException: Unsupported class file major version 68
[spotbugs] At org.objectweb.asm.ClassReader.<init>(ClassReader.java:200)
[spotbugs] At org.objectweb.asm.ClassReader.<init>(ClassReader.java:180)
[spotbugs] At org.objectweb.asm.ClassReader.<init>(ClassReader.java:166)
[spotbugs] At edu.umd.cs.findbugs.asm.FBClassReader.<init>(FBClassReader.java:35)
[spotbugs] At edu.umd.cs.findbugs.classfile.engine.asm.ClassReaderAnalysisEngine.analyze(ClassReaderAnalysisEngine.java:48)
[spotbugs] At edu.umd.cs.findbugs.classfile.engine.asm.ClassReaderAnalysisEngine.analyze(ClassReaderAnalysisEngine.java:34)
[spotbugs] At edu.umd.cs.findbugs.classfile.impl.AnalysisCache.getClassAnalysis(AnalysisCache.java:261)
[spotbugs] At edu.umd.cs.findbugs.classfile.engine.ClassInfoAnalysisEngine.analyze(ClassInfoAnalysisEngine.java:75)
[spotbugs] At edu.umd.cs.findbugs.classfile.engine.ClassInfoAnalysisEngine.analyze(ClassInfoAnalysisEngine.java:38)
[spotbugs] At edu.umd.cs.findbugs.classfile.impl.AnalysisCache.getClassAnalysis(AnalysisCache.java:261)
[spotbugs] At edu.umd.cs.findbugs.ba.XFactory.getXClass(XFactory.java:693)
[spotbugs] At edu.umd.cs.findbugs.ba.AnalysisContext.setAppClassList(AnalysisContext.java:975)
[spotbugs] At edu.umd.cs.findbugs.FindBugs2.setAppClassList(FindBugs2.java:909)
[spotbugs] At edu.umd.cs.findbugs.FindBugs2.execute(FindBugs2.java:252)
[spotbugs] At edu.umd.cs.findbugs.FindBugs.runMain(FindBugs.java:395)
[spotbugs] At edu.umd.cs.findbugs.FindBugs2.main(FindBugs2.java:1231)
[spotbugs] Couldn't get class info for java/awt/geom/Arc2D
[spotbugs] java.lang.IllegalArgumentException: Unsupported class file major version 68
[spotbugs] At org.objectweb.asm.ClassReader.<init>(ClassReader.java:200)
[spotbugs] At org.objectweb.asm.ClassReader.<init>(ClassReader.java:180)
[spotbugs] At org.objectweb.asm.ClassReader.<init>(ClassReader.java:166)
[spotbugs] At edu.umd.cs.findbugs.asm.FBClassReader.<init>(FBClassReader.java:35)
[spotbugs] At edu.umd.cs.findbugs.classfile.engine.asm.ClassReaderAnalysisEngine.analyze(ClassReaderAnalysisEngine.java:48)
[spotbugs] At edu.umd.cs.findbugs.classfile.engine.asm.ClassReaderAnalysisEngine.analyze(ClassReaderAnalysisEngine.java:34)
[spotbugs] At edu.umd.cs.findbugs.classfile.impl.AnalysisCache.getClassAnalysis(AnalysisCache.java:261)
[spotbugs] At edu.umd.cs.findbugs.classfile.engine.ClassInfoAnalysisEngine.analyze(ClassInfoAnalysisEngine.java:75)
[spotbugs] At edu.umd.cs.findbugs.classfile.engine.ClassInfoAnalysisEngine.analyze(ClassInfoAnalysisEngine.java:38)
[spotbugs] At edu.umd.cs.findbugs.classfile.impl.AnalysisCache.getClassAnalysis(AnalysisCache.java:261)
[spotbugs] At edu.umd.cs.findbugs.ba.XFactory.getXClass(XFactory.java:693)
[spotbugs] At edu.umd.cs.findbugs.ba.AnalysisContext.setAppClassList(AnalysisContext.java:975)
[spotbugs] At edu.umd.cs.findbugs.FindBugs2.setAppClassList(FindBugs2.java:909)
[spotbugs] At edu.umd.cs.findbugs.FindBugs2.execute(FindBugs2.java:252)
[spotbugs] At edu.umd.cs.findbugs.FindBugs.runMain(FindBugs.java:395)
[spotbugs] At edu.umd.cs.findbugs.FindBugs2.main(FindBugs2.java:1231)
[spotbugs] Couldn't get class info for java/security/DigestException
[spotbugs] java.lang.IllegalArgumentException: Unsupported class file major version 68
[spotbugs] At org.objectweb.asm.ClassReader.<init>(ClassReader.java:200)
[spotbugs] At org.objectweb.asm.ClassReader.<init>(ClassReader.java:180)
[spotbugs] At org.objectweb.asm.ClassReader.<init>(ClassReader.java:166)
[spotbugs] At edu.umd.cs.findbugs.asm.FBClassReader.<init>(FBClassReader.java:35)
[spotbugs] At edu.umd.cs.findbugs.classfile.engine.asm.ClassReaderAnalysisEngine.analyze(ClassReaderAnalysisEngine.java:48)
[spotbugs] At edu.umd.cs.findbugs.classfile.engine.asm.ClassReaderAnalysisEngine.analyze(ClassReaderAnalysisEngine.java:34)
[spotbugs] At edu.umd.cs.findbugs.classfile.impl.AnalysisCache.getClassAnalysis(AnalysisCache.java:261)
[spotbugs] At edu.umd.cs.findbugs.classfile.engine.ClassInfoAnalysisEngine.analyze(ClassInfoAnalysisEngine.java:75)
[spotbugs] At edu.umd.cs.findbugs.classfile.engine.ClassInfoAnalysisEngine.analyze(ClassInfoAnalysisEngine.java:38)
[spotbugs] At edu.umd.cs.findbugs.classfile.impl.AnalysisCache.getClassAnalysis(AnalysisCache.java:261)
[spotbugs] At edu.umd.cs.findbugs.ba.XFactory.getXClass(XFactory.java:693)
[spotbugs] At edu.umd.cs.findbugs.ba.AnalysisContext.setAppClassList(AnalysisContext.java:975)
[spotbugs] At edu.umd.cs.findbugs.FindBugs2.setAppClassList(FindBugs2.java:909)
[spotbugs] At edu.umd.cs.findbugs.FindBugs2.execute(FindBugs2.java:252)
[spotbugs] At edu.umd.cs.findbugs.FindBugs.runMain(FindBugs.java:395)
[spotbugs] At edu.umd.cs.findbugs.FindBugs2.main(FindBugs2.java:1231)
[spotbugs]
[spotbugs] java.lang.IllegalArgumentException: Unsupported class file major version 68
[spotbugs] at org.objectweb.asm.ClassReader.<init>(ClassReader.java:200)
[spotbugs] at org.objectweb.asm.ClassReader.<init>(ClassReader.java:180)
[spotbugs] at org.objectweb.asm.ClassReader.<init>(ClassReader.java:166)
[spotbugs] at edu.umd.cs.findbugs.asm.FBClassReader.<init>(FBClassReader.java:35)
[spotbugs] at edu.umd.cs.findbugs.classfile.engine.asm.ClassReaderAnalysisEngine.analyze(ClassReaderAnalysisEngine.java:48)
[spotbugs] at edu.umd.cs.findbugs.classfile.engine.asm.ClassReaderAnalysisEngine.analyze(ClassReaderAnalysisEngine.java:34)
[spotbugs] at edu.umd.cs.findbugs.classfile.impl.AnalysisCache.getClassAnalysis(AnalysisCache.java:261)
[spotbugs] at edu.umd.cs.findbugs.classfile.engine.ClassInfoAnalysisEngine.analyze(ClassInfoAnalysisEngine.java:75)
[spotbugs] at edu.umd.cs.findbugs.classfile.engine.ClassInfoAnalysisEngine.analyze(ClassInfoAnalysisEngine.java:38)
[spotbugs] at edu.umd.cs.findbugs.classfile.impl.AnalysisCache.getClassAnalysis(AnalysisCache.java:261)
[spotbugs] at edu.umd.cs.findbugs.ba.XFactory.getXClass(XFactory.java:693)
[spotbugs] at edu.umd.cs.findbugs.ba.AnalysisContext.setAppClassList(AnalysisContext.java:975)
[spotbugs] at edu.umd.cs.findbugs.FindBugs2.setAppClassList(FindBugs2.java:909)
[spotbugs] at edu.umd.cs.findbugs.FindBugs2.execute(FindBugs2.java:252)
[spotbugs] at edu.umd.cs.findbugs.FindBugs.runMain(FindBugs.java:395)
[spotbugs] at edu.umd.cs.findbugs.FindBugs2.main(FindBugs2.java:1231)
[spotbugs] Java Result: 4
BUILD FAILED
<https://ci-builds.apache.org/job/POI/job/POI-DSL-1.24/ws/build.xml>:2651: Execution of SpotBugs failed.
Total time: 30 minutes 33 seconds
Build step 'Invoke Ant' marked build as failure
ERROR: Not all environment variables could be successfully injected. Check for similarly-named environment variables.
Archiving artifacts
ERROR: Not all environment variables could be successfully injected. Check for similarly-named environment variables.
Recording test results
ERROR: Not all environment variables could be successfully injected. Check for similarly-named environment variables.
[Checks API] No suitable checks publisher found.
ERROR: Not all environment variables could be successfully injected. Check for similarly-named environment variables.
---------------------------------------------------------------------
To unsubscribe, e-mail: dev-unsubscribe@poi.apache.org
For additional commands, e-mail: dev-help@poi.apache.org
Build failed in Jenkins: POI » POI-DSL-1.24 #16
Posted by Apache Jenkins Server <je...@builds.apache.org>.
See <https://ci-builds.apache.org/job/POI/job/POI-DSL-1.24/16/display/redirect?page=changes>
Changes:
[PJ Fanning] gradle 8.13
[PJ Fanning] slf4j 2.0.17
[PJ Fanning] slf4j 2.0.17
[PJ Fanning] doc for getNumberOfTexts
[PJ Fanning] doc for getNumberOfTexts
[Bida Fan] Bug 66260, Add getNumberOfTexts() method
------------------------------------------
[...truncated 9.39 MiB...]
[spotbugs] At edu.umd.cs.findbugs.FindBugs2.execute(FindBugs2.java:252)
[spotbugs] At edu.umd.cs.findbugs.FindBugs.runMain(FindBugs.java:395)
[spotbugs] At edu.umd.cs.findbugs.FindBugs2.main(FindBugs2.java:1231)
[spotbugs] Couldn't get class info for java/util/regex/MatchResult
[spotbugs] java.lang.IllegalArgumentException: Unsupported class file major version 68
[spotbugs] At org.objectweb.asm.ClassReader.<init>(ClassReader.java:200)
[spotbugs] At org.objectweb.asm.ClassReader.<init>(ClassReader.java:180)
[spotbugs] At org.objectweb.asm.ClassReader.<init>(ClassReader.java:166)
[spotbugs] At edu.umd.cs.findbugs.asm.FBClassReader.<init>(FBClassReader.java:35)
[spotbugs] At edu.umd.cs.findbugs.classfile.engine.asm.ClassReaderAnalysisEngine.analyze(ClassReaderAnalysisEngine.java:48)
[spotbugs] At edu.umd.cs.findbugs.classfile.engine.asm.ClassReaderAnalysisEngine.analyze(ClassReaderAnalysisEngine.java:34)
[spotbugs] At edu.umd.cs.findbugs.classfile.impl.AnalysisCache.getClassAnalysis(AnalysisCache.java:261)
[spotbugs] At edu.umd.cs.findbugs.classfile.engine.ClassInfoAnalysisEngine.analyze(ClassInfoAnalysisEngine.java:75)
[spotbugs] At edu.umd.cs.findbugs.classfile.engine.ClassInfoAnalysisEngine.analyze(ClassInfoAnalysisEngine.java:38)
[spotbugs] At edu.umd.cs.findbugs.classfile.impl.AnalysisCache.getClassAnalysis(AnalysisCache.java:261)
[spotbugs] At edu.umd.cs.findbugs.ba.XFactory.getXClass(XFactory.java:693)
[spotbugs] At edu.umd.cs.findbugs.ba.AnalysisContext.setAppClassList(AnalysisContext.java:975)
[spotbugs] At edu.umd.cs.findbugs.FindBugs2.setAppClassList(FindBugs2.java:909)
[spotbugs] At edu.umd.cs.findbugs.FindBugs2.execute(FindBugs2.java:252)
[spotbugs] At edu.umd.cs.findbugs.FindBugs.runMain(FindBugs.java:395)
[spotbugs] At edu.umd.cs.findbugs.FindBugs2.main(FindBugs2.java:1231)
[spotbugs] Couldn't get class info for javax/xml/crypto/dsig/spec/SignatureMethodParameterSpec
[spotbugs] java.lang.IllegalArgumentException: Unsupported class file major version 68
[spotbugs] At org.objectweb.asm.ClassReader.<init>(ClassReader.java:200)
[spotbugs] At org.objectweb.asm.ClassReader.<init>(ClassReader.java:180)
[spotbugs] At org.objectweb.asm.ClassReader.<init>(ClassReader.java:166)
[spotbugs] At edu.umd.cs.findbugs.asm.FBClassReader.<init>(FBClassReader.java:35)
[spotbugs] At edu.umd.cs.findbugs.classfile.engine.asm.ClassReaderAnalysisEngine.analyze(ClassReaderAnalysisEngine.java:48)
[spotbugs] At edu.umd.cs.findbugs.classfile.engine.asm.ClassReaderAnalysisEngine.analyze(ClassReaderAnalysisEngine.java:34)
[spotbugs] At edu.umd.cs.findbugs.classfile.impl.AnalysisCache.getClassAnalysis(AnalysisCache.java:261)
[spotbugs] At edu.umd.cs.findbugs.classfile.engine.ClassInfoAnalysisEngine.analyze(ClassInfoAnalysisEngine.java:75)
[spotbugs] At edu.umd.cs.findbugs.classfile.engine.ClassInfoAnalysisEngine.analyze(ClassInfoAnalysisEngine.java:38)
[spotbugs] At edu.umd.cs.findbugs.classfile.impl.AnalysisCache.getClassAnalysis(AnalysisCache.java:261)
[spotbugs] At edu.umd.cs.findbugs.ba.XFactory.getXClass(XFactory.java:693)
[spotbugs] At edu.umd.cs.findbugs.ba.AnalysisContext.setAppClassList(AnalysisContext.java:975)
[spotbugs] At edu.umd.cs.findbugs.FindBugs2.setAppClassList(FindBugs2.java:909)
[spotbugs] At edu.umd.cs.findbugs.FindBugs2.execute(FindBugs2.java:252)
[spotbugs] At edu.umd.cs.findbugs.FindBugs.runMain(FindBugs.java:395)
[spotbugs] At edu.umd.cs.findbugs.FindBugs2.main(FindBugs2.java:1231)
[spotbugs] Couldn't get class info for java/util/Random
[spotbugs] java.lang.IllegalArgumentException: Unsupported class file major version 68
[spotbugs] At org.objectweb.asm.ClassReader.<init>(ClassReader.java:200)
[spotbugs] At org.objectweb.asm.ClassReader.<init>(ClassReader.java:180)
[spotbugs] At org.objectweb.asm.ClassReader.<init>(ClassReader.java:166)
[spotbugs] At edu.umd.cs.findbugs.asm.FBClassReader.<init>(FBClassReader.java:35)
[spotbugs] At edu.umd.cs.findbugs.classfile.engine.asm.ClassReaderAnalysisEngine.analyze(ClassReaderAnalysisEngine.java:48)
[spotbugs] At edu.umd.cs.findbugs.classfile.engine.asm.ClassReaderAnalysisEngine.analyze(ClassReaderAnalysisEngine.java:34)
[spotbugs] At edu.umd.cs.findbugs.classfile.impl.AnalysisCache.getClassAnalysis(AnalysisCache.java:261)
[spotbugs] At edu.umd.cs.findbugs.classfile.engine.ClassInfoAnalysisEngine.analyze(ClassInfoAnalysisEngine.java:75)
[spotbugs] At edu.umd.cs.findbugs.classfile.engine.ClassInfoAnalysisEngine.analyze(ClassInfoAnalysisEngine.java:38)
[spotbugs] At edu.umd.cs.findbugs.classfile.impl.AnalysisCache.getClassAnalysis(AnalysisCache.java:261)
[spotbugs] At edu.umd.cs.findbugs.ba.XFactory.getXClass(XFactory.java:693)
[spotbugs] At edu.umd.cs.findbugs.ba.AnalysisContext.setAppClassList(AnalysisContext.java:975)
[spotbugs] At edu.umd.cs.findbugs.FindBugs2.setAppClassList(FindBugs2.java:909)
[spotbugs] At edu.umd.cs.findbugs.FindBugs2.execute(FindBugs2.java:252)
[spotbugs] At edu.umd.cs.findbugs.FindBugs.runMain(FindBugs.java:395)
[spotbugs] At edu.umd.cs.findbugs.FindBugs2.main(FindBugs2.java:1231)
[spotbugs] Couldn't get class info for java/nio/file/attribute/BasicFileAttributes
[spotbugs] java.lang.IllegalArgumentException: Unsupported class file major version 68
[spotbugs] At org.objectweb.asm.ClassReader.<init>(ClassReader.java:200)
[spotbugs] At org.objectweb.asm.ClassReader.<init>(ClassReader.java:180)
[spotbugs] At org.objectweb.asm.ClassReader.<init>(ClassReader.java:166)
[spotbugs] At edu.umd.cs.findbugs.asm.FBClassReader.<init>(FBClassReader.java:35)
[spotbugs] At edu.umd.cs.findbugs.classfile.engine.asm.ClassReaderAnalysisEngine.analyze(ClassReaderAnalysisEngine.java:48)
[spotbugs] At edu.umd.cs.findbugs.classfile.engine.asm.ClassReaderAnalysisEngine.analyze(ClassReaderAnalysisEngine.java:34)
[spotbugs] At edu.umd.cs.findbugs.classfile.impl.AnalysisCache.getClassAnalysis(AnalysisCache.java:261)
[spotbugs] At edu.umd.cs.findbugs.classfile.engine.ClassInfoAnalysisEngine.analyze(ClassInfoAnalysisEngine.java:75)
[spotbugs] At edu.umd.cs.findbugs.classfile.engine.ClassInfoAnalysisEngine.analyze(ClassInfoAnalysisEngine.java:38)
[spotbugs] At edu.umd.cs.findbugs.classfile.impl.AnalysisCache.getClassAnalysis(AnalysisCache.java:261)
[spotbugs] At edu.umd.cs.findbugs.ba.XFactory.getXClass(XFactory.java:693)
[spotbugs] At edu.umd.cs.findbugs.ba.AnalysisContext.setAppClassList(AnalysisContext.java:975)
[spotbugs] At edu.umd.cs.findbugs.FindBugs2.setAppClassList(FindBugs2.java:909)
[spotbugs] At edu.umd.cs.findbugs.FindBugs2.execute(FindBugs2.java:252)
[spotbugs] At edu.umd.cs.findbugs.FindBugs.runMain(FindBugs.java:395)
[spotbugs] At edu.umd.cs.findbugs.FindBugs2.main(FindBugs2.java:1231)
[spotbugs] Couldn't get class info for java/util/Locale
[spotbugs] java.lang.IllegalArgumentException: Unsupported class file major version 68
[spotbugs] At org.objectweb.asm.ClassReader.<init>(ClassReader.java:200)
[spotbugs] At org.objectweb.asm.ClassReader.<init>(ClassReader.java:180)
[spotbugs] At org.objectweb.asm.ClassReader.<init>(ClassReader.java:166)
[spotbugs] At edu.umd.cs.findbugs.asm.FBClassReader.<init>(FBClassReader.java:35)
[spotbugs] At edu.umd.cs.findbugs.classfile.engine.asm.ClassReaderAnalysisEngine.analyze(ClassReaderAnalysisEngine.java:48)
[spotbugs] At edu.umd.cs.findbugs.classfile.engine.asm.ClassReaderAnalysisEngine.analyze(ClassReaderAnalysisEngine.java:34)
[spotbugs] At edu.umd.cs.findbugs.classfile.impl.AnalysisCache.getClassAnalysis(AnalysisCache.java:261)
[spotbugs] At edu.umd.cs.findbugs.classfile.engine.ClassInfoAnalysisEngine.analyze(ClassInfoAnalysisEngine.java:75)
[spotbugs] At edu.umd.cs.findbugs.classfile.engine.ClassInfoAnalysisEngine.analyze(ClassInfoAnalysisEngine.java:38)
[spotbugs] At edu.umd.cs.findbugs.classfile.impl.AnalysisCache.getClassAnalysis(AnalysisCache.java:261)
[spotbugs] At edu.umd.cs.findbugs.ba.XFactory.getXClass(XFactory.java:693)
[spotbugs] At edu.umd.cs.findbugs.ba.AnalysisContext.setAppClassList(AnalysisContext.java:975)
[spotbugs] At edu.umd.cs.findbugs.FindBugs2.setAppClassList(FindBugs2.java:909)
[spotbugs] At edu.umd.cs.findbugs.FindBugs2.execute(FindBugs2.java:252)
[spotbugs] At edu.umd.cs.findbugs.FindBugs.runMain(FindBugs.java:395)
[spotbugs] At edu.umd.cs.findbugs.FindBugs2.main(FindBugs2.java:1231)
[spotbugs] Couldn't get class info for java/util/zip/Deflater
[spotbugs] java.lang.IllegalArgumentException: Unsupported class file major version 68
[spotbugs] At org.objectweb.asm.ClassReader.<init>(ClassReader.java:200)
[spotbugs] At org.objectweb.asm.ClassReader.<init>(ClassReader.java:180)
[spotbugs] At org.objectweb.asm.ClassReader.<init>(ClassReader.java:166)
[spotbugs] At edu.umd.cs.findbugs.asm.FBClassReader.<init>(FBClassReader.java:35)
[spotbugs] At edu.umd.cs.findbugs.classfile.engine.asm.ClassReaderAnalysisEngine.analyze(ClassReaderAnalysisEngine.java:48)
[spotbugs] At edu.umd.cs.findbugs.classfile.engine.asm.ClassReaderAnalysisEngine.analyze(ClassReaderAnalysisEngine.java:34)
[spotbugs] At edu.umd.cs.findbugs.classfile.impl.AnalysisCache.getClassAnalysis(AnalysisCache.java:261)
[spotbugs] At edu.umd.cs.findbugs.classfile.engine.ClassInfoAnalysisEngine.analyze(ClassInfoAnalysisEngine.java:75)
[spotbugs] At edu.umd.cs.findbugs.classfile.engine.ClassInfoAnalysisEngine.analyze(ClassInfoAnalysisEngine.java:38)
[spotbugs] At edu.umd.cs.findbugs.classfile.impl.AnalysisCache.getClassAnalysis(AnalysisCache.java:261)
[spotbugs] At edu.umd.cs.findbugs.ba.XFactory.getXClass(XFactory.java:693)
[spotbugs] At edu.umd.cs.findbugs.ba.AnalysisContext.setAppClassList(AnalysisContext.java:975)
[spotbugs] At edu.umd.cs.findbugs.FindBugs2.setAppClassList(FindBugs2.java:909)
[spotbugs] At edu.umd.cs.findbugs.FindBugs2.execute(FindBugs2.java:252)
[spotbugs] At edu.umd.cs.findbugs.FindBugs.runMain(FindBugs.java:395)
[spotbugs] At edu.umd.cs.findbugs.FindBugs2.main(FindBugs2.java:1231)
[spotbugs] Couldn't get class info for java/lang/AssertionError
[spotbugs] java.lang.IllegalArgumentException: Unsupported class file major version 68
[spotbugs] At org.objectweb.asm.ClassReader.<init>(ClassReader.java:200)
[spotbugs] At org.objectweb.asm.ClassReader.<init>(ClassReader.java:180)
[spotbugs] At org.objectweb.asm.ClassReader.<init>(ClassReader.java:166)
[spotbugs] At edu.umd.cs.findbugs.asm.FBClassReader.<init>(FBClassReader.java:35)
[spotbugs] At edu.umd.cs.findbugs.classfile.engine.asm.ClassReaderAnalysisEngine.analyze(ClassReaderAnalysisEngine.java:48)
[spotbugs] At edu.umd.cs.findbugs.classfile.engine.asm.ClassReaderAnalysisEngine.analyze(ClassReaderAnalysisEngine.java:34)
[spotbugs] At edu.umd.cs.findbugs.classfile.impl.AnalysisCache.getClassAnalysis(AnalysisCache.java:261)
[spotbugs] At edu.umd.cs.findbugs.classfile.engine.ClassInfoAnalysisEngine.analyze(ClassInfoAnalysisEngine.java:75)
[spotbugs] At edu.umd.cs.findbugs.classfile.engine.ClassInfoAnalysisEngine.analyze(ClassInfoAnalysisEngine.java:38)
[spotbugs] At edu.umd.cs.findbugs.classfile.impl.AnalysisCache.getClassAnalysis(AnalysisCache.java:261)
[spotbugs] At edu.umd.cs.findbugs.ba.XFactory.getXClass(XFactory.java:693)
[spotbugs] At edu.umd.cs.findbugs.ba.AnalysisContext.setAppClassList(AnalysisContext.java:975)
[spotbugs] At edu.umd.cs.findbugs.FindBugs2.setAppClassList(FindBugs2.java:909)
[spotbugs] At edu.umd.cs.findbugs.FindBugs2.execute(FindBugs2.java:252)
[spotbugs] At edu.umd.cs.findbugs.FindBugs.runMain(FindBugs.java:395)
[spotbugs] At edu.umd.cs.findbugs.FindBugs2.main(FindBugs2.java:1231)
[spotbugs] Couldn't get class info for java/util/Set
[spotbugs] java.lang.IllegalArgumentException: Unsupported class file major version 68
[spotbugs] At org.objectweb.asm.ClassReader.<init>(ClassReader.java:200)
[spotbugs] At org.objectweb.asm.ClassReader.<init>(ClassReader.java:180)
[spotbugs] At org.objectweb.asm.ClassReader.<init>(ClassReader.java:166)
[spotbugs] At edu.umd.cs.findbugs.asm.FBClassReader.<init>(FBClassReader.java:35)
[spotbugs] At edu.umd.cs.findbugs.classfile.engine.asm.ClassReaderAnalysisEngine.analyze(ClassReaderAnalysisEngine.java:48)
[spotbugs] At edu.umd.cs.findbugs.classfile.engine.asm.ClassReaderAnalysisEngine.analyze(ClassReaderAnalysisEngine.java:34)
[spotbugs] At edu.umd.cs.findbugs.classfile.impl.AnalysisCache.getClassAnalysis(AnalysisCache.java:261)
[spotbugs] At edu.umd.cs.findbugs.classfile.engine.ClassInfoAnalysisEngine.analyze(ClassInfoAnalysisEngine.java:75)
[spotbugs] At edu.umd.cs.findbugs.classfile.engine.ClassInfoAnalysisEngine.analyze(ClassInfoAnalysisEngine.java:38)
[spotbugs] At edu.umd.cs.findbugs.classfile.impl.AnalysisCache.getClassAnalysis(AnalysisCache.java:261)
[spotbugs] At edu.umd.cs.findbugs.ba.XFactory.getXClass(XFactory.java:693)
[spotbugs] At edu.umd.cs.findbugs.ba.AnalysisContext.setAppClassList(AnalysisContext.java:975)
[spotbugs] At edu.umd.cs.findbugs.FindBugs2.setAppClassList(FindBugs2.java:909)
[spotbugs] At edu.umd.cs.findbugs.FindBugs2.execute(FindBugs2.java:252)
[spotbugs] At edu.umd.cs.findbugs.FindBugs.runMain(FindBugs.java:395)
[spotbugs] At edu.umd.cs.findbugs.FindBugs2.main(FindBugs2.java:1231)
[spotbugs] Couldn't get class info for java/io/FilterInputStream
[spotbugs] java.lang.IllegalArgumentException: Unsupported class file major version 68
[spotbugs] At org.objectweb.asm.ClassReader.<init>(ClassReader.java:200)
[spotbugs] At org.objectweb.asm.ClassReader.<init>(ClassReader.java:180)
[spotbugs] At org.objectweb.asm.ClassReader.<init>(ClassReader.java:166)
[spotbugs] At edu.umd.cs.findbugs.asm.FBClassReader.<init>(FBClassReader.java:35)
[spotbugs] At edu.umd.cs.findbugs.classfile.engine.asm.ClassReaderAnalysisEngine.analyze(ClassReaderAnalysisEngine.java:48)
[spotbugs] At edu.umd.cs.findbugs.classfile.engine.asm.ClassReaderAnalysisEngine.analyze(ClassReaderAnalysisEngine.java:34)
[spotbugs] At edu.umd.cs.findbugs.classfile.impl.AnalysisCache.getClassAnalysis(AnalysisCache.java:261)
[spotbugs] At edu.umd.cs.findbugs.classfile.engine.ClassInfoAnalysisEngine.analyze(ClassInfoAnalysisEngine.java:75)
[spotbugs] At edu.umd.cs.findbugs.classfile.engine.ClassInfoAnalysisEngine.analyze(ClassInfoAnalysisEngine.java:38)
[spotbugs] At edu.umd.cs.findbugs.classfile.impl.AnalysisCache.getClassAnalysis(AnalysisCache.java:261)
[spotbugs] At edu.umd.cs.findbugs.FindBugs2.buildReferencedClassSet(FindBugs2.java:806)
[spotbugs] At edu.umd.cs.findbugs.FindBugs2.execute(FindBugs2.java:249)
[spotbugs] At edu.umd.cs.findbugs.FindBugs.runMain(FindBugs.java:395)
[spotbugs] At edu.umd.cs.findbugs.FindBugs2.main(FindBugs2.java:1231)
[spotbugs] Couldn't get class info for java/awt/AlphaComposite
[spotbugs] java.lang.IllegalArgumentException: Unsupported class file major version 68
[spotbugs] At org.objectweb.asm.ClassReader.<init>(ClassReader.java:200)
[spotbugs] At org.objectweb.asm.ClassReader.<init>(ClassReader.java:180)
[spotbugs] At org.objectweb.asm.ClassReader.<init>(ClassReader.java:166)
[spotbugs] At edu.umd.cs.findbugs.asm.FBClassReader.<init>(FBClassReader.java:35)
[spotbugs] At edu.umd.cs.findbugs.classfile.engine.asm.ClassReaderAnalysisEngine.analyze(ClassReaderAnalysisEngine.java:48)
[spotbugs] At edu.umd.cs.findbugs.classfile.engine.asm.ClassReaderAnalysisEngine.analyze(ClassReaderAnalysisEngine.java:34)
[spotbugs] At edu.umd.cs.findbugs.classfile.impl.AnalysisCache.getClassAnalysis(AnalysisCache.java:261)
[spotbugs] At edu.umd.cs.findbugs.classfile.engine.ClassInfoAnalysisEngine.analyze(ClassInfoAnalysisEngine.java:75)
[spotbugs] At edu.umd.cs.findbugs.classfile.engine.ClassInfoAnalysisEngine.analyze(ClassInfoAnalysisEngine.java:38)
[spotbugs] At edu.umd.cs.findbugs.classfile.impl.AnalysisCache.getClassAnalysis(AnalysisCache.java:261)
[spotbugs] At edu.umd.cs.findbugs.ba.XFactory.getXClass(XFactory.java:693)
[spotbugs] At edu.umd.cs.findbugs.ba.AnalysisContext.setAppClassList(AnalysisContext.java:975)
[spotbugs] At edu.umd.cs.findbugs.FindBugs2.setAppClassList(FindBugs2.java:909)
[spotbugs] At edu.umd.cs.findbugs.FindBugs2.execute(FindBugs2.java:252)
[spotbugs] At edu.umd.cs.findbugs.FindBugs.runMain(FindBugs.java:395)
[spotbugs] At edu.umd.cs.findbugs.FindBugs2.main(FindBugs2.java:1231)
[spotbugs] Couldn't get class info for java/awt/geom/Arc2D
[spotbugs] java.lang.IllegalArgumentException: Unsupported class file major version 68
[spotbugs] At org.objectweb.asm.ClassReader.<init>(ClassReader.java:200)
[spotbugs] At org.objectweb.asm.ClassReader.<init>(ClassReader.java:180)
[spotbugs] At org.objectweb.asm.ClassReader.<init>(ClassReader.java:166)
[spotbugs] At edu.umd.cs.findbugs.asm.FBClassReader.<init>(FBClassReader.java:35)
[spotbugs] At edu.umd.cs.findbugs.classfile.engine.asm.ClassReaderAnalysisEngine.analyze(ClassReaderAnalysisEngine.java:48)
[spotbugs] At edu.umd.cs.findbugs.classfile.engine.asm.ClassReaderAnalysisEngine.analyze(ClassReaderAnalysisEngine.java:34)
[spotbugs] At edu.umd.cs.findbugs.classfile.impl.AnalysisCache.getClassAnalysis(AnalysisCache.java:261)
[spotbugs] At edu.umd.cs.findbugs.classfile.engine.ClassInfoAnalysisEngine.analyze(ClassInfoAnalysisEngine.java:75)
[spotbugs] At edu.umd.cs.findbugs.classfile.engine.ClassInfoAnalysisEngine.analyze(ClassInfoAnalysisEngine.java:38)
[spotbugs] At edu.umd.cs.findbugs.classfile.impl.AnalysisCache.getClassAnalysis(AnalysisCache.java:261)
[spotbugs] At edu.umd.cs.findbugs.ba.XFactory.getXClass(XFactory.java:693)
[spotbugs] At edu.umd.cs.findbugs.ba.AnalysisContext.setAppClassList(AnalysisContext.java:975)
[spotbugs] At edu.umd.cs.findbugs.FindBugs2.setAppClassList(FindBugs2.java:909)
[spotbugs] At edu.umd.cs.findbugs.FindBugs2.execute(FindBugs2.java:252)
[spotbugs] At edu.umd.cs.findbugs.FindBugs.runMain(FindBugs.java:395)
[spotbugs] At edu.umd.cs.findbugs.FindBugs2.main(FindBugs2.java:1231)
[spotbugs] Couldn't get class info for java/security/DigestException
[spotbugs] java.lang.IllegalArgumentException: Unsupported class file major version 68
[spotbugs] At org.objectweb.asm.ClassReader.<init>(ClassReader.java:200)
[spotbugs] At org.objectweb.asm.ClassReader.<init>(ClassReader.java:180)
[spotbugs] At org.objectweb.asm.ClassReader.<init>(ClassReader.java:166)
[spotbugs] At edu.umd.cs.findbugs.asm.FBClassReader.<init>(FBClassReader.java:35)
[spotbugs] At edu.umd.cs.findbugs.classfile.engine.asm.ClassReaderAnalysisEngine.analyze(ClassReaderAnalysisEngine.java:48)
[spotbugs] At edu.umd.cs.findbugs.classfile.engine.asm.ClassReaderAnalysisEngine.analyze(ClassReaderAnalysisEngine.java:34)
[spotbugs] At edu.umd.cs.findbugs.classfile.impl.AnalysisCache.getClassAnalysis(AnalysisCache.java:261)
[spotbugs] At edu.umd.cs.findbugs.classfile.engine.ClassInfoAnalysisEngine.analyze(ClassInfoAnalysisEngine.java:75)
[spotbugs] At edu.umd.cs.findbugs.classfile.engine.ClassInfoAnalysisEngine.analyze(ClassInfoAnalysisEngine.java:38)
[spotbugs] At edu.umd.cs.findbugs.classfile.impl.AnalysisCache.getClassAnalysis(AnalysisCache.java:261)
[spotbugs] At edu.umd.cs.findbugs.ba.XFactory.getXClass(XFactory.java:693)
[spotbugs] At edu.umd.cs.findbugs.ba.AnalysisContext.setAppClassList(AnalysisContext.java:975)
[spotbugs] At edu.umd.cs.findbugs.FindBugs2.setAppClassList(FindBugs2.java:909)
[spotbugs] At edu.umd.cs.findbugs.FindBugs2.execute(FindBugs2.java:252)
[spotbugs] At edu.umd.cs.findbugs.FindBugs.runMain(FindBugs.java:395)
[spotbugs] At edu.umd.cs.findbugs.FindBugs2.main(FindBugs2.java:1231)
[spotbugs]
[spotbugs] java.lang.IllegalArgumentException: Unsupported class file major version 68
[spotbugs] at org.objectweb.asm.ClassReader.<init>(ClassReader.java:200)
[spotbugs] at org.objectweb.asm.ClassReader.<init>(ClassReader.java:180)
[spotbugs] at org.objectweb.asm.ClassReader.<init>(ClassReader.java:166)
[spotbugs] at edu.umd.cs.findbugs.asm.FBClassReader.<init>(FBClassReader.java:35)
[spotbugs] at edu.umd.cs.findbugs.classfile.engine.asm.ClassReaderAnalysisEngine.analyze(ClassReaderAnalysisEngine.java:48)
[spotbugs] at edu.umd.cs.findbugs.classfile.engine.asm.ClassReaderAnalysisEngine.analyze(ClassReaderAnalysisEngine.java:34)
[spotbugs] at edu.umd.cs.findbugs.classfile.impl.AnalysisCache.getClassAnalysis(AnalysisCache.java:261)
[spotbugs] at edu.umd.cs.findbugs.classfile.engine.ClassInfoAnalysisEngine.analyze(ClassInfoAnalysisEngine.java:75)
[spotbugs] at edu.umd.cs.findbugs.classfile.engine.ClassInfoAnalysisEngine.analyze(ClassInfoAnalysisEngine.java:38)
[spotbugs] at edu.umd.cs.findbugs.classfile.impl.AnalysisCache.getClassAnalysis(AnalysisCache.java:261)
[spotbugs] at edu.umd.cs.findbugs.ba.XFactory.getXClass(XFactory.java:693)
[spotbugs] at edu.umd.cs.findbugs.ba.AnalysisContext.setAppClassList(AnalysisContext.java:975)
[spotbugs] at edu.umd.cs.findbugs.FindBugs2.setAppClassList(FindBugs2.java:909)
[spotbugs] at edu.umd.cs.findbugs.FindBugs2.execute(FindBugs2.java:252)
[spotbugs] at edu.umd.cs.findbugs.FindBugs.runMain(FindBugs.java:395)
[spotbugs] at edu.umd.cs.findbugs.FindBugs2.main(FindBugs2.java:1231)
[spotbugs] Java Result: 4
BUILD FAILED
<https://ci-builds.apache.org/job/POI/job/POI-DSL-1.24/ws/build.xml>:2651: Execution of SpotBugs failed.
Total time: 28 minutes 58 seconds
Build step 'Invoke Ant' marked build as failure
ERROR: Not all environment variables could be successfully injected. Check for similarly-named environment variables.
Archiving artifacts
ERROR: Not all environment variables could be successfully injected. Check for similarly-named environment variables.
Recording test results
ERROR: Not all environment variables could be successfully injected. Check for similarly-named environment variables.
[Checks API] No suitable checks publisher found.
ERROR: Not all environment variables could be successfully injected. Check for similarly-named environment variables.
---------------------------------------------------------------------
To unsubscribe, e-mail: dev-unsubscribe@poi.apache.org
For additional commands, e-mail: dev-help@poi.apache.org
Build failed in Jenkins: POI » POI-DSL-1.24 #15
Posted by Apache Jenkins Server <je...@builds.apache.org>.
See <https://ci-builds.apache.org/job/POI/job/POI-DSL-1.24/15/display/redirect?page=changes>
Changes:
[PJ Fanning] junit 5.12/1.12
[PJ Fanning] fix broken xssf test
[PJ Fanning] add datetime test
[PJ Fanning] add datetime test
------------------------------------------
[...truncated 9.39 MiB...]
[spotbugs] At edu.umd.cs.findbugs.FindBugs2.execute(FindBugs2.java:252)
[spotbugs] At edu.umd.cs.findbugs.FindBugs.runMain(FindBugs.java:395)
[spotbugs] At edu.umd.cs.findbugs.FindBugs2.main(FindBugs2.java:1231)
[spotbugs] Couldn't get class info for java/util/regex/MatchResult
[spotbugs] java.lang.IllegalArgumentException: Unsupported class file major version 68
[spotbugs] At org.objectweb.asm.ClassReader.<init>(ClassReader.java:200)
[spotbugs] At org.objectweb.asm.ClassReader.<init>(ClassReader.java:180)
[spotbugs] At org.objectweb.asm.ClassReader.<init>(ClassReader.java:166)
[spotbugs] At edu.umd.cs.findbugs.asm.FBClassReader.<init>(FBClassReader.java:35)
[spotbugs] At edu.umd.cs.findbugs.classfile.engine.asm.ClassReaderAnalysisEngine.analyze(ClassReaderAnalysisEngine.java:48)
[spotbugs] At edu.umd.cs.findbugs.classfile.engine.asm.ClassReaderAnalysisEngine.analyze(ClassReaderAnalysisEngine.java:34)
[spotbugs] At edu.umd.cs.findbugs.classfile.impl.AnalysisCache.getClassAnalysis(AnalysisCache.java:261)
[spotbugs] At edu.umd.cs.findbugs.classfile.engine.ClassInfoAnalysisEngine.analyze(ClassInfoAnalysisEngine.java:75)
[spotbugs] At edu.umd.cs.findbugs.classfile.engine.ClassInfoAnalysisEngine.analyze(ClassInfoAnalysisEngine.java:38)
[spotbugs] At edu.umd.cs.findbugs.classfile.impl.AnalysisCache.getClassAnalysis(AnalysisCache.java:261)
[spotbugs] At edu.umd.cs.findbugs.ba.XFactory.getXClass(XFactory.java:693)
[spotbugs] At edu.umd.cs.findbugs.ba.AnalysisContext.setAppClassList(AnalysisContext.java:975)
[spotbugs] At edu.umd.cs.findbugs.FindBugs2.setAppClassList(FindBugs2.java:909)
[spotbugs] At edu.umd.cs.findbugs.FindBugs2.execute(FindBugs2.java:252)
[spotbugs] At edu.umd.cs.findbugs.FindBugs.runMain(FindBugs.java:395)
[spotbugs] At edu.umd.cs.findbugs.FindBugs2.main(FindBugs2.java:1231)
[spotbugs] Couldn't get class info for javax/xml/crypto/dsig/spec/SignatureMethodParameterSpec
[spotbugs] java.lang.IllegalArgumentException: Unsupported class file major version 68
[spotbugs] At org.objectweb.asm.ClassReader.<init>(ClassReader.java:200)
[spotbugs] At org.objectweb.asm.ClassReader.<init>(ClassReader.java:180)
[spotbugs] At org.objectweb.asm.ClassReader.<init>(ClassReader.java:166)
[spotbugs] At edu.umd.cs.findbugs.asm.FBClassReader.<init>(FBClassReader.java:35)
[spotbugs] At edu.umd.cs.findbugs.classfile.engine.asm.ClassReaderAnalysisEngine.analyze(ClassReaderAnalysisEngine.java:48)
[spotbugs] At edu.umd.cs.findbugs.classfile.engine.asm.ClassReaderAnalysisEngine.analyze(ClassReaderAnalysisEngine.java:34)
[spotbugs] At edu.umd.cs.findbugs.classfile.impl.AnalysisCache.getClassAnalysis(AnalysisCache.java:261)
[spotbugs] At edu.umd.cs.findbugs.classfile.engine.ClassInfoAnalysisEngine.analyze(ClassInfoAnalysisEngine.java:75)
[spotbugs] At edu.umd.cs.findbugs.classfile.engine.ClassInfoAnalysisEngine.analyze(ClassInfoAnalysisEngine.java:38)
[spotbugs] At edu.umd.cs.findbugs.classfile.impl.AnalysisCache.getClassAnalysis(AnalysisCache.java:261)
[spotbugs] At edu.umd.cs.findbugs.ba.XFactory.getXClass(XFactory.java:693)
[spotbugs] At edu.umd.cs.findbugs.ba.AnalysisContext.setAppClassList(AnalysisContext.java:975)
[spotbugs] At edu.umd.cs.findbugs.FindBugs2.setAppClassList(FindBugs2.java:909)
[spotbugs] At edu.umd.cs.findbugs.FindBugs2.execute(FindBugs2.java:252)
[spotbugs] At edu.umd.cs.findbugs.FindBugs.runMain(FindBugs.java:395)
[spotbugs] At edu.umd.cs.findbugs.FindBugs2.main(FindBugs2.java:1231)
[spotbugs] Couldn't get class info for java/util/Random
[spotbugs] java.lang.IllegalArgumentException: Unsupported class file major version 68
[spotbugs] At org.objectweb.asm.ClassReader.<init>(ClassReader.java:200)
[spotbugs] At org.objectweb.asm.ClassReader.<init>(ClassReader.java:180)
[spotbugs] At org.objectweb.asm.ClassReader.<init>(ClassReader.java:166)
[spotbugs] At edu.umd.cs.findbugs.asm.FBClassReader.<init>(FBClassReader.java:35)
[spotbugs] At edu.umd.cs.findbugs.classfile.engine.asm.ClassReaderAnalysisEngine.analyze(ClassReaderAnalysisEngine.java:48)
[spotbugs] At edu.umd.cs.findbugs.classfile.engine.asm.ClassReaderAnalysisEngine.analyze(ClassReaderAnalysisEngine.java:34)
[spotbugs] At edu.umd.cs.findbugs.classfile.impl.AnalysisCache.getClassAnalysis(AnalysisCache.java:261)
[spotbugs] At edu.umd.cs.findbugs.classfile.engine.ClassInfoAnalysisEngine.analyze(ClassInfoAnalysisEngine.java:75)
[spotbugs] At edu.umd.cs.findbugs.classfile.engine.ClassInfoAnalysisEngine.analyze(ClassInfoAnalysisEngine.java:38)
[spotbugs] At edu.umd.cs.findbugs.classfile.impl.AnalysisCache.getClassAnalysis(AnalysisCache.java:261)
[spotbugs] At edu.umd.cs.findbugs.ba.XFactory.getXClass(XFactory.java:693)
[spotbugs] At edu.umd.cs.findbugs.ba.AnalysisContext.setAppClassList(AnalysisContext.java:975)
[spotbugs] At edu.umd.cs.findbugs.FindBugs2.setAppClassList(FindBugs2.java:909)
[spotbugs] At edu.umd.cs.findbugs.FindBugs2.execute(FindBugs2.java:252)
[spotbugs] At edu.umd.cs.findbugs.FindBugs.runMain(FindBugs.java:395)
[spotbugs] At edu.umd.cs.findbugs.FindBugs2.main(FindBugs2.java:1231)
[spotbugs] Couldn't get class info for java/nio/file/attribute/BasicFileAttributes
[spotbugs] java.lang.IllegalArgumentException: Unsupported class file major version 68
[spotbugs] At org.objectweb.asm.ClassReader.<init>(ClassReader.java:200)
[spotbugs] At org.objectweb.asm.ClassReader.<init>(ClassReader.java:180)
[spotbugs] At org.objectweb.asm.ClassReader.<init>(ClassReader.java:166)
[spotbugs] At edu.umd.cs.findbugs.asm.FBClassReader.<init>(FBClassReader.java:35)
[spotbugs] At edu.umd.cs.findbugs.classfile.engine.asm.ClassReaderAnalysisEngine.analyze(ClassReaderAnalysisEngine.java:48)
[spotbugs] At edu.umd.cs.findbugs.classfile.engine.asm.ClassReaderAnalysisEngine.analyze(ClassReaderAnalysisEngine.java:34)
[spotbugs] At edu.umd.cs.findbugs.classfile.impl.AnalysisCache.getClassAnalysis(AnalysisCache.java:261)
[spotbugs] At edu.umd.cs.findbugs.classfile.engine.ClassInfoAnalysisEngine.analyze(ClassInfoAnalysisEngine.java:75)
[spotbugs] At edu.umd.cs.findbugs.classfile.engine.ClassInfoAnalysisEngine.analyze(ClassInfoAnalysisEngine.java:38)
[spotbugs] At edu.umd.cs.findbugs.classfile.impl.AnalysisCache.getClassAnalysis(AnalysisCache.java:261)
[spotbugs] At edu.umd.cs.findbugs.ba.XFactory.getXClass(XFactory.java:693)
[spotbugs] At edu.umd.cs.findbugs.ba.AnalysisContext.setAppClassList(AnalysisContext.java:975)
[spotbugs] At edu.umd.cs.findbugs.FindBugs2.setAppClassList(FindBugs2.java:909)
[spotbugs] At edu.umd.cs.findbugs.FindBugs2.execute(FindBugs2.java:252)
[spotbugs] At edu.umd.cs.findbugs.FindBugs.runMain(FindBugs.java:395)
[spotbugs] At edu.umd.cs.findbugs.FindBugs2.main(FindBugs2.java:1231)
[spotbugs] Couldn't get class info for java/util/Locale
[spotbugs] java.lang.IllegalArgumentException: Unsupported class file major version 68
[spotbugs] At org.objectweb.asm.ClassReader.<init>(ClassReader.java:200)
[spotbugs] At org.objectweb.asm.ClassReader.<init>(ClassReader.java:180)
[spotbugs] At org.objectweb.asm.ClassReader.<init>(ClassReader.java:166)
[spotbugs] At edu.umd.cs.findbugs.asm.FBClassReader.<init>(FBClassReader.java:35)
[spotbugs] At edu.umd.cs.findbugs.classfile.engine.asm.ClassReaderAnalysisEngine.analyze(ClassReaderAnalysisEngine.java:48)
[spotbugs] At edu.umd.cs.findbugs.classfile.engine.asm.ClassReaderAnalysisEngine.analyze(ClassReaderAnalysisEngine.java:34)
[spotbugs] At edu.umd.cs.findbugs.classfile.impl.AnalysisCache.getClassAnalysis(AnalysisCache.java:261)
[spotbugs] At edu.umd.cs.findbugs.classfile.engine.ClassInfoAnalysisEngine.analyze(ClassInfoAnalysisEngine.java:75)
[spotbugs] At edu.umd.cs.findbugs.classfile.engine.ClassInfoAnalysisEngine.analyze(ClassInfoAnalysisEngine.java:38)
[spotbugs] At edu.umd.cs.findbugs.classfile.impl.AnalysisCache.getClassAnalysis(AnalysisCache.java:261)
[spotbugs] At edu.umd.cs.findbugs.ba.XFactory.getXClass(XFactory.java:693)
[spotbugs] At edu.umd.cs.findbugs.ba.AnalysisContext.setAppClassList(AnalysisContext.java:975)
[spotbugs] At edu.umd.cs.findbugs.FindBugs2.setAppClassList(FindBugs2.java:909)
[spotbugs] At edu.umd.cs.findbugs.FindBugs2.execute(FindBugs2.java:252)
[spotbugs] At edu.umd.cs.findbugs.FindBugs.runMain(FindBugs.java:395)
[spotbugs] At edu.umd.cs.findbugs.FindBugs2.main(FindBugs2.java:1231)
[spotbugs] Couldn't get class info for java/util/zip/Deflater
[spotbugs] java.lang.IllegalArgumentException: Unsupported class file major version 68
[spotbugs] At org.objectweb.asm.ClassReader.<init>(ClassReader.java:200)
[spotbugs] At org.objectweb.asm.ClassReader.<init>(ClassReader.java:180)
[spotbugs] At org.objectweb.asm.ClassReader.<init>(ClassReader.java:166)
[spotbugs] At edu.umd.cs.findbugs.asm.FBClassReader.<init>(FBClassReader.java:35)
[spotbugs] At edu.umd.cs.findbugs.classfile.engine.asm.ClassReaderAnalysisEngine.analyze(ClassReaderAnalysisEngine.java:48)
[spotbugs] At edu.umd.cs.findbugs.classfile.engine.asm.ClassReaderAnalysisEngine.analyze(ClassReaderAnalysisEngine.java:34)
[spotbugs] At edu.umd.cs.findbugs.classfile.impl.AnalysisCache.getClassAnalysis(AnalysisCache.java:261)
[spotbugs] At edu.umd.cs.findbugs.classfile.engine.ClassInfoAnalysisEngine.analyze(ClassInfoAnalysisEngine.java:75)
[spotbugs] At edu.umd.cs.findbugs.classfile.engine.ClassInfoAnalysisEngine.analyze(ClassInfoAnalysisEngine.java:38)
[spotbugs] At edu.umd.cs.findbugs.classfile.impl.AnalysisCache.getClassAnalysis(AnalysisCache.java:261)
[spotbugs] At edu.umd.cs.findbugs.ba.XFactory.getXClass(XFactory.java:693)
[spotbugs] At edu.umd.cs.findbugs.ba.AnalysisContext.setAppClassList(AnalysisContext.java:975)
[spotbugs] At edu.umd.cs.findbugs.FindBugs2.setAppClassList(FindBugs2.java:909)
[spotbugs] At edu.umd.cs.findbugs.FindBugs2.execute(FindBugs2.java:252)
[spotbugs] At edu.umd.cs.findbugs.FindBugs.runMain(FindBugs.java:395)
[spotbugs] At edu.umd.cs.findbugs.FindBugs2.main(FindBugs2.java:1231)
[spotbugs] Couldn't get class info for java/lang/AssertionError
[spotbugs] java.lang.IllegalArgumentException: Unsupported class file major version 68
[spotbugs] At org.objectweb.asm.ClassReader.<init>(ClassReader.java:200)
[spotbugs] At org.objectweb.asm.ClassReader.<init>(ClassReader.java:180)
[spotbugs] At org.objectweb.asm.ClassReader.<init>(ClassReader.java:166)
[spotbugs] At edu.umd.cs.findbugs.asm.FBClassReader.<init>(FBClassReader.java:35)
[spotbugs] At edu.umd.cs.findbugs.classfile.engine.asm.ClassReaderAnalysisEngine.analyze(ClassReaderAnalysisEngine.java:48)
[spotbugs] At edu.umd.cs.findbugs.classfile.engine.asm.ClassReaderAnalysisEngine.analyze(ClassReaderAnalysisEngine.java:34)
[spotbugs] At edu.umd.cs.findbugs.classfile.impl.AnalysisCache.getClassAnalysis(AnalysisCache.java:261)
[spotbugs] At edu.umd.cs.findbugs.classfile.engine.ClassInfoAnalysisEngine.analyze(ClassInfoAnalysisEngine.java:75)
[spotbugs] At edu.umd.cs.findbugs.classfile.engine.ClassInfoAnalysisEngine.analyze(ClassInfoAnalysisEngine.java:38)
[spotbugs] At edu.umd.cs.findbugs.classfile.impl.AnalysisCache.getClassAnalysis(AnalysisCache.java:261)
[spotbugs] At edu.umd.cs.findbugs.ba.XFactory.getXClass(XFactory.java:693)
[spotbugs] At edu.umd.cs.findbugs.ba.AnalysisContext.setAppClassList(AnalysisContext.java:975)
[spotbugs] At edu.umd.cs.findbugs.FindBugs2.setAppClassList(FindBugs2.java:909)
[spotbugs] At edu.umd.cs.findbugs.FindBugs2.execute(FindBugs2.java:252)
[spotbugs] At edu.umd.cs.findbugs.FindBugs.runMain(FindBugs.java:395)
[spotbugs] At edu.umd.cs.findbugs.FindBugs2.main(FindBugs2.java:1231)
[spotbugs] Couldn't get class info for java/util/Set
[spotbugs] java.lang.IllegalArgumentException: Unsupported class file major version 68
[spotbugs] At org.objectweb.asm.ClassReader.<init>(ClassReader.java:200)
[spotbugs] At org.objectweb.asm.ClassReader.<init>(ClassReader.java:180)
[spotbugs] At org.objectweb.asm.ClassReader.<init>(ClassReader.java:166)
[spotbugs] At edu.umd.cs.findbugs.asm.FBClassReader.<init>(FBClassReader.java:35)
[spotbugs] At edu.umd.cs.findbugs.classfile.engine.asm.ClassReaderAnalysisEngine.analyze(ClassReaderAnalysisEngine.java:48)
[spotbugs] At edu.umd.cs.findbugs.classfile.engine.asm.ClassReaderAnalysisEngine.analyze(ClassReaderAnalysisEngine.java:34)
[spotbugs] At edu.umd.cs.findbugs.classfile.impl.AnalysisCache.getClassAnalysis(AnalysisCache.java:261)
[spotbugs] At edu.umd.cs.findbugs.classfile.engine.ClassInfoAnalysisEngine.analyze(ClassInfoAnalysisEngine.java:75)
[spotbugs] At edu.umd.cs.findbugs.classfile.engine.ClassInfoAnalysisEngine.analyze(ClassInfoAnalysisEngine.java:38)
[spotbugs] At edu.umd.cs.findbugs.classfile.impl.AnalysisCache.getClassAnalysis(AnalysisCache.java:261)
[spotbugs] At edu.umd.cs.findbugs.ba.XFactory.getXClass(XFactory.java:693)
[spotbugs] At edu.umd.cs.findbugs.ba.AnalysisContext.setAppClassList(AnalysisContext.java:975)
[spotbugs] At edu.umd.cs.findbugs.FindBugs2.setAppClassList(FindBugs2.java:909)
[spotbugs] At edu.umd.cs.findbugs.FindBugs2.execute(FindBugs2.java:252)
[spotbugs] At edu.umd.cs.findbugs.FindBugs.runMain(FindBugs.java:395)
[spotbugs] At edu.umd.cs.findbugs.FindBugs2.main(FindBugs2.java:1231)
[spotbugs] Couldn't get class info for java/io/FilterInputStream
[spotbugs] java.lang.IllegalArgumentException: Unsupported class file major version 68
[spotbugs] At org.objectweb.asm.ClassReader.<init>(ClassReader.java:200)
[spotbugs] At org.objectweb.asm.ClassReader.<init>(ClassReader.java:180)
[spotbugs] At org.objectweb.asm.ClassReader.<init>(ClassReader.java:166)
[spotbugs] At edu.umd.cs.findbugs.asm.FBClassReader.<init>(FBClassReader.java:35)
[spotbugs] At edu.umd.cs.findbugs.classfile.engine.asm.ClassReaderAnalysisEngine.analyze(ClassReaderAnalysisEngine.java:48)
[spotbugs] At edu.umd.cs.findbugs.classfile.engine.asm.ClassReaderAnalysisEngine.analyze(ClassReaderAnalysisEngine.java:34)
[spotbugs] At edu.umd.cs.findbugs.classfile.impl.AnalysisCache.getClassAnalysis(AnalysisCache.java:261)
[spotbugs] At edu.umd.cs.findbugs.classfile.engine.ClassInfoAnalysisEngine.analyze(ClassInfoAnalysisEngine.java:75)
[spotbugs] At edu.umd.cs.findbugs.classfile.engine.ClassInfoAnalysisEngine.analyze(ClassInfoAnalysisEngine.java:38)
[spotbugs] At edu.umd.cs.findbugs.classfile.impl.AnalysisCache.getClassAnalysis(AnalysisCache.java:261)
[spotbugs] At edu.umd.cs.findbugs.FindBugs2.buildReferencedClassSet(FindBugs2.java:806)
[spotbugs] At edu.umd.cs.findbugs.FindBugs2.execute(FindBugs2.java:249)
[spotbugs] At edu.umd.cs.findbugs.FindBugs.runMain(FindBugs.java:395)
[spotbugs] At edu.umd.cs.findbugs.FindBugs2.main(FindBugs2.java:1231)
[spotbugs] Couldn't get class info for java/awt/AlphaComposite
[spotbugs] java.lang.IllegalArgumentException: Unsupported class file major version 68
[spotbugs] At org.objectweb.asm.ClassReader.<init>(ClassReader.java:200)
[spotbugs] At org.objectweb.asm.ClassReader.<init>(ClassReader.java:180)
[spotbugs] At org.objectweb.asm.ClassReader.<init>(ClassReader.java:166)
[spotbugs] At edu.umd.cs.findbugs.asm.FBClassReader.<init>(FBClassReader.java:35)
[spotbugs] At edu.umd.cs.findbugs.classfile.engine.asm.ClassReaderAnalysisEngine.analyze(ClassReaderAnalysisEngine.java:48)
[spotbugs] At edu.umd.cs.findbugs.classfile.engine.asm.ClassReaderAnalysisEngine.analyze(ClassReaderAnalysisEngine.java:34)
[spotbugs] At edu.umd.cs.findbugs.classfile.impl.AnalysisCache.getClassAnalysis(AnalysisCache.java:261)
[spotbugs] At edu.umd.cs.findbugs.classfile.engine.ClassInfoAnalysisEngine.analyze(ClassInfoAnalysisEngine.java:75)
[spotbugs] At edu.umd.cs.findbugs.classfile.engine.ClassInfoAnalysisEngine.analyze(ClassInfoAnalysisEngine.java:38)
[spotbugs] At edu.umd.cs.findbugs.classfile.impl.AnalysisCache.getClassAnalysis(AnalysisCache.java:261)
[spotbugs] At edu.umd.cs.findbugs.ba.XFactory.getXClass(XFactory.java:693)
[spotbugs] At edu.umd.cs.findbugs.ba.AnalysisContext.setAppClassList(AnalysisContext.java:975)
[spotbugs] At edu.umd.cs.findbugs.FindBugs2.setAppClassList(FindBugs2.java:909)
[spotbugs] At edu.umd.cs.findbugs.FindBugs2.execute(FindBugs2.java:252)
[spotbugs] At edu.umd.cs.findbugs.FindBugs.runMain(FindBugs.java:395)
[spotbugs] At edu.umd.cs.findbugs.FindBugs2.main(FindBugs2.java:1231)
[spotbugs] Couldn't get class info for java/awt/geom/Arc2D
[spotbugs] java.lang.IllegalArgumentException: Unsupported class file major version 68
[spotbugs] At org.objectweb.asm.ClassReader.<init>(ClassReader.java:200)
[spotbugs] At org.objectweb.asm.ClassReader.<init>(ClassReader.java:180)
[spotbugs] At org.objectweb.asm.ClassReader.<init>(ClassReader.java:166)
[spotbugs] At edu.umd.cs.findbugs.asm.FBClassReader.<init>(FBClassReader.java:35)
[spotbugs] At edu.umd.cs.findbugs.classfile.engine.asm.ClassReaderAnalysisEngine.analyze(ClassReaderAnalysisEngine.java:48)
[spotbugs] At edu.umd.cs.findbugs.classfile.engine.asm.ClassReaderAnalysisEngine.analyze(ClassReaderAnalysisEngine.java:34)
[spotbugs] At edu.umd.cs.findbugs.classfile.impl.AnalysisCache.getClassAnalysis(AnalysisCache.java:261)
[spotbugs] At edu.umd.cs.findbugs.classfile.engine.ClassInfoAnalysisEngine.analyze(ClassInfoAnalysisEngine.java:75)
[spotbugs] At edu.umd.cs.findbugs.classfile.engine.ClassInfoAnalysisEngine.analyze(ClassInfoAnalysisEngine.java:38)
[spotbugs] At edu.umd.cs.findbugs.classfile.impl.AnalysisCache.getClassAnalysis(AnalysisCache.java:261)
[spotbugs] At edu.umd.cs.findbugs.ba.XFactory.getXClass(XFactory.java:693)
[spotbugs] At edu.umd.cs.findbugs.ba.AnalysisContext.setAppClassList(AnalysisContext.java:975)
[spotbugs] At edu.umd.cs.findbugs.FindBugs2.setAppClassList(FindBugs2.java:909)
[spotbugs] At edu.umd.cs.findbugs.FindBugs2.execute(FindBugs2.java:252)
[spotbugs] At edu.umd.cs.findbugs.FindBugs.runMain(FindBugs.java:395)
[spotbugs] At edu.umd.cs.findbugs.FindBugs2.main(FindBugs2.java:1231)
[spotbugs] Couldn't get class info for java/security/DigestException
[spotbugs] java.lang.IllegalArgumentException: Unsupported class file major version 68
[spotbugs] At org.objectweb.asm.ClassReader.<init>(ClassReader.java:200)
[spotbugs] At org.objectweb.asm.ClassReader.<init>(ClassReader.java:180)
[spotbugs] At org.objectweb.asm.ClassReader.<init>(ClassReader.java:166)
[spotbugs] At edu.umd.cs.findbugs.asm.FBClassReader.<init>(FBClassReader.java:35)
[spotbugs] At edu.umd.cs.findbugs.classfile.engine.asm.ClassReaderAnalysisEngine.analyze(ClassReaderAnalysisEngine.java:48)
[spotbugs] At edu.umd.cs.findbugs.classfile.engine.asm.ClassReaderAnalysisEngine.analyze(ClassReaderAnalysisEngine.java:34)
[spotbugs] At edu.umd.cs.findbugs.classfile.impl.AnalysisCache.getClassAnalysis(AnalysisCache.java:261)
[spotbugs] At edu.umd.cs.findbugs.classfile.engine.ClassInfoAnalysisEngine.analyze(ClassInfoAnalysisEngine.java:75)
[spotbugs] At edu.umd.cs.findbugs.classfile.engine.ClassInfoAnalysisEngine.analyze(ClassInfoAnalysisEngine.java:38)
[spotbugs] At edu.umd.cs.findbugs.classfile.impl.AnalysisCache.getClassAnalysis(AnalysisCache.java:261)
[spotbugs] At edu.umd.cs.findbugs.ba.XFactory.getXClass(XFactory.java:693)
[spotbugs] At edu.umd.cs.findbugs.ba.AnalysisContext.setAppClassList(AnalysisContext.java:975)
[spotbugs] At edu.umd.cs.findbugs.FindBugs2.setAppClassList(FindBugs2.java:909)
[spotbugs] At edu.umd.cs.findbugs.FindBugs2.execute(FindBugs2.java:252)
[spotbugs] At edu.umd.cs.findbugs.FindBugs.runMain(FindBugs.java:395)
[spotbugs] At edu.umd.cs.findbugs.FindBugs2.main(FindBugs2.java:1231)
[spotbugs]
[spotbugs] java.lang.IllegalArgumentException: Unsupported class file major version 68
[spotbugs] at org.objectweb.asm.ClassReader.<init>(ClassReader.java:200)
[spotbugs] at org.objectweb.asm.ClassReader.<init>(ClassReader.java:180)
[spotbugs] at org.objectweb.asm.ClassReader.<init>(ClassReader.java:166)
[spotbugs] at edu.umd.cs.findbugs.asm.FBClassReader.<init>(FBClassReader.java:35)
[spotbugs] at edu.umd.cs.findbugs.classfile.engine.asm.ClassReaderAnalysisEngine.analyze(ClassReaderAnalysisEngine.java:48)
[spotbugs] at edu.umd.cs.findbugs.classfile.engine.asm.ClassReaderAnalysisEngine.analyze(ClassReaderAnalysisEngine.java:34)
[spotbugs] at edu.umd.cs.findbugs.classfile.impl.AnalysisCache.getClassAnalysis(AnalysisCache.java:261)
[spotbugs] at edu.umd.cs.findbugs.classfile.engine.ClassInfoAnalysisEngine.analyze(ClassInfoAnalysisEngine.java:75)
[spotbugs] at edu.umd.cs.findbugs.classfile.engine.ClassInfoAnalysisEngine.analyze(ClassInfoAnalysisEngine.java:38)
[spotbugs] at edu.umd.cs.findbugs.classfile.impl.AnalysisCache.getClassAnalysis(AnalysisCache.java:261)
[spotbugs] at edu.umd.cs.findbugs.ba.XFactory.getXClass(XFactory.java:693)
[spotbugs] at edu.umd.cs.findbugs.ba.AnalysisContext.setAppClassList(AnalysisContext.java:975)
[spotbugs] at edu.umd.cs.findbugs.FindBugs2.setAppClassList(FindBugs2.java:909)
[spotbugs] at edu.umd.cs.findbugs.FindBugs2.execute(FindBugs2.java:252)
[spotbugs] at edu.umd.cs.findbugs.FindBugs.runMain(FindBugs.java:395)
[spotbugs] at edu.umd.cs.findbugs.FindBugs2.main(FindBugs2.java:1231)
[spotbugs] Java Result: 4
BUILD FAILED
<https://ci-builds.apache.org/job/POI/job/POI-DSL-1.24/ws/build.xml>:2651: Execution of SpotBugs failed.
Total time: 28 minutes 40 seconds
Build step 'Invoke Ant' marked build as failure
ERROR: Not all environment variables could be successfully injected. Check for similarly-named environment variables.
Archiving artifacts
ERROR: Not all environment variables could be successfully injected. Check for similarly-named environment variables.
Recording test results
ERROR: Not all environment variables could be successfully injected. Check for similarly-named environment variables.
[Checks API] No suitable checks publisher found.
ERROR: Not all environment variables could be successfully injected. Check for similarly-named environment variables.
---------------------------------------------------------------------
To unsubscribe, e-mail: dev-unsubscribe@poi.apache.org
For additional commands, e-mail: dev-help@poi.apache.org
Build failed in Jenkins: POI » POI-DSL-1.24 #14
Posted by Apache Jenkins Server <je...@builds.apache.org>.
See <https://ci-builds.apache.org/job/POI/job/POI-DSL-1.24/14/display/redirect?page=changes>
Changes:
[PJ Fanning] fix problem test (SXXSF)
[PJ Fanning] fix problem test (SXXSF)
[PJ Fanning] temp disable problem test (XSSF)
[PJ Fanning] temp disable problem test (SXXSF)
[PJ Fanning] fix some of the broken tests
[PJ Fanning] fix some of the broken tests
[PJ Fanning] fix some of the broken tests
[PJ Fanning] allow context to be set in XSSFSheet copyRows
[PJ Fanning] refactor cell toString to use DataFormatter
[PJ Fanning] [bug-69583] DateUtil needs to handle time only dates (issue with 1900 format dates)
[PJ Fanning] update changes
[PJ Fanning] format
[PJ Fanning] [bug-69583] when copying cells with dates - prefer using the numeric data directly
[PJ Fanning] add some doc
[PJ Fanning] [bug-69583] when copying cells with dates - prefer using the numeric data directly
[PJ Fanning] remove line
[PJ Fanning] gradle 8.12.1
------------------------------------------
[...truncated 9.99 MiB...]
[spotbugs] At edu.umd.cs.findbugs.FindBugs2.execute(FindBugs2.java:252)
[spotbugs] At edu.umd.cs.findbugs.FindBugs.runMain(FindBugs.java:395)
[spotbugs] At edu.umd.cs.findbugs.FindBugs2.main(FindBugs2.java:1231)
[spotbugs] Couldn't get class info for java/util/regex/MatchResult
[spotbugs] java.lang.IllegalArgumentException: Unsupported class file major version 68
[spotbugs] At org.objectweb.asm.ClassReader.<init>(ClassReader.java:200)
[spotbugs] At org.objectweb.asm.ClassReader.<init>(ClassReader.java:180)
[spotbugs] At org.objectweb.asm.ClassReader.<init>(ClassReader.java:166)
[spotbugs] At edu.umd.cs.findbugs.asm.FBClassReader.<init>(FBClassReader.java:35)
[spotbugs] At edu.umd.cs.findbugs.classfile.engine.asm.ClassReaderAnalysisEngine.analyze(ClassReaderAnalysisEngine.java:48)
[spotbugs] At edu.umd.cs.findbugs.classfile.engine.asm.ClassReaderAnalysisEngine.analyze(ClassReaderAnalysisEngine.java:34)
[spotbugs] At edu.umd.cs.findbugs.classfile.impl.AnalysisCache.getClassAnalysis(AnalysisCache.java:261)
[spotbugs] At edu.umd.cs.findbugs.classfile.engine.ClassInfoAnalysisEngine.analyze(ClassInfoAnalysisEngine.java:75)
[spotbugs] At edu.umd.cs.findbugs.classfile.engine.ClassInfoAnalysisEngine.analyze(ClassInfoAnalysisEngine.java:38)
[spotbugs] At edu.umd.cs.findbugs.classfile.impl.AnalysisCache.getClassAnalysis(AnalysisCache.java:261)
[spotbugs] At edu.umd.cs.findbugs.ba.XFactory.getXClass(XFactory.java:693)
[spotbugs] At edu.umd.cs.findbugs.ba.AnalysisContext.setAppClassList(AnalysisContext.java:975)
[spotbugs] At edu.umd.cs.findbugs.FindBugs2.setAppClassList(FindBugs2.java:909)
[spotbugs] At edu.umd.cs.findbugs.FindBugs2.execute(FindBugs2.java:252)
[spotbugs] At edu.umd.cs.findbugs.FindBugs.runMain(FindBugs.java:395)
[spotbugs] At edu.umd.cs.findbugs.FindBugs2.main(FindBugs2.java:1231)
[spotbugs] Couldn't get class info for javax/xml/crypto/dsig/spec/SignatureMethodParameterSpec
[spotbugs] java.lang.IllegalArgumentException: Unsupported class file major version 68
[spotbugs] At org.objectweb.asm.ClassReader.<init>(ClassReader.java:200)
[spotbugs] At org.objectweb.asm.ClassReader.<init>(ClassReader.java:180)
[spotbugs] At org.objectweb.asm.ClassReader.<init>(ClassReader.java:166)
[spotbugs] At edu.umd.cs.findbugs.asm.FBClassReader.<init>(FBClassReader.java:35)
[spotbugs] At edu.umd.cs.findbugs.classfile.engine.asm.ClassReaderAnalysisEngine.analyze(ClassReaderAnalysisEngine.java:48)
[spotbugs] At edu.umd.cs.findbugs.classfile.engine.asm.ClassReaderAnalysisEngine.analyze(ClassReaderAnalysisEngine.java:34)
[spotbugs] At edu.umd.cs.findbugs.classfile.impl.AnalysisCache.getClassAnalysis(AnalysisCache.java:261)
[spotbugs] At edu.umd.cs.findbugs.classfile.engine.ClassInfoAnalysisEngine.analyze(ClassInfoAnalysisEngine.java:75)
[spotbugs] At edu.umd.cs.findbugs.classfile.engine.ClassInfoAnalysisEngine.analyze(ClassInfoAnalysisEngine.java:38)
[spotbugs] At edu.umd.cs.findbugs.classfile.impl.AnalysisCache.getClassAnalysis(AnalysisCache.java:261)
[spotbugs] At edu.umd.cs.findbugs.ba.XFactory.getXClass(XFactory.java:693)
[spotbugs] At edu.umd.cs.findbugs.ba.AnalysisContext.setAppClassList(AnalysisContext.java:975)
[spotbugs] At edu.umd.cs.findbugs.FindBugs2.setAppClassList(FindBugs2.java:909)
[spotbugs] At edu.umd.cs.findbugs.FindBugs2.execute(FindBugs2.java:252)
[spotbugs] At edu.umd.cs.findbugs.FindBugs.runMain(FindBugs.java:395)
[spotbugs] At edu.umd.cs.findbugs.FindBugs2.main(FindBugs2.java:1231)
[spotbugs] Couldn't get class info for java/util/Random
[spotbugs] java.lang.IllegalArgumentException: Unsupported class file major version 68
[spotbugs] At org.objectweb.asm.ClassReader.<init>(ClassReader.java:200)
[spotbugs] At org.objectweb.asm.ClassReader.<init>(ClassReader.java:180)
[spotbugs] At org.objectweb.asm.ClassReader.<init>(ClassReader.java:166)
[spotbugs] At edu.umd.cs.findbugs.asm.FBClassReader.<init>(FBClassReader.java:35)
[spotbugs] At edu.umd.cs.findbugs.classfile.engine.asm.ClassReaderAnalysisEngine.analyze(ClassReaderAnalysisEngine.java:48)
[spotbugs] At edu.umd.cs.findbugs.classfile.engine.asm.ClassReaderAnalysisEngine.analyze(ClassReaderAnalysisEngine.java:34)
[spotbugs] At edu.umd.cs.findbugs.classfile.impl.AnalysisCache.getClassAnalysis(AnalysisCache.java:261)
[spotbugs] At edu.umd.cs.findbugs.classfile.engine.ClassInfoAnalysisEngine.analyze(ClassInfoAnalysisEngine.java:75)
[spotbugs] At edu.umd.cs.findbugs.classfile.engine.ClassInfoAnalysisEngine.analyze(ClassInfoAnalysisEngine.java:38)
[spotbugs] At edu.umd.cs.findbugs.classfile.impl.AnalysisCache.getClassAnalysis(AnalysisCache.java:261)
[spotbugs] At edu.umd.cs.findbugs.ba.XFactory.getXClass(XFactory.java:693)
[spotbugs] At edu.umd.cs.findbugs.ba.AnalysisContext.setAppClassList(AnalysisContext.java:975)
[spotbugs] At edu.umd.cs.findbugs.FindBugs2.setAppClassList(FindBugs2.java:909)
[spotbugs] At edu.umd.cs.findbugs.FindBugs2.execute(FindBugs2.java:252)
[spotbugs] At edu.umd.cs.findbugs.FindBugs.runMain(FindBugs.java:395)
[spotbugs] At edu.umd.cs.findbugs.FindBugs2.main(FindBugs2.java:1231)
[spotbugs] Couldn't get class info for java/nio/file/attribute/BasicFileAttributes
[spotbugs] java.lang.IllegalArgumentException: Unsupported class file major version 68
[spotbugs] At org.objectweb.asm.ClassReader.<init>(ClassReader.java:200)
[spotbugs] At org.objectweb.asm.ClassReader.<init>(ClassReader.java:180)
[spotbugs] At org.objectweb.asm.ClassReader.<init>(ClassReader.java:166)
[spotbugs] At edu.umd.cs.findbugs.asm.FBClassReader.<init>(FBClassReader.java:35)
[spotbugs] At edu.umd.cs.findbugs.classfile.engine.asm.ClassReaderAnalysisEngine.analyze(ClassReaderAnalysisEngine.java:48)
[spotbugs] At edu.umd.cs.findbugs.classfile.engine.asm.ClassReaderAnalysisEngine.analyze(ClassReaderAnalysisEngine.java:34)
[spotbugs] At edu.umd.cs.findbugs.classfile.impl.AnalysisCache.getClassAnalysis(AnalysisCache.java:261)
[spotbugs] At edu.umd.cs.findbugs.classfile.engine.ClassInfoAnalysisEngine.analyze(ClassInfoAnalysisEngine.java:75)
[spotbugs] At edu.umd.cs.findbugs.classfile.engine.ClassInfoAnalysisEngine.analyze(ClassInfoAnalysisEngine.java:38)
[spotbugs] At edu.umd.cs.findbugs.classfile.impl.AnalysisCache.getClassAnalysis(AnalysisCache.java:261)
[spotbugs] At edu.umd.cs.findbugs.ba.XFactory.getXClass(XFactory.java:693)
[spotbugs] At edu.umd.cs.findbugs.ba.AnalysisContext.setAppClassList(AnalysisContext.java:975)
[spotbugs] At edu.umd.cs.findbugs.FindBugs2.setAppClassList(FindBugs2.java:909)
[spotbugs] At edu.umd.cs.findbugs.FindBugs2.execute(FindBugs2.java:252)
[spotbugs] At edu.umd.cs.findbugs.FindBugs.runMain(FindBugs.java:395)
[spotbugs] At edu.umd.cs.findbugs.FindBugs2.main(FindBugs2.java:1231)
[spotbugs] Couldn't get class info for java/util/Locale
[spotbugs] java.lang.IllegalArgumentException: Unsupported class file major version 68
[spotbugs] At org.objectweb.asm.ClassReader.<init>(ClassReader.java:200)
[spotbugs] At org.objectweb.asm.ClassReader.<init>(ClassReader.java:180)
[spotbugs] At org.objectweb.asm.ClassReader.<init>(ClassReader.java:166)
[spotbugs] At edu.umd.cs.findbugs.asm.FBClassReader.<init>(FBClassReader.java:35)
[spotbugs] At edu.umd.cs.findbugs.classfile.engine.asm.ClassReaderAnalysisEngine.analyze(ClassReaderAnalysisEngine.java:48)
[spotbugs] At edu.umd.cs.findbugs.classfile.engine.asm.ClassReaderAnalysisEngine.analyze(ClassReaderAnalysisEngine.java:34)
[spotbugs] At edu.umd.cs.findbugs.classfile.impl.AnalysisCache.getClassAnalysis(AnalysisCache.java:261)
[spotbugs] At edu.umd.cs.findbugs.classfile.engine.ClassInfoAnalysisEngine.analyze(ClassInfoAnalysisEngine.java:75)
[spotbugs] At edu.umd.cs.findbugs.classfile.engine.ClassInfoAnalysisEngine.analyze(ClassInfoAnalysisEngine.java:38)
[spotbugs] At edu.umd.cs.findbugs.classfile.impl.AnalysisCache.getClassAnalysis(AnalysisCache.java:261)
[spotbugs] At edu.umd.cs.findbugs.ba.XFactory.getXClass(XFactory.java:693)
[spotbugs] At edu.umd.cs.findbugs.ba.AnalysisContext.setAppClassList(AnalysisContext.java:975)
[spotbugs] At edu.umd.cs.findbugs.FindBugs2.setAppClassList(FindBugs2.java:909)
[spotbugs] At edu.umd.cs.findbugs.FindBugs2.execute(FindBugs2.java:252)
[spotbugs] At edu.umd.cs.findbugs.FindBugs.runMain(FindBugs.java:395)
[spotbugs] At edu.umd.cs.findbugs.FindBugs2.main(FindBugs2.java:1231)
[spotbugs] Couldn't get class info for java/util/zip/Deflater
[spotbugs] java.lang.IllegalArgumentException: Unsupported class file major version 68
[spotbugs] At org.objectweb.asm.ClassReader.<init>(ClassReader.java:200)
[spotbugs] At org.objectweb.asm.ClassReader.<init>(ClassReader.java:180)
[spotbugs] At org.objectweb.asm.ClassReader.<init>(ClassReader.java:166)
[spotbugs] At edu.umd.cs.findbugs.asm.FBClassReader.<init>(FBClassReader.java:35)
[spotbugs] At edu.umd.cs.findbugs.classfile.engine.asm.ClassReaderAnalysisEngine.analyze(ClassReaderAnalysisEngine.java:48)
[spotbugs] At edu.umd.cs.findbugs.classfile.engine.asm.ClassReaderAnalysisEngine.analyze(ClassReaderAnalysisEngine.java:34)
[spotbugs] At edu.umd.cs.findbugs.classfile.impl.AnalysisCache.getClassAnalysis(AnalysisCache.java:261)
[spotbugs] At edu.umd.cs.findbugs.classfile.engine.ClassInfoAnalysisEngine.analyze(ClassInfoAnalysisEngine.java:75)
[spotbugs] At edu.umd.cs.findbugs.classfile.engine.ClassInfoAnalysisEngine.analyze(ClassInfoAnalysisEngine.java:38)
[spotbugs] At edu.umd.cs.findbugs.classfile.impl.AnalysisCache.getClassAnalysis(AnalysisCache.java:261)
[spotbugs] At edu.umd.cs.findbugs.ba.XFactory.getXClass(XFactory.java:693)
[spotbugs] At edu.umd.cs.findbugs.ba.AnalysisContext.setAppClassList(AnalysisContext.java:975)
[spotbugs] At edu.umd.cs.findbugs.FindBugs2.setAppClassList(FindBugs2.java:909)
[spotbugs] At edu.umd.cs.findbugs.FindBugs2.execute(FindBugs2.java:252)
[spotbugs] At edu.umd.cs.findbugs.FindBugs.runMain(FindBugs.java:395)
[spotbugs] At edu.umd.cs.findbugs.FindBugs2.main(FindBugs2.java:1231)
[spotbugs] Couldn't get class info for java/lang/AssertionError
[spotbugs] java.lang.IllegalArgumentException: Unsupported class file major version 68
[spotbugs] At org.objectweb.asm.ClassReader.<init>(ClassReader.java:200)
[spotbugs] At org.objectweb.asm.ClassReader.<init>(ClassReader.java:180)
[spotbugs] At org.objectweb.asm.ClassReader.<init>(ClassReader.java:166)
[spotbugs] At edu.umd.cs.findbugs.asm.FBClassReader.<init>(FBClassReader.java:35)
[spotbugs] At edu.umd.cs.findbugs.classfile.engine.asm.ClassReaderAnalysisEngine.analyze(ClassReaderAnalysisEngine.java:48)
[spotbugs] At edu.umd.cs.findbugs.classfile.engine.asm.ClassReaderAnalysisEngine.analyze(ClassReaderAnalysisEngine.java:34)
[spotbugs] At edu.umd.cs.findbugs.classfile.impl.AnalysisCache.getClassAnalysis(AnalysisCache.java:261)
[spotbugs] At edu.umd.cs.findbugs.classfile.engine.ClassInfoAnalysisEngine.analyze(ClassInfoAnalysisEngine.java:75)
[spotbugs] At edu.umd.cs.findbugs.classfile.engine.ClassInfoAnalysisEngine.analyze(ClassInfoAnalysisEngine.java:38)
[spotbugs] At edu.umd.cs.findbugs.classfile.impl.AnalysisCache.getClassAnalysis(AnalysisCache.java:261)
[spotbugs] At edu.umd.cs.findbugs.ba.XFactory.getXClass(XFactory.java:693)
[spotbugs] At edu.umd.cs.findbugs.ba.AnalysisContext.setAppClassList(AnalysisContext.java:975)
[spotbugs] At edu.umd.cs.findbugs.FindBugs2.setAppClassList(FindBugs2.java:909)
[spotbugs] At edu.umd.cs.findbugs.FindBugs2.execute(FindBugs2.java:252)
[spotbugs] At edu.umd.cs.findbugs.FindBugs.runMain(FindBugs.java:395)
[spotbugs] At edu.umd.cs.findbugs.FindBugs2.main(FindBugs2.java:1231)
[spotbugs] Couldn't get class info for java/util/Set
[spotbugs] java.lang.IllegalArgumentException: Unsupported class file major version 68
[spotbugs] At org.objectweb.asm.ClassReader.<init>(ClassReader.java:200)
[spotbugs] At org.objectweb.asm.ClassReader.<init>(ClassReader.java:180)
[spotbugs] At org.objectweb.asm.ClassReader.<init>(ClassReader.java:166)
[spotbugs] At edu.umd.cs.findbugs.asm.FBClassReader.<init>(FBClassReader.java:35)
[spotbugs] At edu.umd.cs.findbugs.classfile.engine.asm.ClassReaderAnalysisEngine.analyze(ClassReaderAnalysisEngine.java:48)
[spotbugs] At edu.umd.cs.findbugs.classfile.engine.asm.ClassReaderAnalysisEngine.analyze(ClassReaderAnalysisEngine.java:34)
[spotbugs] At edu.umd.cs.findbugs.classfile.impl.AnalysisCache.getClassAnalysis(AnalysisCache.java:261)
[spotbugs] At edu.umd.cs.findbugs.classfile.engine.ClassInfoAnalysisEngine.analyze(ClassInfoAnalysisEngine.java:75)
[spotbugs] At edu.umd.cs.findbugs.classfile.engine.ClassInfoAnalysisEngine.analyze(ClassInfoAnalysisEngine.java:38)
[spotbugs] At edu.umd.cs.findbugs.classfile.impl.AnalysisCache.getClassAnalysis(AnalysisCache.java:261)
[spotbugs] At edu.umd.cs.findbugs.ba.XFactory.getXClass(XFactory.java:693)
[spotbugs] At edu.umd.cs.findbugs.ba.AnalysisContext.setAppClassList(AnalysisContext.java:975)
[spotbugs] At edu.umd.cs.findbugs.FindBugs2.setAppClassList(FindBugs2.java:909)
[spotbugs] At edu.umd.cs.findbugs.FindBugs2.execute(FindBugs2.java:252)
[spotbugs] At edu.umd.cs.findbugs.FindBugs.runMain(FindBugs.java:395)
[spotbugs] At edu.umd.cs.findbugs.FindBugs2.main(FindBugs2.java:1231)
[spotbugs] Couldn't get class info for java/io/FilterInputStream
[spotbugs] java.lang.IllegalArgumentException: Unsupported class file major version 68
[spotbugs] At org.objectweb.asm.ClassReader.<init>(ClassReader.java:200)
[spotbugs] At org.objectweb.asm.ClassReader.<init>(ClassReader.java:180)
[spotbugs] At org.objectweb.asm.ClassReader.<init>(ClassReader.java:166)
[spotbugs] At edu.umd.cs.findbugs.asm.FBClassReader.<init>(FBClassReader.java:35)
[spotbugs] At edu.umd.cs.findbugs.classfile.engine.asm.ClassReaderAnalysisEngine.analyze(ClassReaderAnalysisEngine.java:48)
[spotbugs] At edu.umd.cs.findbugs.classfile.engine.asm.ClassReaderAnalysisEngine.analyze(ClassReaderAnalysisEngine.java:34)
[spotbugs] At edu.umd.cs.findbugs.classfile.impl.AnalysisCache.getClassAnalysis(AnalysisCache.java:261)
[spotbugs] At edu.umd.cs.findbugs.classfile.engine.ClassInfoAnalysisEngine.analyze(ClassInfoAnalysisEngine.java:75)
[spotbugs] At edu.umd.cs.findbugs.classfile.engine.ClassInfoAnalysisEngine.analyze(ClassInfoAnalysisEngine.java:38)
[spotbugs] At edu.umd.cs.findbugs.classfile.impl.AnalysisCache.getClassAnalysis(AnalysisCache.java:261)
[spotbugs] At edu.umd.cs.findbugs.FindBugs2.buildReferencedClassSet(FindBugs2.java:806)
[spotbugs] At edu.umd.cs.findbugs.FindBugs2.execute(FindBugs2.java:249)
[spotbugs] At edu.umd.cs.findbugs.FindBugs.runMain(FindBugs.java:395)
[spotbugs] At edu.umd.cs.findbugs.FindBugs2.main(FindBugs2.java:1231)
[spotbugs] Couldn't get class info for java/awt/AlphaComposite
[spotbugs] java.lang.IllegalArgumentException: Unsupported class file major version 68
[spotbugs] At org.objectweb.asm.ClassReader.<init>(ClassReader.java:200)
[spotbugs] At org.objectweb.asm.ClassReader.<init>(ClassReader.java:180)
[spotbugs] At org.objectweb.asm.ClassReader.<init>(ClassReader.java:166)
[spotbugs] At edu.umd.cs.findbugs.asm.FBClassReader.<init>(FBClassReader.java:35)
[spotbugs] At edu.umd.cs.findbugs.classfile.engine.asm.ClassReaderAnalysisEngine.analyze(ClassReaderAnalysisEngine.java:48)
[spotbugs] At edu.umd.cs.findbugs.classfile.engine.asm.ClassReaderAnalysisEngine.analyze(ClassReaderAnalysisEngine.java:34)
[spotbugs] At edu.umd.cs.findbugs.classfile.impl.AnalysisCache.getClassAnalysis(AnalysisCache.java:261)
[spotbugs] At edu.umd.cs.findbugs.classfile.engine.ClassInfoAnalysisEngine.analyze(ClassInfoAnalysisEngine.java:75)
[spotbugs] At edu.umd.cs.findbugs.classfile.engine.ClassInfoAnalysisEngine.analyze(ClassInfoAnalysisEngine.java:38)
[spotbugs] At edu.umd.cs.findbugs.classfile.impl.AnalysisCache.getClassAnalysis(AnalysisCache.java:261)
[spotbugs] At edu.umd.cs.findbugs.ba.XFactory.getXClass(XFactory.java:693)
[spotbugs] At edu.umd.cs.findbugs.ba.AnalysisContext.setAppClassList(AnalysisContext.java:975)
[spotbugs] At edu.umd.cs.findbugs.FindBugs2.setAppClassList(FindBugs2.java:909)
[spotbugs] At edu.umd.cs.findbugs.FindBugs2.execute(FindBugs2.java:252)
[spotbugs] At edu.umd.cs.findbugs.FindBugs.runMain(FindBugs.java:395)
[spotbugs] At edu.umd.cs.findbugs.FindBugs2.main(FindBugs2.java:1231)
[spotbugs] Couldn't get class info for java/awt/geom/Arc2D
[spotbugs] java.lang.IllegalArgumentException: Unsupported class file major version 68
[spotbugs] At org.objectweb.asm.ClassReader.<init>(ClassReader.java:200)
[spotbugs] At org.objectweb.asm.ClassReader.<init>(ClassReader.java:180)
[spotbugs] At org.objectweb.asm.ClassReader.<init>(ClassReader.java:166)
[spotbugs] At edu.umd.cs.findbugs.asm.FBClassReader.<init>(FBClassReader.java:35)
[spotbugs] At edu.umd.cs.findbugs.classfile.engine.asm.ClassReaderAnalysisEngine.analyze(ClassReaderAnalysisEngine.java:48)
[spotbugs] At edu.umd.cs.findbugs.classfile.engine.asm.ClassReaderAnalysisEngine.analyze(ClassReaderAnalysisEngine.java:34)
[spotbugs] At edu.umd.cs.findbugs.classfile.impl.AnalysisCache.getClassAnalysis(AnalysisCache.java:261)
[spotbugs] At edu.umd.cs.findbugs.classfile.engine.ClassInfoAnalysisEngine.analyze(ClassInfoAnalysisEngine.java:75)
[spotbugs] At edu.umd.cs.findbugs.classfile.engine.ClassInfoAnalysisEngine.analyze(ClassInfoAnalysisEngine.java:38)
[spotbugs] At edu.umd.cs.findbugs.classfile.impl.AnalysisCache.getClassAnalysis(AnalysisCache.java:261)
[spotbugs] At edu.umd.cs.findbugs.ba.XFactory.getXClass(XFactory.java:693)
[spotbugs] At edu.umd.cs.findbugs.ba.AnalysisContext.setAppClassList(AnalysisContext.java:975)
[spotbugs] At edu.umd.cs.findbugs.FindBugs2.setAppClassList(FindBugs2.java:909)
[spotbugs] At edu.umd.cs.findbugs.FindBugs2.execute(FindBugs2.java:252)
[spotbugs] At edu.umd.cs.findbugs.FindBugs.runMain(FindBugs.java:395)
[spotbugs] At edu.umd.cs.findbugs.FindBugs2.main(FindBugs2.java:1231)
[spotbugs] Couldn't get class info for java/security/DigestException
[spotbugs] java.lang.IllegalArgumentException: Unsupported class file major version 68
[spotbugs] At org.objectweb.asm.ClassReader.<init>(ClassReader.java:200)
[spotbugs] At org.objectweb.asm.ClassReader.<init>(ClassReader.java:180)
[spotbugs] At org.objectweb.asm.ClassReader.<init>(ClassReader.java:166)
[spotbugs] At edu.umd.cs.findbugs.asm.FBClassReader.<init>(FBClassReader.java:35)
[spotbugs] At edu.umd.cs.findbugs.classfile.engine.asm.ClassReaderAnalysisEngine.analyze(ClassReaderAnalysisEngine.java:48)
[spotbugs] At edu.umd.cs.findbugs.classfile.engine.asm.ClassReaderAnalysisEngine.analyze(ClassReaderAnalysisEngine.java:34)
[spotbugs] At edu.umd.cs.findbugs.classfile.impl.AnalysisCache.getClassAnalysis(AnalysisCache.java:261)
[spotbugs] At edu.umd.cs.findbugs.classfile.engine.ClassInfoAnalysisEngine.analyze(ClassInfoAnalysisEngine.java:75)
[spotbugs] At edu.umd.cs.findbugs.classfile.engine.ClassInfoAnalysisEngine.analyze(ClassInfoAnalysisEngine.java:38)
[spotbugs] At edu.umd.cs.findbugs.classfile.impl.AnalysisCache.getClassAnalysis(AnalysisCache.java:261)
[spotbugs] At edu.umd.cs.findbugs.ba.XFactory.getXClass(XFactory.java:693)
[spotbugs] At edu.umd.cs.findbugs.ba.AnalysisContext.setAppClassList(AnalysisContext.java:975)
[spotbugs] At edu.umd.cs.findbugs.FindBugs2.setAppClassList(FindBugs2.java:909)
[spotbugs] At edu.umd.cs.findbugs.FindBugs2.execute(FindBugs2.java:252)
[spotbugs] At edu.umd.cs.findbugs.FindBugs.runMain(FindBugs.java:395)
[spotbugs] At edu.umd.cs.findbugs.FindBugs2.main(FindBugs2.java:1231)
[spotbugs]
[spotbugs] java.lang.IllegalArgumentException: Unsupported class file major version 68
[spotbugs] at org.objectweb.asm.ClassReader.<init>(ClassReader.java:200)
[spotbugs] at org.objectweb.asm.ClassReader.<init>(ClassReader.java:180)
[spotbugs] at org.objectweb.asm.ClassReader.<init>(ClassReader.java:166)
[spotbugs] at edu.umd.cs.findbugs.asm.FBClassReader.<init>(FBClassReader.java:35)
[spotbugs] at edu.umd.cs.findbugs.classfile.engine.asm.ClassReaderAnalysisEngine.analyze(ClassReaderAnalysisEngine.java:48)
[spotbugs] at edu.umd.cs.findbugs.classfile.engine.asm.ClassReaderAnalysisEngine.analyze(ClassReaderAnalysisEngine.java:34)
[spotbugs] at edu.umd.cs.findbugs.classfile.impl.AnalysisCache.getClassAnalysis(AnalysisCache.java:261)
[spotbugs] at edu.umd.cs.findbugs.classfile.engine.ClassInfoAnalysisEngine.analyze(ClassInfoAnalysisEngine.java:75)
[spotbugs] at edu.umd.cs.findbugs.classfile.engine.ClassInfoAnalysisEngine.analyze(ClassInfoAnalysisEngine.java:38)
[spotbugs] at edu.umd.cs.findbugs.classfile.impl.AnalysisCache.getClassAnalysis(AnalysisCache.java:261)
[spotbugs] at edu.umd.cs.findbugs.ba.XFactory.getXClass(XFactory.java:693)
[spotbugs] at edu.umd.cs.findbugs.ba.AnalysisContext.setAppClassList(AnalysisContext.java:975)
[spotbugs] at edu.umd.cs.findbugs.FindBugs2.setAppClassList(FindBugs2.java:909)
[spotbugs] at edu.umd.cs.findbugs.FindBugs2.execute(FindBugs2.java:252)
[spotbugs] at edu.umd.cs.findbugs.FindBugs.runMain(FindBugs.java:395)
[spotbugs] at edu.umd.cs.findbugs.FindBugs2.main(FindBugs2.java:1231)
[spotbugs] Java Result: 4
BUILD FAILED
<https://ci-builds.apache.org/job/POI/job/POI-DSL-1.24/ws/build.xml>:2651: Execution of SpotBugs failed.
Total time: 28 minutes 32 seconds
Build step 'Invoke Ant' marked build as failure
ERROR: Not all environment variables could be successfully injected. Check for similarly-named environment variables.
Archiving artifacts
ERROR: Not all environment variables could be successfully injected. Check for similarly-named environment variables.
Recording test results
ERROR: Not all environment variables could be successfully injected. Check for similarly-named environment variables.
[Checks API] No suitable checks publisher found.
ERROR: Not all environment variables could be successfully injected. Check for similarly-named environment variables.
---------------------------------------------------------------------
To unsubscribe, e-mail: dev-unsubscribe@poi.apache.org
For additional commands, e-mail: dev-help@poi.apache.org
Build failed in Jenkins: POI » POI-DSL-1.24 #13
Posted by Apache Jenkins Server <je...@builds.apache.org>.
See <https://ci-builds.apache.org/job/POI/job/POI-DSL-1.24/13/display/redirect?page=changes>
Changes:
[PJ Fanning] cyclonedx gradle
[PJ Fanning] [bug-69563] try to avoid int overflow in Zip64 code (probably just moves the problem somewhere else though)
------------------------------------------
[...truncated 9.39 MiB...]
[spotbugs] At edu.umd.cs.findbugs.FindBugs2.execute(FindBugs2.java:252)
[spotbugs] At edu.umd.cs.findbugs.FindBugs.runMain(FindBugs.java:395)
[spotbugs] At edu.umd.cs.findbugs.FindBugs2.main(FindBugs2.java:1231)
[spotbugs] Couldn't get class info for java/util/regex/MatchResult
[spotbugs] java.lang.IllegalArgumentException: Unsupported class file major version 68
[spotbugs] At org.objectweb.asm.ClassReader.<init>(ClassReader.java:200)
[spotbugs] At org.objectweb.asm.ClassReader.<init>(ClassReader.java:180)
[spotbugs] At org.objectweb.asm.ClassReader.<init>(ClassReader.java:166)
[spotbugs] At edu.umd.cs.findbugs.asm.FBClassReader.<init>(FBClassReader.java:35)
[spotbugs] At edu.umd.cs.findbugs.classfile.engine.asm.ClassReaderAnalysisEngine.analyze(ClassReaderAnalysisEngine.java:48)
[spotbugs] At edu.umd.cs.findbugs.classfile.engine.asm.ClassReaderAnalysisEngine.analyze(ClassReaderAnalysisEngine.java:34)
[spotbugs] At edu.umd.cs.findbugs.classfile.impl.AnalysisCache.getClassAnalysis(AnalysisCache.java:261)
[spotbugs] At edu.umd.cs.findbugs.classfile.engine.ClassInfoAnalysisEngine.analyze(ClassInfoAnalysisEngine.java:75)
[spotbugs] At edu.umd.cs.findbugs.classfile.engine.ClassInfoAnalysisEngine.analyze(ClassInfoAnalysisEngine.java:38)
[spotbugs] At edu.umd.cs.findbugs.classfile.impl.AnalysisCache.getClassAnalysis(AnalysisCache.java:261)
[spotbugs] At edu.umd.cs.findbugs.ba.XFactory.getXClass(XFactory.java:693)
[spotbugs] At edu.umd.cs.findbugs.ba.AnalysisContext.setAppClassList(AnalysisContext.java:975)
[spotbugs] At edu.umd.cs.findbugs.FindBugs2.setAppClassList(FindBugs2.java:909)
[spotbugs] At edu.umd.cs.findbugs.FindBugs2.execute(FindBugs2.java:252)
[spotbugs] At edu.umd.cs.findbugs.FindBugs.runMain(FindBugs.java:395)
[spotbugs] At edu.umd.cs.findbugs.FindBugs2.main(FindBugs2.java:1231)
[spotbugs] Couldn't get class info for javax/xml/crypto/dsig/spec/SignatureMethodParameterSpec
[spotbugs] java.lang.IllegalArgumentException: Unsupported class file major version 68
[spotbugs] At org.objectweb.asm.ClassReader.<init>(ClassReader.java:200)
[spotbugs] At org.objectweb.asm.ClassReader.<init>(ClassReader.java:180)
[spotbugs] At org.objectweb.asm.ClassReader.<init>(ClassReader.java:166)
[spotbugs] At edu.umd.cs.findbugs.asm.FBClassReader.<init>(FBClassReader.java:35)
[spotbugs] At edu.umd.cs.findbugs.classfile.engine.asm.ClassReaderAnalysisEngine.analyze(ClassReaderAnalysisEngine.java:48)
[spotbugs] At edu.umd.cs.findbugs.classfile.engine.asm.ClassReaderAnalysisEngine.analyze(ClassReaderAnalysisEngine.java:34)
[spotbugs] At edu.umd.cs.findbugs.classfile.impl.AnalysisCache.getClassAnalysis(AnalysisCache.java:261)
[spotbugs] At edu.umd.cs.findbugs.classfile.engine.ClassInfoAnalysisEngine.analyze(ClassInfoAnalysisEngine.java:75)
[spotbugs] At edu.umd.cs.findbugs.classfile.engine.ClassInfoAnalysisEngine.analyze(ClassInfoAnalysisEngine.java:38)
[spotbugs] At edu.umd.cs.findbugs.classfile.impl.AnalysisCache.getClassAnalysis(AnalysisCache.java:261)
[spotbugs] At edu.umd.cs.findbugs.ba.XFactory.getXClass(XFactory.java:693)
[spotbugs] At edu.umd.cs.findbugs.ba.AnalysisContext.setAppClassList(AnalysisContext.java:975)
[spotbugs] At edu.umd.cs.findbugs.FindBugs2.setAppClassList(FindBugs2.java:909)
[spotbugs] At edu.umd.cs.findbugs.FindBugs2.execute(FindBugs2.java:252)
[spotbugs] At edu.umd.cs.findbugs.FindBugs.runMain(FindBugs.java:395)
[spotbugs] At edu.umd.cs.findbugs.FindBugs2.main(FindBugs2.java:1231)
[spotbugs] Couldn't get class info for java/util/Random
[spotbugs] java.lang.IllegalArgumentException: Unsupported class file major version 68
[spotbugs] At org.objectweb.asm.ClassReader.<init>(ClassReader.java:200)
[spotbugs] At org.objectweb.asm.ClassReader.<init>(ClassReader.java:180)
[spotbugs] At org.objectweb.asm.ClassReader.<init>(ClassReader.java:166)
[spotbugs] At edu.umd.cs.findbugs.asm.FBClassReader.<init>(FBClassReader.java:35)
[spotbugs] At edu.umd.cs.findbugs.classfile.engine.asm.ClassReaderAnalysisEngine.analyze(ClassReaderAnalysisEngine.java:48)
[spotbugs] At edu.umd.cs.findbugs.classfile.engine.asm.ClassReaderAnalysisEngine.analyze(ClassReaderAnalysisEngine.java:34)
[spotbugs] At edu.umd.cs.findbugs.classfile.impl.AnalysisCache.getClassAnalysis(AnalysisCache.java:261)
[spotbugs] At edu.umd.cs.findbugs.classfile.engine.ClassInfoAnalysisEngine.analyze(ClassInfoAnalysisEngine.java:75)
[spotbugs] At edu.umd.cs.findbugs.classfile.engine.ClassInfoAnalysisEngine.analyze(ClassInfoAnalysisEngine.java:38)
[spotbugs] At edu.umd.cs.findbugs.classfile.impl.AnalysisCache.getClassAnalysis(AnalysisCache.java:261)
[spotbugs] At edu.umd.cs.findbugs.ba.XFactory.getXClass(XFactory.java:693)
[spotbugs] At edu.umd.cs.findbugs.ba.AnalysisContext.setAppClassList(AnalysisContext.java:975)
[spotbugs] At edu.umd.cs.findbugs.FindBugs2.setAppClassList(FindBugs2.java:909)
[spotbugs] At edu.umd.cs.findbugs.FindBugs2.execute(FindBugs2.java:252)
[spotbugs] At edu.umd.cs.findbugs.FindBugs.runMain(FindBugs.java:395)
[spotbugs] At edu.umd.cs.findbugs.FindBugs2.main(FindBugs2.java:1231)
[spotbugs] Couldn't get class info for java/nio/file/attribute/BasicFileAttributes
[spotbugs] java.lang.IllegalArgumentException: Unsupported class file major version 68
[spotbugs] At org.objectweb.asm.ClassReader.<init>(ClassReader.java:200)
[spotbugs] At org.objectweb.asm.ClassReader.<init>(ClassReader.java:180)
[spotbugs] At org.objectweb.asm.ClassReader.<init>(ClassReader.java:166)
[spotbugs] At edu.umd.cs.findbugs.asm.FBClassReader.<init>(FBClassReader.java:35)
[spotbugs] At edu.umd.cs.findbugs.classfile.engine.asm.ClassReaderAnalysisEngine.analyze(ClassReaderAnalysisEngine.java:48)
[spotbugs] At edu.umd.cs.findbugs.classfile.engine.asm.ClassReaderAnalysisEngine.analyze(ClassReaderAnalysisEngine.java:34)
[spotbugs] At edu.umd.cs.findbugs.classfile.impl.AnalysisCache.getClassAnalysis(AnalysisCache.java:261)
[spotbugs] At edu.umd.cs.findbugs.classfile.engine.ClassInfoAnalysisEngine.analyze(ClassInfoAnalysisEngine.java:75)
[spotbugs] At edu.umd.cs.findbugs.classfile.engine.ClassInfoAnalysisEngine.analyze(ClassInfoAnalysisEngine.java:38)
[spotbugs] At edu.umd.cs.findbugs.classfile.impl.AnalysisCache.getClassAnalysis(AnalysisCache.java:261)
[spotbugs] At edu.umd.cs.findbugs.ba.XFactory.getXClass(XFactory.java:693)
[spotbugs] At edu.umd.cs.findbugs.ba.AnalysisContext.setAppClassList(AnalysisContext.java:975)
[spotbugs] At edu.umd.cs.findbugs.FindBugs2.setAppClassList(FindBugs2.java:909)
[spotbugs] At edu.umd.cs.findbugs.FindBugs2.execute(FindBugs2.java:252)
[spotbugs] At edu.umd.cs.findbugs.FindBugs.runMain(FindBugs.java:395)
[spotbugs] At edu.umd.cs.findbugs.FindBugs2.main(FindBugs2.java:1231)
[spotbugs] Couldn't get class info for java/util/Locale
[spotbugs] java.lang.IllegalArgumentException: Unsupported class file major version 68
[spotbugs] At org.objectweb.asm.ClassReader.<init>(ClassReader.java:200)
[spotbugs] At org.objectweb.asm.ClassReader.<init>(ClassReader.java:180)
[spotbugs] At org.objectweb.asm.ClassReader.<init>(ClassReader.java:166)
[spotbugs] At edu.umd.cs.findbugs.asm.FBClassReader.<init>(FBClassReader.java:35)
[spotbugs] At edu.umd.cs.findbugs.classfile.engine.asm.ClassReaderAnalysisEngine.analyze(ClassReaderAnalysisEngine.java:48)
[spotbugs] At edu.umd.cs.findbugs.classfile.engine.asm.ClassReaderAnalysisEngine.analyze(ClassReaderAnalysisEngine.java:34)
[spotbugs] At edu.umd.cs.findbugs.classfile.impl.AnalysisCache.getClassAnalysis(AnalysisCache.java:261)
[spotbugs] At edu.umd.cs.findbugs.classfile.engine.ClassInfoAnalysisEngine.analyze(ClassInfoAnalysisEngine.java:75)
[spotbugs] At edu.umd.cs.findbugs.classfile.engine.ClassInfoAnalysisEngine.analyze(ClassInfoAnalysisEngine.java:38)
[spotbugs] At edu.umd.cs.findbugs.classfile.impl.AnalysisCache.getClassAnalysis(AnalysisCache.java:261)
[spotbugs] At edu.umd.cs.findbugs.ba.XFactory.getXClass(XFactory.java:693)
[spotbugs] At edu.umd.cs.findbugs.ba.AnalysisContext.setAppClassList(AnalysisContext.java:975)
[spotbugs] At edu.umd.cs.findbugs.FindBugs2.setAppClassList(FindBugs2.java:909)
[spotbugs] At edu.umd.cs.findbugs.FindBugs2.execute(FindBugs2.java:252)
[spotbugs] At edu.umd.cs.findbugs.FindBugs.runMain(FindBugs.java:395)
[spotbugs] At edu.umd.cs.findbugs.FindBugs2.main(FindBugs2.java:1231)
[spotbugs] Couldn't get class info for java/util/zip/Deflater
[spotbugs] java.lang.IllegalArgumentException: Unsupported class file major version 68
[spotbugs] At org.objectweb.asm.ClassReader.<init>(ClassReader.java:200)
[spotbugs] At org.objectweb.asm.ClassReader.<init>(ClassReader.java:180)
[spotbugs] At org.objectweb.asm.ClassReader.<init>(ClassReader.java:166)
[spotbugs] At edu.umd.cs.findbugs.asm.FBClassReader.<init>(FBClassReader.java:35)
[spotbugs] At edu.umd.cs.findbugs.classfile.engine.asm.ClassReaderAnalysisEngine.analyze(ClassReaderAnalysisEngine.java:48)
[spotbugs] At edu.umd.cs.findbugs.classfile.engine.asm.ClassReaderAnalysisEngine.analyze(ClassReaderAnalysisEngine.java:34)
[spotbugs] At edu.umd.cs.findbugs.classfile.impl.AnalysisCache.getClassAnalysis(AnalysisCache.java:261)
[spotbugs] At edu.umd.cs.findbugs.classfile.engine.ClassInfoAnalysisEngine.analyze(ClassInfoAnalysisEngine.java:75)
[spotbugs] At edu.umd.cs.findbugs.classfile.engine.ClassInfoAnalysisEngine.analyze(ClassInfoAnalysisEngine.java:38)
[spotbugs] At edu.umd.cs.findbugs.classfile.impl.AnalysisCache.getClassAnalysis(AnalysisCache.java:261)
[spotbugs] At edu.umd.cs.findbugs.ba.XFactory.getXClass(XFactory.java:693)
[spotbugs] At edu.umd.cs.findbugs.ba.AnalysisContext.setAppClassList(AnalysisContext.java:975)
[spotbugs] At edu.umd.cs.findbugs.FindBugs2.setAppClassList(FindBugs2.java:909)
[spotbugs] At edu.umd.cs.findbugs.FindBugs2.execute(FindBugs2.java:252)
[spotbugs] At edu.umd.cs.findbugs.FindBugs.runMain(FindBugs.java:395)
[spotbugs] At edu.umd.cs.findbugs.FindBugs2.main(FindBugs2.java:1231)
[spotbugs] Couldn't get class info for java/lang/AssertionError
[spotbugs] java.lang.IllegalArgumentException: Unsupported class file major version 68
[spotbugs] At org.objectweb.asm.ClassReader.<init>(ClassReader.java:200)
[spotbugs] At org.objectweb.asm.ClassReader.<init>(ClassReader.java:180)
[spotbugs] At org.objectweb.asm.ClassReader.<init>(ClassReader.java:166)
[spotbugs] At edu.umd.cs.findbugs.asm.FBClassReader.<init>(FBClassReader.java:35)
[spotbugs] At edu.umd.cs.findbugs.classfile.engine.asm.ClassReaderAnalysisEngine.analyze(ClassReaderAnalysisEngine.java:48)
[spotbugs] At edu.umd.cs.findbugs.classfile.engine.asm.ClassReaderAnalysisEngine.analyze(ClassReaderAnalysisEngine.java:34)
[spotbugs] At edu.umd.cs.findbugs.classfile.impl.AnalysisCache.getClassAnalysis(AnalysisCache.java:261)
[spotbugs] At edu.umd.cs.findbugs.classfile.engine.ClassInfoAnalysisEngine.analyze(ClassInfoAnalysisEngine.java:75)
[spotbugs] At edu.umd.cs.findbugs.classfile.engine.ClassInfoAnalysisEngine.analyze(ClassInfoAnalysisEngine.java:38)
[spotbugs] At edu.umd.cs.findbugs.classfile.impl.AnalysisCache.getClassAnalysis(AnalysisCache.java:261)
[spotbugs] At edu.umd.cs.findbugs.ba.XFactory.getXClass(XFactory.java:693)
[spotbugs] At edu.umd.cs.findbugs.ba.AnalysisContext.setAppClassList(AnalysisContext.java:975)
[spotbugs] At edu.umd.cs.findbugs.FindBugs2.setAppClassList(FindBugs2.java:909)
[spotbugs] At edu.umd.cs.findbugs.FindBugs2.execute(FindBugs2.java:252)
[spotbugs] At edu.umd.cs.findbugs.FindBugs.runMain(FindBugs.java:395)
[spotbugs] At edu.umd.cs.findbugs.FindBugs2.main(FindBugs2.java:1231)
[spotbugs] Couldn't get class info for java/util/Set
[spotbugs] java.lang.IllegalArgumentException: Unsupported class file major version 68
[spotbugs] At org.objectweb.asm.ClassReader.<init>(ClassReader.java:200)
[spotbugs] At org.objectweb.asm.ClassReader.<init>(ClassReader.java:180)
[spotbugs] At org.objectweb.asm.ClassReader.<init>(ClassReader.java:166)
[spotbugs] At edu.umd.cs.findbugs.asm.FBClassReader.<init>(FBClassReader.java:35)
[spotbugs] At edu.umd.cs.findbugs.classfile.engine.asm.ClassReaderAnalysisEngine.analyze(ClassReaderAnalysisEngine.java:48)
[spotbugs] At edu.umd.cs.findbugs.classfile.engine.asm.ClassReaderAnalysisEngine.analyze(ClassReaderAnalysisEngine.java:34)
[spotbugs] At edu.umd.cs.findbugs.classfile.impl.AnalysisCache.getClassAnalysis(AnalysisCache.java:261)
[spotbugs] At edu.umd.cs.findbugs.classfile.engine.ClassInfoAnalysisEngine.analyze(ClassInfoAnalysisEngine.java:75)
[spotbugs] At edu.umd.cs.findbugs.classfile.engine.ClassInfoAnalysisEngine.analyze(ClassInfoAnalysisEngine.java:38)
[spotbugs] At edu.umd.cs.findbugs.classfile.impl.AnalysisCache.getClassAnalysis(AnalysisCache.java:261)
[spotbugs] At edu.umd.cs.findbugs.ba.XFactory.getXClass(XFactory.java:693)
[spotbugs] At edu.umd.cs.findbugs.ba.AnalysisContext.setAppClassList(AnalysisContext.java:975)
[spotbugs] At edu.umd.cs.findbugs.FindBugs2.setAppClassList(FindBugs2.java:909)
[spotbugs] At edu.umd.cs.findbugs.FindBugs2.execute(FindBugs2.java:252)
[spotbugs] At edu.umd.cs.findbugs.FindBugs.runMain(FindBugs.java:395)
[spotbugs] At edu.umd.cs.findbugs.FindBugs2.main(FindBugs2.java:1231)
[spotbugs] Couldn't get class info for java/io/FilterInputStream
[spotbugs] java.lang.IllegalArgumentException: Unsupported class file major version 68
[spotbugs] At org.objectweb.asm.ClassReader.<init>(ClassReader.java:200)
[spotbugs] At org.objectweb.asm.ClassReader.<init>(ClassReader.java:180)
[spotbugs] At org.objectweb.asm.ClassReader.<init>(ClassReader.java:166)
[spotbugs] At edu.umd.cs.findbugs.asm.FBClassReader.<init>(FBClassReader.java:35)
[spotbugs] At edu.umd.cs.findbugs.classfile.engine.asm.ClassReaderAnalysisEngine.analyze(ClassReaderAnalysisEngine.java:48)
[spotbugs] At edu.umd.cs.findbugs.classfile.engine.asm.ClassReaderAnalysisEngine.analyze(ClassReaderAnalysisEngine.java:34)
[spotbugs] At edu.umd.cs.findbugs.classfile.impl.AnalysisCache.getClassAnalysis(AnalysisCache.java:261)
[spotbugs] At edu.umd.cs.findbugs.classfile.engine.ClassInfoAnalysisEngine.analyze(ClassInfoAnalysisEngine.java:75)
[spotbugs] At edu.umd.cs.findbugs.classfile.engine.ClassInfoAnalysisEngine.analyze(ClassInfoAnalysisEngine.java:38)
[spotbugs] At edu.umd.cs.findbugs.classfile.impl.AnalysisCache.getClassAnalysis(AnalysisCache.java:261)
[spotbugs] At edu.umd.cs.findbugs.FindBugs2.buildReferencedClassSet(FindBugs2.java:806)
[spotbugs] At edu.umd.cs.findbugs.FindBugs2.execute(FindBugs2.java:249)
[spotbugs] At edu.umd.cs.findbugs.FindBugs.runMain(FindBugs.java:395)
[spotbugs] At edu.umd.cs.findbugs.FindBugs2.main(FindBugs2.java:1231)
[spotbugs] Couldn't get class info for java/awt/AlphaComposite
[spotbugs] java.lang.IllegalArgumentException: Unsupported class file major version 68
[spotbugs] At org.objectweb.asm.ClassReader.<init>(ClassReader.java:200)
[spotbugs] At org.objectweb.asm.ClassReader.<init>(ClassReader.java:180)
[spotbugs] At org.objectweb.asm.ClassReader.<init>(ClassReader.java:166)
[spotbugs] At edu.umd.cs.findbugs.asm.FBClassReader.<init>(FBClassReader.java:35)
[spotbugs] At edu.umd.cs.findbugs.classfile.engine.asm.ClassReaderAnalysisEngine.analyze(ClassReaderAnalysisEngine.java:48)
[spotbugs] At edu.umd.cs.findbugs.classfile.engine.asm.ClassReaderAnalysisEngine.analyze(ClassReaderAnalysisEngine.java:34)
[spotbugs] At edu.umd.cs.findbugs.classfile.impl.AnalysisCache.getClassAnalysis(AnalysisCache.java:261)
[spotbugs] At edu.umd.cs.findbugs.classfile.engine.ClassInfoAnalysisEngine.analyze(ClassInfoAnalysisEngine.java:75)
[spotbugs] At edu.umd.cs.findbugs.classfile.engine.ClassInfoAnalysisEngine.analyze(ClassInfoAnalysisEngine.java:38)
[spotbugs] At edu.umd.cs.findbugs.classfile.impl.AnalysisCache.getClassAnalysis(AnalysisCache.java:261)
[spotbugs] At edu.umd.cs.findbugs.ba.XFactory.getXClass(XFactory.java:693)
[spotbugs] At edu.umd.cs.findbugs.ba.AnalysisContext.setAppClassList(AnalysisContext.java:975)
[spotbugs] At edu.umd.cs.findbugs.FindBugs2.setAppClassList(FindBugs2.java:909)
[spotbugs] At edu.umd.cs.findbugs.FindBugs2.execute(FindBugs2.java:252)
[spotbugs] At edu.umd.cs.findbugs.FindBugs.runMain(FindBugs.java:395)
[spotbugs] At edu.umd.cs.findbugs.FindBugs2.main(FindBugs2.java:1231)
[spotbugs] Couldn't get class info for java/awt/geom/Arc2D
[spotbugs] java.lang.IllegalArgumentException: Unsupported class file major version 68
[spotbugs] At org.objectweb.asm.ClassReader.<init>(ClassReader.java:200)
[spotbugs] At org.objectweb.asm.ClassReader.<init>(ClassReader.java:180)
[spotbugs] At org.objectweb.asm.ClassReader.<init>(ClassReader.java:166)
[spotbugs] At edu.umd.cs.findbugs.asm.FBClassReader.<init>(FBClassReader.java:35)
[spotbugs] At edu.umd.cs.findbugs.classfile.engine.asm.ClassReaderAnalysisEngine.analyze(ClassReaderAnalysisEngine.java:48)
[spotbugs] At edu.umd.cs.findbugs.classfile.engine.asm.ClassReaderAnalysisEngine.analyze(ClassReaderAnalysisEngine.java:34)
[spotbugs] At edu.umd.cs.findbugs.classfile.impl.AnalysisCache.getClassAnalysis(AnalysisCache.java:261)
[spotbugs] At edu.umd.cs.findbugs.classfile.engine.ClassInfoAnalysisEngine.analyze(ClassInfoAnalysisEngine.java:75)
[spotbugs] At edu.umd.cs.findbugs.classfile.engine.ClassInfoAnalysisEngine.analyze(ClassInfoAnalysisEngine.java:38)
[spotbugs] At edu.umd.cs.findbugs.classfile.impl.AnalysisCache.getClassAnalysis(AnalysisCache.java:261)
[spotbugs] At edu.umd.cs.findbugs.ba.XFactory.getXClass(XFactory.java:693)
[spotbugs] At edu.umd.cs.findbugs.ba.AnalysisContext.setAppClassList(AnalysisContext.java:975)
[spotbugs] At edu.umd.cs.findbugs.FindBugs2.setAppClassList(FindBugs2.java:909)
[spotbugs] At edu.umd.cs.findbugs.FindBugs2.execute(FindBugs2.java:252)
[spotbugs] At edu.umd.cs.findbugs.FindBugs.runMain(FindBugs.java:395)
[spotbugs] At edu.umd.cs.findbugs.FindBugs2.main(FindBugs2.java:1231)
[spotbugs] Couldn't get class info for java/security/DigestException
[spotbugs] java.lang.IllegalArgumentException: Unsupported class file major version 68
[spotbugs] At org.objectweb.asm.ClassReader.<init>(ClassReader.java:200)
[spotbugs] At org.objectweb.asm.ClassReader.<init>(ClassReader.java:180)
[spotbugs] At org.objectweb.asm.ClassReader.<init>(ClassReader.java:166)
[spotbugs] At edu.umd.cs.findbugs.asm.FBClassReader.<init>(FBClassReader.java:35)
[spotbugs] At edu.umd.cs.findbugs.classfile.engine.asm.ClassReaderAnalysisEngine.analyze(ClassReaderAnalysisEngine.java:48)
[spotbugs] At edu.umd.cs.findbugs.classfile.engine.asm.ClassReaderAnalysisEngine.analyze(ClassReaderAnalysisEngine.java:34)
[spotbugs] At edu.umd.cs.findbugs.classfile.impl.AnalysisCache.getClassAnalysis(AnalysisCache.java:261)
[spotbugs] At edu.umd.cs.findbugs.classfile.engine.ClassInfoAnalysisEngine.analyze(ClassInfoAnalysisEngine.java:75)
[spotbugs] At edu.umd.cs.findbugs.classfile.engine.ClassInfoAnalysisEngine.analyze(ClassInfoAnalysisEngine.java:38)
[spotbugs] At edu.umd.cs.findbugs.classfile.impl.AnalysisCache.getClassAnalysis(AnalysisCache.java:261)
[spotbugs] At edu.umd.cs.findbugs.ba.XFactory.getXClass(XFactory.java:693)
[spotbugs] At edu.umd.cs.findbugs.ba.AnalysisContext.setAppClassList(AnalysisContext.java:975)
[spotbugs] At edu.umd.cs.findbugs.FindBugs2.setAppClassList(FindBugs2.java:909)
[spotbugs] At edu.umd.cs.findbugs.FindBugs2.execute(FindBugs2.java:252)
[spotbugs] At edu.umd.cs.findbugs.FindBugs.runMain(FindBugs.java:395)
[spotbugs] At edu.umd.cs.findbugs.FindBugs2.main(FindBugs2.java:1231)
[spotbugs]
[spotbugs] java.lang.IllegalArgumentException: Unsupported class file major version 68
[spotbugs] at org.objectweb.asm.ClassReader.<init>(ClassReader.java:200)
[spotbugs] at org.objectweb.asm.ClassReader.<init>(ClassReader.java:180)
[spotbugs] at org.objectweb.asm.ClassReader.<init>(ClassReader.java:166)
[spotbugs] at edu.umd.cs.findbugs.asm.FBClassReader.<init>(FBClassReader.java:35)
[spotbugs] at edu.umd.cs.findbugs.classfile.engine.asm.ClassReaderAnalysisEngine.analyze(ClassReaderAnalysisEngine.java:48)
[spotbugs] at edu.umd.cs.findbugs.classfile.engine.asm.ClassReaderAnalysisEngine.analyze(ClassReaderAnalysisEngine.java:34)
[spotbugs] at edu.umd.cs.findbugs.classfile.impl.AnalysisCache.getClassAnalysis(AnalysisCache.java:261)
[spotbugs] at edu.umd.cs.findbugs.classfile.engine.ClassInfoAnalysisEngine.analyze(ClassInfoAnalysisEngine.java:75)
[spotbugs] at edu.umd.cs.findbugs.classfile.engine.ClassInfoAnalysisEngine.analyze(ClassInfoAnalysisEngine.java:38)
[spotbugs] at edu.umd.cs.findbugs.classfile.impl.AnalysisCache.getClassAnalysis(AnalysisCache.java:261)
[spotbugs] at edu.umd.cs.findbugs.ba.XFactory.getXClass(XFactory.java:693)
[spotbugs] at edu.umd.cs.findbugs.ba.AnalysisContext.setAppClassList(AnalysisContext.java:975)
[spotbugs] at edu.umd.cs.findbugs.FindBugs2.setAppClassList(FindBugs2.java:909)
[spotbugs] at edu.umd.cs.findbugs.FindBugs2.execute(FindBugs2.java:252)
[spotbugs] at edu.umd.cs.findbugs.FindBugs.runMain(FindBugs.java:395)
[spotbugs] at edu.umd.cs.findbugs.FindBugs2.main(FindBugs2.java:1231)
[spotbugs] Java Result: 4
BUILD FAILED
<https://ci-builds.apache.org/job/POI/job/POI-DSL-1.24/ws/build.xml>:2651: Execution of SpotBugs failed.
Total time: 28 minutes 39 seconds
Build step 'Invoke Ant' marked build as failure
ERROR: Not all environment variables could be successfully injected. Check for similarly-named environment variables.
Archiving artifacts
ERROR: Not all environment variables could be successfully injected. Check for similarly-named environment variables.
Recording test results
ERROR: Not all environment variables could be successfully injected. Check for similarly-named environment variables.
[Checks API] No suitable checks publisher found.
ERROR: Not all environment variables could be successfully injected. Check for similarly-named environment variables.
---------------------------------------------------------------------
To unsubscribe, e-mail: dev-unsubscribe@poi.apache.org
For additional commands, e-mail: dev-help@poi.apache.org
Build failed in Jenkins: POI » POI-DSL-1.24 #12
Posted by Apache Jenkins Server <je...@builds.apache.org>.
See <https://ci-builds.apache.org/job/POI/job/POI-DSL-1.24/12/display/redirect?page=changes>
Changes:
[PJ Fanning] bytebuddy 1.17.0
[PJ Fanning] allow users supply a SheetUtil failover function
[PJ Fanning] allow users supply a SheetUtil failover function
[PJ Fanning] [bug-69555] need to work around inability to create a TextLayout in another place (caused by missing fonts most likely)
[PJ Fanning] fix create issue in getUnderline
[PJ Fanning] commons-codec 1.18.0
[PJ Fanning] commons-codec 1.18.0
------------------------------------------
[...truncated 9.39 MiB...]
[spotbugs] At edu.umd.cs.findbugs.FindBugs2.execute(FindBugs2.java:252)
[spotbugs] At edu.umd.cs.findbugs.FindBugs.runMain(FindBugs.java:395)
[spotbugs] At edu.umd.cs.findbugs.FindBugs2.main(FindBugs2.java:1231)
[spotbugs] Couldn't get class info for java/util/regex/MatchResult
[spotbugs] java.lang.IllegalArgumentException: Unsupported class file major version 68
[spotbugs] At org.objectweb.asm.ClassReader.<init>(ClassReader.java:200)
[spotbugs] At org.objectweb.asm.ClassReader.<init>(ClassReader.java:180)
[spotbugs] At org.objectweb.asm.ClassReader.<init>(ClassReader.java:166)
[spotbugs] At edu.umd.cs.findbugs.asm.FBClassReader.<init>(FBClassReader.java:35)
[spotbugs] At edu.umd.cs.findbugs.classfile.engine.asm.ClassReaderAnalysisEngine.analyze(ClassReaderAnalysisEngine.java:48)
[spotbugs] At edu.umd.cs.findbugs.classfile.engine.asm.ClassReaderAnalysisEngine.analyze(ClassReaderAnalysisEngine.java:34)
[spotbugs] At edu.umd.cs.findbugs.classfile.impl.AnalysisCache.getClassAnalysis(AnalysisCache.java:261)
[spotbugs] At edu.umd.cs.findbugs.classfile.engine.ClassInfoAnalysisEngine.analyze(ClassInfoAnalysisEngine.java:75)
[spotbugs] At edu.umd.cs.findbugs.classfile.engine.ClassInfoAnalysisEngine.analyze(ClassInfoAnalysisEngine.java:38)
[spotbugs] At edu.umd.cs.findbugs.classfile.impl.AnalysisCache.getClassAnalysis(AnalysisCache.java:261)
[spotbugs] At edu.umd.cs.findbugs.ba.XFactory.getXClass(XFactory.java:693)
[spotbugs] At edu.umd.cs.findbugs.ba.AnalysisContext.setAppClassList(AnalysisContext.java:975)
[spotbugs] At edu.umd.cs.findbugs.FindBugs2.setAppClassList(FindBugs2.java:909)
[spotbugs] At edu.umd.cs.findbugs.FindBugs2.execute(FindBugs2.java:252)
[spotbugs] At edu.umd.cs.findbugs.FindBugs.runMain(FindBugs.java:395)
[spotbugs] At edu.umd.cs.findbugs.FindBugs2.main(FindBugs2.java:1231)
[spotbugs] Couldn't get class info for javax/xml/crypto/dsig/spec/SignatureMethodParameterSpec
[spotbugs] java.lang.IllegalArgumentException: Unsupported class file major version 68
[spotbugs] At org.objectweb.asm.ClassReader.<init>(ClassReader.java:200)
[spotbugs] At org.objectweb.asm.ClassReader.<init>(ClassReader.java:180)
[spotbugs] At org.objectweb.asm.ClassReader.<init>(ClassReader.java:166)
[spotbugs] At edu.umd.cs.findbugs.asm.FBClassReader.<init>(FBClassReader.java:35)
[spotbugs] At edu.umd.cs.findbugs.classfile.engine.asm.ClassReaderAnalysisEngine.analyze(ClassReaderAnalysisEngine.java:48)
[spotbugs] At edu.umd.cs.findbugs.classfile.engine.asm.ClassReaderAnalysisEngine.analyze(ClassReaderAnalysisEngine.java:34)
[spotbugs] At edu.umd.cs.findbugs.classfile.impl.AnalysisCache.getClassAnalysis(AnalysisCache.java:261)
[spotbugs] At edu.umd.cs.findbugs.classfile.engine.ClassInfoAnalysisEngine.analyze(ClassInfoAnalysisEngine.java:75)
[spotbugs] At edu.umd.cs.findbugs.classfile.engine.ClassInfoAnalysisEngine.analyze(ClassInfoAnalysisEngine.java:38)
[spotbugs] At edu.umd.cs.findbugs.classfile.impl.AnalysisCache.getClassAnalysis(AnalysisCache.java:261)
[spotbugs] At edu.umd.cs.findbugs.ba.XFactory.getXClass(XFactory.java:693)
[spotbugs] At edu.umd.cs.findbugs.ba.AnalysisContext.setAppClassList(AnalysisContext.java:975)
[spotbugs] At edu.umd.cs.findbugs.FindBugs2.setAppClassList(FindBugs2.java:909)
[spotbugs] At edu.umd.cs.findbugs.FindBugs2.execute(FindBugs2.java:252)
[spotbugs] At edu.umd.cs.findbugs.FindBugs.runMain(FindBugs.java:395)
[spotbugs] At edu.umd.cs.findbugs.FindBugs2.main(FindBugs2.java:1231)
[spotbugs] Couldn't get class info for java/util/Random
[spotbugs] java.lang.IllegalArgumentException: Unsupported class file major version 68
[spotbugs] At org.objectweb.asm.ClassReader.<init>(ClassReader.java:200)
[spotbugs] At org.objectweb.asm.ClassReader.<init>(ClassReader.java:180)
[spotbugs] At org.objectweb.asm.ClassReader.<init>(ClassReader.java:166)
[spotbugs] At edu.umd.cs.findbugs.asm.FBClassReader.<init>(FBClassReader.java:35)
[spotbugs] At edu.umd.cs.findbugs.classfile.engine.asm.ClassReaderAnalysisEngine.analyze(ClassReaderAnalysisEngine.java:48)
[spotbugs] At edu.umd.cs.findbugs.classfile.engine.asm.ClassReaderAnalysisEngine.analyze(ClassReaderAnalysisEngine.java:34)
[spotbugs] At edu.umd.cs.findbugs.classfile.impl.AnalysisCache.getClassAnalysis(AnalysisCache.java:261)
[spotbugs] At edu.umd.cs.findbugs.classfile.engine.ClassInfoAnalysisEngine.analyze(ClassInfoAnalysisEngine.java:75)
[spotbugs] At edu.umd.cs.findbugs.classfile.engine.ClassInfoAnalysisEngine.analyze(ClassInfoAnalysisEngine.java:38)
[spotbugs] At edu.umd.cs.findbugs.classfile.impl.AnalysisCache.getClassAnalysis(AnalysisCache.java:261)
[spotbugs] At edu.umd.cs.findbugs.ba.XFactory.getXClass(XFactory.java:693)
[spotbugs] At edu.umd.cs.findbugs.ba.AnalysisContext.setAppClassList(AnalysisContext.java:975)
[spotbugs] At edu.umd.cs.findbugs.FindBugs2.setAppClassList(FindBugs2.java:909)
[spotbugs] At edu.umd.cs.findbugs.FindBugs2.execute(FindBugs2.java:252)
[spotbugs] At edu.umd.cs.findbugs.FindBugs.runMain(FindBugs.java:395)
[spotbugs] At edu.umd.cs.findbugs.FindBugs2.main(FindBugs2.java:1231)
[spotbugs] Couldn't get class info for java/nio/file/attribute/BasicFileAttributes
[spotbugs] java.lang.IllegalArgumentException: Unsupported class file major version 68
[spotbugs] At org.objectweb.asm.ClassReader.<init>(ClassReader.java:200)
[spotbugs] At org.objectweb.asm.ClassReader.<init>(ClassReader.java:180)
[spotbugs] At org.objectweb.asm.ClassReader.<init>(ClassReader.java:166)
[spotbugs] At edu.umd.cs.findbugs.asm.FBClassReader.<init>(FBClassReader.java:35)
[spotbugs] At edu.umd.cs.findbugs.classfile.engine.asm.ClassReaderAnalysisEngine.analyze(ClassReaderAnalysisEngine.java:48)
[spotbugs] At edu.umd.cs.findbugs.classfile.engine.asm.ClassReaderAnalysisEngine.analyze(ClassReaderAnalysisEngine.java:34)
[spotbugs] At edu.umd.cs.findbugs.classfile.impl.AnalysisCache.getClassAnalysis(AnalysisCache.java:261)
[spotbugs] At edu.umd.cs.findbugs.classfile.engine.ClassInfoAnalysisEngine.analyze(ClassInfoAnalysisEngine.java:75)
[spotbugs] At edu.umd.cs.findbugs.classfile.engine.ClassInfoAnalysisEngine.analyze(ClassInfoAnalysisEngine.java:38)
[spotbugs] At edu.umd.cs.findbugs.classfile.impl.AnalysisCache.getClassAnalysis(AnalysisCache.java:261)
[spotbugs] At edu.umd.cs.findbugs.ba.XFactory.getXClass(XFactory.java:693)
[spotbugs] At edu.umd.cs.findbugs.ba.AnalysisContext.setAppClassList(AnalysisContext.java:975)
[spotbugs] At edu.umd.cs.findbugs.FindBugs2.setAppClassList(FindBugs2.java:909)
[spotbugs] At edu.umd.cs.findbugs.FindBugs2.execute(FindBugs2.java:252)
[spotbugs] At edu.umd.cs.findbugs.FindBugs.runMain(FindBugs.java:395)
[spotbugs] At edu.umd.cs.findbugs.FindBugs2.main(FindBugs2.java:1231)
[spotbugs] Couldn't get class info for java/util/Locale
[spotbugs] java.lang.IllegalArgumentException: Unsupported class file major version 68
[spotbugs] At org.objectweb.asm.ClassReader.<init>(ClassReader.java:200)
[spotbugs] At org.objectweb.asm.ClassReader.<init>(ClassReader.java:180)
[spotbugs] At org.objectweb.asm.ClassReader.<init>(ClassReader.java:166)
[spotbugs] At edu.umd.cs.findbugs.asm.FBClassReader.<init>(FBClassReader.java:35)
[spotbugs] At edu.umd.cs.findbugs.classfile.engine.asm.ClassReaderAnalysisEngine.analyze(ClassReaderAnalysisEngine.java:48)
[spotbugs] At edu.umd.cs.findbugs.classfile.engine.asm.ClassReaderAnalysisEngine.analyze(ClassReaderAnalysisEngine.java:34)
[spotbugs] At edu.umd.cs.findbugs.classfile.impl.AnalysisCache.getClassAnalysis(AnalysisCache.java:261)
[spotbugs] At edu.umd.cs.findbugs.classfile.engine.ClassInfoAnalysisEngine.analyze(ClassInfoAnalysisEngine.java:75)
[spotbugs] At edu.umd.cs.findbugs.classfile.engine.ClassInfoAnalysisEngine.analyze(ClassInfoAnalysisEngine.java:38)
[spotbugs] At edu.umd.cs.findbugs.classfile.impl.AnalysisCache.getClassAnalysis(AnalysisCache.java:261)
[spotbugs] At edu.umd.cs.findbugs.ba.XFactory.getXClass(XFactory.java:693)
[spotbugs] At edu.umd.cs.findbugs.ba.AnalysisContext.setAppClassList(AnalysisContext.java:975)
[spotbugs] At edu.umd.cs.findbugs.FindBugs2.setAppClassList(FindBugs2.java:909)
[spotbugs] At edu.umd.cs.findbugs.FindBugs2.execute(FindBugs2.java:252)
[spotbugs] At edu.umd.cs.findbugs.FindBugs.runMain(FindBugs.java:395)
[spotbugs] At edu.umd.cs.findbugs.FindBugs2.main(FindBugs2.java:1231)
[spotbugs] Couldn't get class info for java/util/zip/Deflater
[spotbugs] java.lang.IllegalArgumentException: Unsupported class file major version 68
[spotbugs] At org.objectweb.asm.ClassReader.<init>(ClassReader.java:200)
[spotbugs] At org.objectweb.asm.ClassReader.<init>(ClassReader.java:180)
[spotbugs] At org.objectweb.asm.ClassReader.<init>(ClassReader.java:166)
[spotbugs] At edu.umd.cs.findbugs.asm.FBClassReader.<init>(FBClassReader.java:35)
[spotbugs] At edu.umd.cs.findbugs.classfile.engine.asm.ClassReaderAnalysisEngine.analyze(ClassReaderAnalysisEngine.java:48)
[spotbugs] At edu.umd.cs.findbugs.classfile.engine.asm.ClassReaderAnalysisEngine.analyze(ClassReaderAnalysisEngine.java:34)
[spotbugs] At edu.umd.cs.findbugs.classfile.impl.AnalysisCache.getClassAnalysis(AnalysisCache.java:261)
[spotbugs] At edu.umd.cs.findbugs.classfile.engine.ClassInfoAnalysisEngine.analyze(ClassInfoAnalysisEngine.java:75)
[spotbugs] At edu.umd.cs.findbugs.classfile.engine.ClassInfoAnalysisEngine.analyze(ClassInfoAnalysisEngine.java:38)
[spotbugs] At edu.umd.cs.findbugs.classfile.impl.AnalysisCache.getClassAnalysis(AnalysisCache.java:261)
[spotbugs] At edu.umd.cs.findbugs.ba.XFactory.getXClass(XFactory.java:693)
[spotbugs] At edu.umd.cs.findbugs.ba.AnalysisContext.setAppClassList(AnalysisContext.java:975)
[spotbugs] At edu.umd.cs.findbugs.FindBugs2.setAppClassList(FindBugs2.java:909)
[spotbugs] At edu.umd.cs.findbugs.FindBugs2.execute(FindBugs2.java:252)
[spotbugs] At edu.umd.cs.findbugs.FindBugs.runMain(FindBugs.java:395)
[spotbugs] At edu.umd.cs.findbugs.FindBugs2.main(FindBugs2.java:1231)
[spotbugs] Couldn't get class info for java/lang/AssertionError
[spotbugs] java.lang.IllegalArgumentException: Unsupported class file major version 68
[spotbugs] At org.objectweb.asm.ClassReader.<init>(ClassReader.java:200)
[spotbugs] At org.objectweb.asm.ClassReader.<init>(ClassReader.java:180)
[spotbugs] At org.objectweb.asm.ClassReader.<init>(ClassReader.java:166)
[spotbugs] At edu.umd.cs.findbugs.asm.FBClassReader.<init>(FBClassReader.java:35)
[spotbugs] At edu.umd.cs.findbugs.classfile.engine.asm.ClassReaderAnalysisEngine.analyze(ClassReaderAnalysisEngine.java:48)
[spotbugs] At edu.umd.cs.findbugs.classfile.engine.asm.ClassReaderAnalysisEngine.analyze(ClassReaderAnalysisEngine.java:34)
[spotbugs] At edu.umd.cs.findbugs.classfile.impl.AnalysisCache.getClassAnalysis(AnalysisCache.java:261)
[spotbugs] At edu.umd.cs.findbugs.classfile.engine.ClassInfoAnalysisEngine.analyze(ClassInfoAnalysisEngine.java:75)
[spotbugs] At edu.umd.cs.findbugs.classfile.engine.ClassInfoAnalysisEngine.analyze(ClassInfoAnalysisEngine.java:38)
[spotbugs] At edu.umd.cs.findbugs.classfile.impl.AnalysisCache.getClassAnalysis(AnalysisCache.java:261)
[spotbugs] At edu.umd.cs.findbugs.ba.XFactory.getXClass(XFactory.java:693)
[spotbugs] At edu.umd.cs.findbugs.ba.AnalysisContext.setAppClassList(AnalysisContext.java:975)
[spotbugs] At edu.umd.cs.findbugs.FindBugs2.setAppClassList(FindBugs2.java:909)
[spotbugs] At edu.umd.cs.findbugs.FindBugs2.execute(FindBugs2.java:252)
[spotbugs] At edu.umd.cs.findbugs.FindBugs.runMain(FindBugs.java:395)
[spotbugs] At edu.umd.cs.findbugs.FindBugs2.main(FindBugs2.java:1231)
[spotbugs] Couldn't get class info for java/util/Set
[spotbugs] java.lang.IllegalArgumentException: Unsupported class file major version 68
[spotbugs] At org.objectweb.asm.ClassReader.<init>(ClassReader.java:200)
[spotbugs] At org.objectweb.asm.ClassReader.<init>(ClassReader.java:180)
[spotbugs] At org.objectweb.asm.ClassReader.<init>(ClassReader.java:166)
[spotbugs] At edu.umd.cs.findbugs.asm.FBClassReader.<init>(FBClassReader.java:35)
[spotbugs] At edu.umd.cs.findbugs.classfile.engine.asm.ClassReaderAnalysisEngine.analyze(ClassReaderAnalysisEngine.java:48)
[spotbugs] At edu.umd.cs.findbugs.classfile.engine.asm.ClassReaderAnalysisEngine.analyze(ClassReaderAnalysisEngine.java:34)
[spotbugs] At edu.umd.cs.findbugs.classfile.impl.AnalysisCache.getClassAnalysis(AnalysisCache.java:261)
[spotbugs] At edu.umd.cs.findbugs.classfile.engine.ClassInfoAnalysisEngine.analyze(ClassInfoAnalysisEngine.java:75)
[spotbugs] At edu.umd.cs.findbugs.classfile.engine.ClassInfoAnalysisEngine.analyze(ClassInfoAnalysisEngine.java:38)
[spotbugs] At edu.umd.cs.findbugs.classfile.impl.AnalysisCache.getClassAnalysis(AnalysisCache.java:261)
[spotbugs] At edu.umd.cs.findbugs.ba.XFactory.getXClass(XFactory.java:693)
[spotbugs] At edu.umd.cs.findbugs.ba.AnalysisContext.setAppClassList(AnalysisContext.java:975)
[spotbugs] At edu.umd.cs.findbugs.FindBugs2.setAppClassList(FindBugs2.java:909)
[spotbugs] At edu.umd.cs.findbugs.FindBugs2.execute(FindBugs2.java:252)
[spotbugs] At edu.umd.cs.findbugs.FindBugs.runMain(FindBugs.java:395)
[spotbugs] At edu.umd.cs.findbugs.FindBugs2.main(FindBugs2.java:1231)
[spotbugs] Couldn't get class info for java/io/FilterInputStream
[spotbugs] java.lang.IllegalArgumentException: Unsupported class file major version 68
[spotbugs] At org.objectweb.asm.ClassReader.<init>(ClassReader.java:200)
[spotbugs] At org.objectweb.asm.ClassReader.<init>(ClassReader.java:180)
[spotbugs] At org.objectweb.asm.ClassReader.<init>(ClassReader.java:166)
[spotbugs] At edu.umd.cs.findbugs.asm.FBClassReader.<init>(FBClassReader.java:35)
[spotbugs] At edu.umd.cs.findbugs.classfile.engine.asm.ClassReaderAnalysisEngine.analyze(ClassReaderAnalysisEngine.java:48)
[spotbugs] At edu.umd.cs.findbugs.classfile.engine.asm.ClassReaderAnalysisEngine.analyze(ClassReaderAnalysisEngine.java:34)
[spotbugs] At edu.umd.cs.findbugs.classfile.impl.AnalysisCache.getClassAnalysis(AnalysisCache.java:261)
[spotbugs] At edu.umd.cs.findbugs.classfile.engine.ClassInfoAnalysisEngine.analyze(ClassInfoAnalysisEngine.java:75)
[spotbugs] At edu.umd.cs.findbugs.classfile.engine.ClassInfoAnalysisEngine.analyze(ClassInfoAnalysisEngine.java:38)
[spotbugs] At edu.umd.cs.findbugs.classfile.impl.AnalysisCache.getClassAnalysis(AnalysisCache.java:261)
[spotbugs] At edu.umd.cs.findbugs.FindBugs2.buildReferencedClassSet(FindBugs2.java:806)
[spotbugs] At edu.umd.cs.findbugs.FindBugs2.execute(FindBugs2.java:249)
[spotbugs] At edu.umd.cs.findbugs.FindBugs.runMain(FindBugs.java:395)
[spotbugs] At edu.umd.cs.findbugs.FindBugs2.main(FindBugs2.java:1231)
[spotbugs] Couldn't get class info for java/awt/AlphaComposite
[spotbugs] java.lang.IllegalArgumentException: Unsupported class file major version 68
[spotbugs] At org.objectweb.asm.ClassReader.<init>(ClassReader.java:200)
[spotbugs] At org.objectweb.asm.ClassReader.<init>(ClassReader.java:180)
[spotbugs] At org.objectweb.asm.ClassReader.<init>(ClassReader.java:166)
[spotbugs] At edu.umd.cs.findbugs.asm.FBClassReader.<init>(FBClassReader.java:35)
[spotbugs] At edu.umd.cs.findbugs.classfile.engine.asm.ClassReaderAnalysisEngine.analyze(ClassReaderAnalysisEngine.java:48)
[spotbugs] At edu.umd.cs.findbugs.classfile.engine.asm.ClassReaderAnalysisEngine.analyze(ClassReaderAnalysisEngine.java:34)
[spotbugs] At edu.umd.cs.findbugs.classfile.impl.AnalysisCache.getClassAnalysis(AnalysisCache.java:261)
[spotbugs] At edu.umd.cs.findbugs.classfile.engine.ClassInfoAnalysisEngine.analyze(ClassInfoAnalysisEngine.java:75)
[spotbugs] At edu.umd.cs.findbugs.classfile.engine.ClassInfoAnalysisEngine.analyze(ClassInfoAnalysisEngine.java:38)
[spotbugs] At edu.umd.cs.findbugs.classfile.impl.AnalysisCache.getClassAnalysis(AnalysisCache.java:261)
[spotbugs] At edu.umd.cs.findbugs.ba.XFactory.getXClass(XFactory.java:693)
[spotbugs] At edu.umd.cs.findbugs.ba.AnalysisContext.setAppClassList(AnalysisContext.java:975)
[spotbugs] At edu.umd.cs.findbugs.FindBugs2.setAppClassList(FindBugs2.java:909)
[spotbugs] At edu.umd.cs.findbugs.FindBugs2.execute(FindBugs2.java:252)
[spotbugs] At edu.umd.cs.findbugs.FindBugs.runMain(FindBugs.java:395)
[spotbugs] At edu.umd.cs.findbugs.FindBugs2.main(FindBugs2.java:1231)
[spotbugs] Couldn't get class info for java/awt/geom/Arc2D
[spotbugs] java.lang.IllegalArgumentException: Unsupported class file major version 68
[spotbugs] At org.objectweb.asm.ClassReader.<init>(ClassReader.java:200)
[spotbugs] At org.objectweb.asm.ClassReader.<init>(ClassReader.java:180)
[spotbugs] At org.objectweb.asm.ClassReader.<init>(ClassReader.java:166)
[spotbugs] At edu.umd.cs.findbugs.asm.FBClassReader.<init>(FBClassReader.java:35)
[spotbugs] At edu.umd.cs.findbugs.classfile.engine.asm.ClassReaderAnalysisEngine.analyze(ClassReaderAnalysisEngine.java:48)
[spotbugs] At edu.umd.cs.findbugs.classfile.engine.asm.ClassReaderAnalysisEngine.analyze(ClassReaderAnalysisEngine.java:34)
[spotbugs] At edu.umd.cs.findbugs.classfile.impl.AnalysisCache.getClassAnalysis(AnalysisCache.java:261)
[spotbugs] At edu.umd.cs.findbugs.classfile.engine.ClassInfoAnalysisEngine.analyze(ClassInfoAnalysisEngine.java:75)
[spotbugs] At edu.umd.cs.findbugs.classfile.engine.ClassInfoAnalysisEngine.analyze(ClassInfoAnalysisEngine.java:38)
[spotbugs] At edu.umd.cs.findbugs.classfile.impl.AnalysisCache.getClassAnalysis(AnalysisCache.java:261)
[spotbugs] At edu.umd.cs.findbugs.ba.XFactory.getXClass(XFactory.java:693)
[spotbugs] At edu.umd.cs.findbugs.ba.AnalysisContext.setAppClassList(AnalysisContext.java:975)
[spotbugs] At edu.umd.cs.findbugs.FindBugs2.setAppClassList(FindBugs2.java:909)
[spotbugs] At edu.umd.cs.findbugs.FindBugs2.execute(FindBugs2.java:252)
[spotbugs] At edu.umd.cs.findbugs.FindBugs.runMain(FindBugs.java:395)
[spotbugs] At edu.umd.cs.findbugs.FindBugs2.main(FindBugs2.java:1231)
[spotbugs] Couldn't get class info for java/security/DigestException
[spotbugs] java.lang.IllegalArgumentException: Unsupported class file major version 68
[spotbugs] At org.objectweb.asm.ClassReader.<init>(ClassReader.java:200)
[spotbugs] At org.objectweb.asm.ClassReader.<init>(ClassReader.java:180)
[spotbugs] At org.objectweb.asm.ClassReader.<init>(ClassReader.java:166)
[spotbugs] At edu.umd.cs.findbugs.asm.FBClassReader.<init>(FBClassReader.java:35)
[spotbugs] At edu.umd.cs.findbugs.classfile.engine.asm.ClassReaderAnalysisEngine.analyze(ClassReaderAnalysisEngine.java:48)
[spotbugs] At edu.umd.cs.findbugs.classfile.engine.asm.ClassReaderAnalysisEngine.analyze(ClassReaderAnalysisEngine.java:34)
[spotbugs] At edu.umd.cs.findbugs.classfile.impl.AnalysisCache.getClassAnalysis(AnalysisCache.java:261)
[spotbugs] At edu.umd.cs.findbugs.classfile.engine.ClassInfoAnalysisEngine.analyze(ClassInfoAnalysisEngine.java:75)
[spotbugs] At edu.umd.cs.findbugs.classfile.engine.ClassInfoAnalysisEngine.analyze(ClassInfoAnalysisEngine.java:38)
[spotbugs] At edu.umd.cs.findbugs.classfile.impl.AnalysisCache.getClassAnalysis(AnalysisCache.java:261)
[spotbugs] At edu.umd.cs.findbugs.ba.XFactory.getXClass(XFactory.java:693)
[spotbugs] At edu.umd.cs.findbugs.ba.AnalysisContext.setAppClassList(AnalysisContext.java:975)
[spotbugs] At edu.umd.cs.findbugs.FindBugs2.setAppClassList(FindBugs2.java:909)
[spotbugs] At edu.umd.cs.findbugs.FindBugs2.execute(FindBugs2.java:252)
[spotbugs] At edu.umd.cs.findbugs.FindBugs.runMain(FindBugs.java:395)
[spotbugs] At edu.umd.cs.findbugs.FindBugs2.main(FindBugs2.java:1231)
[spotbugs]
[spotbugs] java.lang.IllegalArgumentException: Unsupported class file major version 68
[spotbugs] at org.objectweb.asm.ClassReader.<init>(ClassReader.java:200)
[spotbugs] at org.objectweb.asm.ClassReader.<init>(ClassReader.java:180)
[spotbugs] at org.objectweb.asm.ClassReader.<init>(ClassReader.java:166)
[spotbugs] at edu.umd.cs.findbugs.asm.FBClassReader.<init>(FBClassReader.java:35)
[spotbugs] at edu.umd.cs.findbugs.classfile.engine.asm.ClassReaderAnalysisEngine.analyze(ClassReaderAnalysisEngine.java:48)
[spotbugs] at edu.umd.cs.findbugs.classfile.engine.asm.ClassReaderAnalysisEngine.analyze(ClassReaderAnalysisEngine.java:34)
[spotbugs] at edu.umd.cs.findbugs.classfile.impl.AnalysisCache.getClassAnalysis(AnalysisCache.java:261)
[spotbugs] at edu.umd.cs.findbugs.classfile.engine.ClassInfoAnalysisEngine.analyze(ClassInfoAnalysisEngine.java:75)
[spotbugs] at edu.umd.cs.findbugs.classfile.engine.ClassInfoAnalysisEngine.analyze(ClassInfoAnalysisEngine.java:38)
[spotbugs] at edu.umd.cs.findbugs.classfile.impl.AnalysisCache.getClassAnalysis(AnalysisCache.java:261)
[spotbugs] at edu.umd.cs.findbugs.ba.XFactory.getXClass(XFactory.java:693)
[spotbugs] at edu.umd.cs.findbugs.ba.AnalysisContext.setAppClassList(AnalysisContext.java:975)
[spotbugs] at edu.umd.cs.findbugs.FindBugs2.setAppClassList(FindBugs2.java:909)
[spotbugs] at edu.umd.cs.findbugs.FindBugs2.execute(FindBugs2.java:252)
[spotbugs] at edu.umd.cs.findbugs.FindBugs.runMain(FindBugs.java:395)
[spotbugs] at edu.umd.cs.findbugs.FindBugs2.main(FindBugs2.java:1231)
[spotbugs] Java Result: 4
BUILD FAILED
<https://ci-builds.apache.org/job/POI/job/POI-DSL-1.24/ws/build.xml>:2651: Execution of SpotBugs failed.
Total time: 30 minutes 0 seconds
Build step 'Invoke Ant' marked build as failure
ERROR: Not all environment variables could be successfully injected. Check for similarly-named environment variables.
Archiving artifacts
ERROR: Not all environment variables could be successfully injected. Check for similarly-named environment variables.
Recording test results
ERROR: Not all environment variables could be successfully injected. Check for similarly-named environment variables.
[Checks API] No suitable checks publisher found.
ERROR: Not all environment variables could be successfully injected. Check for similarly-named environment variables.
---------------------------------------------------------------------
To unsubscribe, e-mail: dev-unsubscribe@poi.apache.org
For additional commands, e-mail: dev-help@poi.apache.org
Build failed in Jenkins: POI » POI-DSL-1.24 #11
Posted by Apache Jenkins Server <je...@builds.apache.org>.
See <https://ci-builds.apache.org/job/POI/job/POI-DSL-1.24/11/display/redirect?page=changes>
Changes:
[PJ Fanning] pdfbox 3.0.4
[PJ Fanning] pdfbox 3.0.4
[Dominik Stadler] Some changes to the Gradle build
Apply IDE suggestions for Gradle build files
Remove obsolete sorting of gradle-wrapper.properties
[PJ Fanning] bytebuddy 1.16.1
[Dominik Stadler] Bug 66425: Avoid exceptions found via poi-fuzz
Prevent too deep nesting by throwing an exception
instead of just not parsing more nesting-levels as
this still caused OOMs.
Allow to adjust the limit via static setter as elsewhere
to give users a chance to parse very complicated files
if really necessary.
https://issues.oss-fuzz.com/issues/42528505
[Dominik Stadler] Bug 66425: Avoid exceptions found via poi-fuzz
Prevent NullPointerException
Fixes https://issues.oss-fuzz.com/issues/389724915
------------------------------------------
[...truncated 9.82 MiB...]
[spotbugs] At edu.umd.cs.findbugs.FindBugs2.execute(FindBugs2.java:252)
[spotbugs] At edu.umd.cs.findbugs.FindBugs.runMain(FindBugs.java:395)
[spotbugs] At edu.umd.cs.findbugs.FindBugs2.main(FindBugs2.java:1231)
[spotbugs] Couldn't get class info for java/util/regex/MatchResult
[spotbugs] java.lang.IllegalArgumentException: Unsupported class file major version 68
[spotbugs] At org.objectweb.asm.ClassReader.<init>(ClassReader.java:200)
[spotbugs] At org.objectweb.asm.ClassReader.<init>(ClassReader.java:180)
[spotbugs] At org.objectweb.asm.ClassReader.<init>(ClassReader.java:166)
[spotbugs] At edu.umd.cs.findbugs.asm.FBClassReader.<init>(FBClassReader.java:35)
[spotbugs] At edu.umd.cs.findbugs.classfile.engine.asm.ClassReaderAnalysisEngine.analyze(ClassReaderAnalysisEngine.java:48)
[spotbugs] At edu.umd.cs.findbugs.classfile.engine.asm.ClassReaderAnalysisEngine.analyze(ClassReaderAnalysisEngine.java:34)
[spotbugs] At edu.umd.cs.findbugs.classfile.impl.AnalysisCache.getClassAnalysis(AnalysisCache.java:261)
[spotbugs] At edu.umd.cs.findbugs.classfile.engine.ClassInfoAnalysisEngine.analyze(ClassInfoAnalysisEngine.java:75)
[spotbugs] At edu.umd.cs.findbugs.classfile.engine.ClassInfoAnalysisEngine.analyze(ClassInfoAnalysisEngine.java:38)
[spotbugs] At edu.umd.cs.findbugs.classfile.impl.AnalysisCache.getClassAnalysis(AnalysisCache.java:261)
[spotbugs] At edu.umd.cs.findbugs.ba.XFactory.getXClass(XFactory.java:693)
[spotbugs] At edu.umd.cs.findbugs.ba.AnalysisContext.setAppClassList(AnalysisContext.java:975)
[spotbugs] At edu.umd.cs.findbugs.FindBugs2.setAppClassList(FindBugs2.java:909)
[spotbugs] At edu.umd.cs.findbugs.FindBugs2.execute(FindBugs2.java:252)
[spotbugs] At edu.umd.cs.findbugs.FindBugs.runMain(FindBugs.java:395)
[spotbugs] At edu.umd.cs.findbugs.FindBugs2.main(FindBugs2.java:1231)
[spotbugs] Couldn't get class info for javax/xml/crypto/dsig/spec/SignatureMethodParameterSpec
[spotbugs] java.lang.IllegalArgumentException: Unsupported class file major version 68
[spotbugs] At org.objectweb.asm.ClassReader.<init>(ClassReader.java:200)
[spotbugs] At org.objectweb.asm.ClassReader.<init>(ClassReader.java:180)
[spotbugs] At org.objectweb.asm.ClassReader.<init>(ClassReader.java:166)
[spotbugs] At edu.umd.cs.findbugs.asm.FBClassReader.<init>(FBClassReader.java:35)
[spotbugs] At edu.umd.cs.findbugs.classfile.engine.asm.ClassReaderAnalysisEngine.analyze(ClassReaderAnalysisEngine.java:48)
[spotbugs] At edu.umd.cs.findbugs.classfile.engine.asm.ClassReaderAnalysisEngine.analyze(ClassReaderAnalysisEngine.java:34)
[spotbugs] At edu.umd.cs.findbugs.classfile.impl.AnalysisCache.getClassAnalysis(AnalysisCache.java:261)
[spotbugs] At edu.umd.cs.findbugs.classfile.engine.ClassInfoAnalysisEngine.analyze(ClassInfoAnalysisEngine.java:75)
[spotbugs] At edu.umd.cs.findbugs.classfile.engine.ClassInfoAnalysisEngine.analyze(ClassInfoAnalysisEngine.java:38)
[spotbugs] At edu.umd.cs.findbugs.classfile.impl.AnalysisCache.getClassAnalysis(AnalysisCache.java:261)
[spotbugs] At edu.umd.cs.findbugs.ba.XFactory.getXClass(XFactory.java:693)
[spotbugs] At edu.umd.cs.findbugs.ba.AnalysisContext.setAppClassList(AnalysisContext.java:975)
[spotbugs] At edu.umd.cs.findbugs.FindBugs2.setAppClassList(FindBugs2.java:909)
[spotbugs] At edu.umd.cs.findbugs.FindBugs2.execute(FindBugs2.java:252)
[spotbugs] At edu.umd.cs.findbugs.FindBugs.runMain(FindBugs.java:395)
[spotbugs] At edu.umd.cs.findbugs.FindBugs2.main(FindBugs2.java:1231)
[spotbugs] Couldn't get class info for java/util/Random
[spotbugs] java.lang.IllegalArgumentException: Unsupported class file major version 68
[spotbugs] At org.objectweb.asm.ClassReader.<init>(ClassReader.java:200)
[spotbugs] At org.objectweb.asm.ClassReader.<init>(ClassReader.java:180)
[spotbugs] At org.objectweb.asm.ClassReader.<init>(ClassReader.java:166)
[spotbugs] At edu.umd.cs.findbugs.asm.FBClassReader.<init>(FBClassReader.java:35)
[spotbugs] At edu.umd.cs.findbugs.classfile.engine.asm.ClassReaderAnalysisEngine.analyze(ClassReaderAnalysisEngine.java:48)
[spotbugs] At edu.umd.cs.findbugs.classfile.engine.asm.ClassReaderAnalysisEngine.analyze(ClassReaderAnalysisEngine.java:34)
[spotbugs] At edu.umd.cs.findbugs.classfile.impl.AnalysisCache.getClassAnalysis(AnalysisCache.java:261)
[spotbugs] At edu.umd.cs.findbugs.classfile.engine.ClassInfoAnalysisEngine.analyze(ClassInfoAnalysisEngine.java:75)
[spotbugs] At edu.umd.cs.findbugs.classfile.engine.ClassInfoAnalysisEngine.analyze(ClassInfoAnalysisEngine.java:38)
[spotbugs] At edu.umd.cs.findbugs.classfile.impl.AnalysisCache.getClassAnalysis(AnalysisCache.java:261)
[spotbugs] At edu.umd.cs.findbugs.ba.XFactory.getXClass(XFactory.java:693)
[spotbugs] At edu.umd.cs.findbugs.ba.AnalysisContext.setAppClassList(AnalysisContext.java:975)
[spotbugs] At edu.umd.cs.findbugs.FindBugs2.setAppClassList(FindBugs2.java:909)
[spotbugs] At edu.umd.cs.findbugs.FindBugs2.execute(FindBugs2.java:252)
[spotbugs] At edu.umd.cs.findbugs.FindBugs.runMain(FindBugs.java:395)
[spotbugs] At edu.umd.cs.findbugs.FindBugs2.main(FindBugs2.java:1231)
[spotbugs] Couldn't get class info for java/nio/file/attribute/BasicFileAttributes
[spotbugs] java.lang.IllegalArgumentException: Unsupported class file major version 68
[spotbugs] At org.objectweb.asm.ClassReader.<init>(ClassReader.java:200)
[spotbugs] At org.objectweb.asm.ClassReader.<init>(ClassReader.java:180)
[spotbugs] At org.objectweb.asm.ClassReader.<init>(ClassReader.java:166)
[spotbugs] At edu.umd.cs.findbugs.asm.FBClassReader.<init>(FBClassReader.java:35)
[spotbugs] At edu.umd.cs.findbugs.classfile.engine.asm.ClassReaderAnalysisEngine.analyze(ClassReaderAnalysisEngine.java:48)
[spotbugs] At edu.umd.cs.findbugs.classfile.engine.asm.ClassReaderAnalysisEngine.analyze(ClassReaderAnalysisEngine.java:34)
[spotbugs] At edu.umd.cs.findbugs.classfile.impl.AnalysisCache.getClassAnalysis(AnalysisCache.java:261)
[spotbugs] At edu.umd.cs.findbugs.classfile.engine.ClassInfoAnalysisEngine.analyze(ClassInfoAnalysisEngine.java:75)
[spotbugs] At edu.umd.cs.findbugs.classfile.engine.ClassInfoAnalysisEngine.analyze(ClassInfoAnalysisEngine.java:38)
[spotbugs] At edu.umd.cs.findbugs.classfile.impl.AnalysisCache.getClassAnalysis(AnalysisCache.java:261)
[spotbugs] At edu.umd.cs.findbugs.ba.XFactory.getXClass(XFactory.java:693)
[spotbugs] At edu.umd.cs.findbugs.ba.AnalysisContext.setAppClassList(AnalysisContext.java:975)
[spotbugs] At edu.umd.cs.findbugs.FindBugs2.setAppClassList(FindBugs2.java:909)
[spotbugs] At edu.umd.cs.findbugs.FindBugs2.execute(FindBugs2.java:252)
[spotbugs] At edu.umd.cs.findbugs.FindBugs.runMain(FindBugs.java:395)
[spotbugs] At edu.umd.cs.findbugs.FindBugs2.main(FindBugs2.java:1231)
[spotbugs] Couldn't get class info for java/util/Locale
[spotbugs] java.lang.IllegalArgumentException: Unsupported class file major version 68
[spotbugs] At org.objectweb.asm.ClassReader.<init>(ClassReader.java:200)
[spotbugs] At org.objectweb.asm.ClassReader.<init>(ClassReader.java:180)
[spotbugs] At org.objectweb.asm.ClassReader.<init>(ClassReader.java:166)
[spotbugs] At edu.umd.cs.findbugs.asm.FBClassReader.<init>(FBClassReader.java:35)
[spotbugs] At edu.umd.cs.findbugs.classfile.engine.asm.ClassReaderAnalysisEngine.analyze(ClassReaderAnalysisEngine.java:48)
[spotbugs] At edu.umd.cs.findbugs.classfile.engine.asm.ClassReaderAnalysisEngine.analyze(ClassReaderAnalysisEngine.java:34)
[spotbugs] At edu.umd.cs.findbugs.classfile.impl.AnalysisCache.getClassAnalysis(AnalysisCache.java:261)
[spotbugs] At edu.umd.cs.findbugs.classfile.engine.ClassInfoAnalysisEngine.analyze(ClassInfoAnalysisEngine.java:75)
[spotbugs] At edu.umd.cs.findbugs.classfile.engine.ClassInfoAnalysisEngine.analyze(ClassInfoAnalysisEngine.java:38)
[spotbugs] At edu.umd.cs.findbugs.classfile.impl.AnalysisCache.getClassAnalysis(AnalysisCache.java:261)
[spotbugs] At edu.umd.cs.findbugs.ba.XFactory.getXClass(XFactory.java:693)
[spotbugs] At edu.umd.cs.findbugs.ba.AnalysisContext.setAppClassList(AnalysisContext.java:975)
[spotbugs] At edu.umd.cs.findbugs.FindBugs2.setAppClassList(FindBugs2.java:909)
[spotbugs] At edu.umd.cs.findbugs.FindBugs2.execute(FindBugs2.java:252)
[spotbugs] At edu.umd.cs.findbugs.FindBugs.runMain(FindBugs.java:395)
[spotbugs] At edu.umd.cs.findbugs.FindBugs2.main(FindBugs2.java:1231)
[spotbugs] Couldn't get class info for java/util/zip/Deflater
[spotbugs] java.lang.IllegalArgumentException: Unsupported class file major version 68
[spotbugs] At org.objectweb.asm.ClassReader.<init>(ClassReader.java:200)
[spotbugs] At org.objectweb.asm.ClassReader.<init>(ClassReader.java:180)
[spotbugs] At org.objectweb.asm.ClassReader.<init>(ClassReader.java:166)
[spotbugs] At edu.umd.cs.findbugs.asm.FBClassReader.<init>(FBClassReader.java:35)
[spotbugs] At edu.umd.cs.findbugs.classfile.engine.asm.ClassReaderAnalysisEngine.analyze(ClassReaderAnalysisEngine.java:48)
[spotbugs] At edu.umd.cs.findbugs.classfile.engine.asm.ClassReaderAnalysisEngine.analyze(ClassReaderAnalysisEngine.java:34)
[spotbugs] At edu.umd.cs.findbugs.classfile.impl.AnalysisCache.getClassAnalysis(AnalysisCache.java:261)
[spotbugs] At edu.umd.cs.findbugs.classfile.engine.ClassInfoAnalysisEngine.analyze(ClassInfoAnalysisEngine.java:75)
[spotbugs] At edu.umd.cs.findbugs.classfile.engine.ClassInfoAnalysisEngine.analyze(ClassInfoAnalysisEngine.java:38)
[spotbugs] At edu.umd.cs.findbugs.classfile.impl.AnalysisCache.getClassAnalysis(AnalysisCache.java:261)
[spotbugs] At edu.umd.cs.findbugs.ba.XFactory.getXClass(XFactory.java:693)
[spotbugs] At edu.umd.cs.findbugs.ba.AnalysisContext.setAppClassList(AnalysisContext.java:975)
[spotbugs] At edu.umd.cs.findbugs.FindBugs2.setAppClassList(FindBugs2.java:909)
[spotbugs] At edu.umd.cs.findbugs.FindBugs2.execute(FindBugs2.java:252)
[spotbugs] At edu.umd.cs.findbugs.FindBugs.runMain(FindBugs.java:395)
[spotbugs] At edu.umd.cs.findbugs.FindBugs2.main(FindBugs2.java:1231)
[spotbugs] Couldn't get class info for java/lang/AssertionError
[spotbugs] java.lang.IllegalArgumentException: Unsupported class file major version 68
[spotbugs] At org.objectweb.asm.ClassReader.<init>(ClassReader.java:200)
[spotbugs] At org.objectweb.asm.ClassReader.<init>(ClassReader.java:180)
[spotbugs] At org.objectweb.asm.ClassReader.<init>(ClassReader.java:166)
[spotbugs] At edu.umd.cs.findbugs.asm.FBClassReader.<init>(FBClassReader.java:35)
[spotbugs] At edu.umd.cs.findbugs.classfile.engine.asm.ClassReaderAnalysisEngine.analyze(ClassReaderAnalysisEngine.java:48)
[spotbugs] At edu.umd.cs.findbugs.classfile.engine.asm.ClassReaderAnalysisEngine.analyze(ClassReaderAnalysisEngine.java:34)
[spotbugs] At edu.umd.cs.findbugs.classfile.impl.AnalysisCache.getClassAnalysis(AnalysisCache.java:261)
[spotbugs] At edu.umd.cs.findbugs.classfile.engine.ClassInfoAnalysisEngine.analyze(ClassInfoAnalysisEngine.java:75)
[spotbugs] At edu.umd.cs.findbugs.classfile.engine.ClassInfoAnalysisEngine.analyze(ClassInfoAnalysisEngine.java:38)
[spotbugs] At edu.umd.cs.findbugs.classfile.impl.AnalysisCache.getClassAnalysis(AnalysisCache.java:261)
[spotbugs] At edu.umd.cs.findbugs.ba.XFactory.getXClass(XFactory.java:693)
[spotbugs] At edu.umd.cs.findbugs.ba.AnalysisContext.setAppClassList(AnalysisContext.java:975)
[spotbugs] At edu.umd.cs.findbugs.FindBugs2.setAppClassList(FindBugs2.java:909)
[spotbugs] At edu.umd.cs.findbugs.FindBugs2.execute(FindBugs2.java:252)
[spotbugs] At edu.umd.cs.findbugs.FindBugs.runMain(FindBugs.java:395)
[spotbugs] At edu.umd.cs.findbugs.FindBugs2.main(FindBugs2.java:1231)
[spotbugs] Couldn't get class info for java/util/Set
[spotbugs] java.lang.IllegalArgumentException: Unsupported class file major version 68
[spotbugs] At org.objectweb.asm.ClassReader.<init>(ClassReader.java:200)
[spotbugs] At org.objectweb.asm.ClassReader.<init>(ClassReader.java:180)
[spotbugs] At org.objectweb.asm.ClassReader.<init>(ClassReader.java:166)
[spotbugs] At edu.umd.cs.findbugs.asm.FBClassReader.<init>(FBClassReader.java:35)
[spotbugs] At edu.umd.cs.findbugs.classfile.engine.asm.ClassReaderAnalysisEngine.analyze(ClassReaderAnalysisEngine.java:48)
[spotbugs] At edu.umd.cs.findbugs.classfile.engine.asm.ClassReaderAnalysisEngine.analyze(ClassReaderAnalysisEngine.java:34)
[spotbugs] At edu.umd.cs.findbugs.classfile.impl.AnalysisCache.getClassAnalysis(AnalysisCache.java:261)
[spotbugs] At edu.umd.cs.findbugs.classfile.engine.ClassInfoAnalysisEngine.analyze(ClassInfoAnalysisEngine.java:75)
[spotbugs] At edu.umd.cs.findbugs.classfile.engine.ClassInfoAnalysisEngine.analyze(ClassInfoAnalysisEngine.java:38)
[spotbugs] At edu.umd.cs.findbugs.classfile.impl.AnalysisCache.getClassAnalysis(AnalysisCache.java:261)
[spotbugs] At edu.umd.cs.findbugs.ba.XFactory.getXClass(XFactory.java:693)
[spotbugs] At edu.umd.cs.findbugs.ba.AnalysisContext.setAppClassList(AnalysisContext.java:975)
[spotbugs] At edu.umd.cs.findbugs.FindBugs2.setAppClassList(FindBugs2.java:909)
[spotbugs] At edu.umd.cs.findbugs.FindBugs2.execute(FindBugs2.java:252)
[spotbugs] At edu.umd.cs.findbugs.FindBugs.runMain(FindBugs.java:395)
[spotbugs] At edu.umd.cs.findbugs.FindBugs2.main(FindBugs2.java:1231)
[spotbugs] Couldn't get class info for java/io/FilterInputStream
[spotbugs] java.lang.IllegalArgumentException: Unsupported class file major version 68
[spotbugs] At org.objectweb.asm.ClassReader.<init>(ClassReader.java:200)
[spotbugs] At org.objectweb.asm.ClassReader.<init>(ClassReader.java:180)
[spotbugs] At org.objectweb.asm.ClassReader.<init>(ClassReader.java:166)
[spotbugs] At edu.umd.cs.findbugs.asm.FBClassReader.<init>(FBClassReader.java:35)
[spotbugs] At edu.umd.cs.findbugs.classfile.engine.asm.ClassReaderAnalysisEngine.analyze(ClassReaderAnalysisEngine.java:48)
[spotbugs] At edu.umd.cs.findbugs.classfile.engine.asm.ClassReaderAnalysisEngine.analyze(ClassReaderAnalysisEngine.java:34)
[spotbugs] At edu.umd.cs.findbugs.classfile.impl.AnalysisCache.getClassAnalysis(AnalysisCache.java:261)
[spotbugs] At edu.umd.cs.findbugs.classfile.engine.ClassInfoAnalysisEngine.analyze(ClassInfoAnalysisEngine.java:75)
[spotbugs] At edu.umd.cs.findbugs.classfile.engine.ClassInfoAnalysisEngine.analyze(ClassInfoAnalysisEngine.java:38)
[spotbugs] At edu.umd.cs.findbugs.classfile.impl.AnalysisCache.getClassAnalysis(AnalysisCache.java:261)
[spotbugs] At edu.umd.cs.findbugs.FindBugs2.buildReferencedClassSet(FindBugs2.java:806)
[spotbugs] At edu.umd.cs.findbugs.FindBugs2.execute(FindBugs2.java:249)
[spotbugs] At edu.umd.cs.findbugs.FindBugs.runMain(FindBugs.java:395)
[spotbugs] At edu.umd.cs.findbugs.FindBugs2.main(FindBugs2.java:1231)
[spotbugs] Couldn't get class info for java/awt/AlphaComposite
[spotbugs] java.lang.IllegalArgumentException: Unsupported class file major version 68
[spotbugs] At org.objectweb.asm.ClassReader.<init>(ClassReader.java:200)
[spotbugs] At org.objectweb.asm.ClassReader.<init>(ClassReader.java:180)
[spotbugs] At org.objectweb.asm.ClassReader.<init>(ClassReader.java:166)
[spotbugs] At edu.umd.cs.findbugs.asm.FBClassReader.<init>(FBClassReader.java:35)
[spotbugs] At edu.umd.cs.findbugs.classfile.engine.asm.ClassReaderAnalysisEngine.analyze(ClassReaderAnalysisEngine.java:48)
[spotbugs] At edu.umd.cs.findbugs.classfile.engine.asm.ClassReaderAnalysisEngine.analyze(ClassReaderAnalysisEngine.java:34)
[spotbugs] At edu.umd.cs.findbugs.classfile.impl.AnalysisCache.getClassAnalysis(AnalysisCache.java:261)
[spotbugs] At edu.umd.cs.findbugs.classfile.engine.ClassInfoAnalysisEngine.analyze(ClassInfoAnalysisEngine.java:75)
[spotbugs] At edu.umd.cs.findbugs.classfile.engine.ClassInfoAnalysisEngine.analyze(ClassInfoAnalysisEngine.java:38)
[spotbugs] At edu.umd.cs.findbugs.classfile.impl.AnalysisCache.getClassAnalysis(AnalysisCache.java:261)
[spotbugs] At edu.umd.cs.findbugs.ba.XFactory.getXClass(XFactory.java:693)
[spotbugs] At edu.umd.cs.findbugs.ba.AnalysisContext.setAppClassList(AnalysisContext.java:975)
[spotbugs] At edu.umd.cs.findbugs.FindBugs2.setAppClassList(FindBugs2.java:909)
[spotbugs] At edu.umd.cs.findbugs.FindBugs2.execute(FindBugs2.java:252)
[spotbugs] At edu.umd.cs.findbugs.FindBugs.runMain(FindBugs.java:395)
[spotbugs] At edu.umd.cs.findbugs.FindBugs2.main(FindBugs2.java:1231)
[spotbugs] Couldn't get class info for java/awt/geom/Arc2D
[spotbugs] java.lang.IllegalArgumentException: Unsupported class file major version 68
[spotbugs] At org.objectweb.asm.ClassReader.<init>(ClassReader.java:200)
[spotbugs] At org.objectweb.asm.ClassReader.<init>(ClassReader.java:180)
[spotbugs] At org.objectweb.asm.ClassReader.<init>(ClassReader.java:166)
[spotbugs] At edu.umd.cs.findbugs.asm.FBClassReader.<init>(FBClassReader.java:35)
[spotbugs] At edu.umd.cs.findbugs.classfile.engine.asm.ClassReaderAnalysisEngine.analyze(ClassReaderAnalysisEngine.java:48)
[spotbugs] At edu.umd.cs.findbugs.classfile.engine.asm.ClassReaderAnalysisEngine.analyze(ClassReaderAnalysisEngine.java:34)
[spotbugs] At edu.umd.cs.findbugs.classfile.impl.AnalysisCache.getClassAnalysis(AnalysisCache.java:261)
[spotbugs] At edu.umd.cs.findbugs.classfile.engine.ClassInfoAnalysisEngine.analyze(ClassInfoAnalysisEngine.java:75)
[spotbugs] At edu.umd.cs.findbugs.classfile.engine.ClassInfoAnalysisEngine.analyze(ClassInfoAnalysisEngine.java:38)
[spotbugs] At edu.umd.cs.findbugs.classfile.impl.AnalysisCache.getClassAnalysis(AnalysisCache.java:261)
[spotbugs] At edu.umd.cs.findbugs.ba.XFactory.getXClass(XFactory.java:693)
[spotbugs] At edu.umd.cs.findbugs.ba.AnalysisContext.setAppClassList(AnalysisContext.java:975)
[spotbugs] At edu.umd.cs.findbugs.FindBugs2.setAppClassList(FindBugs2.java:909)
[spotbugs] At edu.umd.cs.findbugs.FindBugs2.execute(FindBugs2.java:252)
[spotbugs] At edu.umd.cs.findbugs.FindBugs.runMain(FindBugs.java:395)
[spotbugs] At edu.umd.cs.findbugs.FindBugs2.main(FindBugs2.java:1231)
[spotbugs] Couldn't get class info for java/security/DigestException
[spotbugs] java.lang.IllegalArgumentException: Unsupported class file major version 68
[spotbugs] At org.objectweb.asm.ClassReader.<init>(ClassReader.java:200)
[spotbugs] At org.objectweb.asm.ClassReader.<init>(ClassReader.java:180)
[spotbugs] At org.objectweb.asm.ClassReader.<init>(ClassReader.java:166)
[spotbugs] At edu.umd.cs.findbugs.asm.FBClassReader.<init>(FBClassReader.java:35)
[spotbugs] At edu.umd.cs.findbugs.classfile.engine.asm.ClassReaderAnalysisEngine.analyze(ClassReaderAnalysisEngine.java:48)
[spotbugs] At edu.umd.cs.findbugs.classfile.engine.asm.ClassReaderAnalysisEngine.analyze(ClassReaderAnalysisEngine.java:34)
[spotbugs] At edu.umd.cs.findbugs.classfile.impl.AnalysisCache.getClassAnalysis(AnalysisCache.java:261)
[spotbugs] At edu.umd.cs.findbugs.classfile.engine.ClassInfoAnalysisEngine.analyze(ClassInfoAnalysisEngine.java:75)
[spotbugs] At edu.umd.cs.findbugs.classfile.engine.ClassInfoAnalysisEngine.analyze(ClassInfoAnalysisEngine.java:38)
[spotbugs] At edu.umd.cs.findbugs.classfile.impl.AnalysisCache.getClassAnalysis(AnalysisCache.java:261)
[spotbugs] At edu.umd.cs.findbugs.ba.XFactory.getXClass(XFactory.java:693)
[spotbugs] At edu.umd.cs.findbugs.ba.AnalysisContext.setAppClassList(AnalysisContext.java:975)
[spotbugs] At edu.umd.cs.findbugs.FindBugs2.setAppClassList(FindBugs2.java:909)
[spotbugs] At edu.umd.cs.findbugs.FindBugs2.execute(FindBugs2.java:252)
[spotbugs] At edu.umd.cs.findbugs.FindBugs.runMain(FindBugs.java:395)
[spotbugs] At edu.umd.cs.findbugs.FindBugs2.main(FindBugs2.java:1231)
[spotbugs]
[spotbugs] java.lang.IllegalArgumentException: Unsupported class file major version 68
[spotbugs] at org.objectweb.asm.ClassReader.<init>(ClassReader.java:200)
[spotbugs] at org.objectweb.asm.ClassReader.<init>(ClassReader.java:180)
[spotbugs] at org.objectweb.asm.ClassReader.<init>(ClassReader.java:166)
[spotbugs] at edu.umd.cs.findbugs.asm.FBClassReader.<init>(FBClassReader.java:35)
[spotbugs] at edu.umd.cs.findbugs.classfile.engine.asm.ClassReaderAnalysisEngine.analyze(ClassReaderAnalysisEngine.java:48)
[spotbugs] at edu.umd.cs.findbugs.classfile.engine.asm.ClassReaderAnalysisEngine.analyze(ClassReaderAnalysisEngine.java:34)
[spotbugs] at edu.umd.cs.findbugs.classfile.impl.AnalysisCache.getClassAnalysis(AnalysisCache.java:261)
[spotbugs] at edu.umd.cs.findbugs.classfile.engine.ClassInfoAnalysisEngine.analyze(ClassInfoAnalysisEngine.java:75)
[spotbugs] at edu.umd.cs.findbugs.classfile.engine.ClassInfoAnalysisEngine.analyze(ClassInfoAnalysisEngine.java:38)
[spotbugs] at edu.umd.cs.findbugs.classfile.impl.AnalysisCache.getClassAnalysis(AnalysisCache.java:261)
[spotbugs] at edu.umd.cs.findbugs.ba.XFactory.getXClass(XFactory.java:693)
[spotbugs] at edu.umd.cs.findbugs.ba.AnalysisContext.setAppClassList(AnalysisContext.java:975)
[spotbugs] at edu.umd.cs.findbugs.FindBugs2.setAppClassList(FindBugs2.java:909)
[spotbugs] at edu.umd.cs.findbugs.FindBugs2.execute(FindBugs2.java:252)
[spotbugs] at edu.umd.cs.findbugs.FindBugs.runMain(FindBugs.java:395)
[spotbugs] at edu.umd.cs.findbugs.FindBugs2.main(FindBugs2.java:1231)
[spotbugs] Java Result: 4
BUILD FAILED
<https://ci-builds.apache.org/job/POI/job/POI-DSL-1.24/ws/build.xml>:2651: Execution of SpotBugs failed.
Total time: 22 minutes 0 seconds
Build step 'Invoke Ant' marked build as failure
ERROR: Not all environment variables could be successfully injected. Check for similarly-named environment variables.
Archiving artifacts
ERROR: Not all environment variables could be successfully injected. Check for similarly-named environment variables.
Recording test results
ERROR: Not all environment variables could be successfully injected. Check for similarly-named environment variables.
[Checks API] No suitable checks publisher found.
ERROR: Not all environment variables could be successfully injected. Check for similarly-named environment variables.
---------------------------------------------------------------------
To unsubscribe, e-mail: dev-unsubscribe@poi.apache.org
For additional commands, e-mail: dev-help@poi.apache.org
Build failed in Jenkins: POI » POI-DSL-1.24 #10
Posted by Apache Jenkins Server <je...@builds.apache.org>.
See <https://ci-builds.apache.org/job/POI/job/POI-DSL-1.24/10/display/redirect?page=changes>
Changes:
[PJ Fanning] bouncycastle 1.80
[PJ Fanning] bouncycastle 1.80
[PJ Fanning] remove strat line in last commit
[PJ Fanning] upgrade cyclonedx
[PJ Fanning] update changes
------------------------------------------
[...truncated 9.39 MiB...]
[spotbugs] At edu.umd.cs.findbugs.FindBugs2.execute(FindBugs2.java:252)
[spotbugs] At edu.umd.cs.findbugs.FindBugs.runMain(FindBugs.java:395)
[spotbugs] At edu.umd.cs.findbugs.FindBugs2.main(FindBugs2.java:1231)
[spotbugs] Couldn't get class info for java/util/regex/MatchResult
[spotbugs] java.lang.IllegalArgumentException: Unsupported class file major version 68
[spotbugs] At org.objectweb.asm.ClassReader.<init>(ClassReader.java:200)
[spotbugs] At org.objectweb.asm.ClassReader.<init>(ClassReader.java:180)
[spotbugs] At org.objectweb.asm.ClassReader.<init>(ClassReader.java:166)
[spotbugs] At edu.umd.cs.findbugs.asm.FBClassReader.<init>(FBClassReader.java:35)
[spotbugs] At edu.umd.cs.findbugs.classfile.engine.asm.ClassReaderAnalysisEngine.analyze(ClassReaderAnalysisEngine.java:48)
[spotbugs] At edu.umd.cs.findbugs.classfile.engine.asm.ClassReaderAnalysisEngine.analyze(ClassReaderAnalysisEngine.java:34)
[spotbugs] At edu.umd.cs.findbugs.classfile.impl.AnalysisCache.getClassAnalysis(AnalysisCache.java:261)
[spotbugs] At edu.umd.cs.findbugs.classfile.engine.ClassInfoAnalysisEngine.analyze(ClassInfoAnalysisEngine.java:75)
[spotbugs] At edu.umd.cs.findbugs.classfile.engine.ClassInfoAnalysisEngine.analyze(ClassInfoAnalysisEngine.java:38)
[spotbugs] At edu.umd.cs.findbugs.classfile.impl.AnalysisCache.getClassAnalysis(AnalysisCache.java:261)
[spotbugs] At edu.umd.cs.findbugs.ba.XFactory.getXClass(XFactory.java:693)
[spotbugs] At edu.umd.cs.findbugs.ba.AnalysisContext.setAppClassList(AnalysisContext.java:975)
[spotbugs] At edu.umd.cs.findbugs.FindBugs2.setAppClassList(FindBugs2.java:909)
[spotbugs] At edu.umd.cs.findbugs.FindBugs2.execute(FindBugs2.java:252)
[spotbugs] At edu.umd.cs.findbugs.FindBugs.runMain(FindBugs.java:395)
[spotbugs] At edu.umd.cs.findbugs.FindBugs2.main(FindBugs2.java:1231)
[spotbugs] Couldn't get class info for javax/xml/crypto/dsig/spec/SignatureMethodParameterSpec
[spotbugs] java.lang.IllegalArgumentException: Unsupported class file major version 68
[spotbugs] At org.objectweb.asm.ClassReader.<init>(ClassReader.java:200)
[spotbugs] At org.objectweb.asm.ClassReader.<init>(ClassReader.java:180)
[spotbugs] At org.objectweb.asm.ClassReader.<init>(ClassReader.java:166)
[spotbugs] At edu.umd.cs.findbugs.asm.FBClassReader.<init>(FBClassReader.java:35)
[spotbugs] At edu.umd.cs.findbugs.classfile.engine.asm.ClassReaderAnalysisEngine.analyze(ClassReaderAnalysisEngine.java:48)
[spotbugs] At edu.umd.cs.findbugs.classfile.engine.asm.ClassReaderAnalysisEngine.analyze(ClassReaderAnalysisEngine.java:34)
[spotbugs] At edu.umd.cs.findbugs.classfile.impl.AnalysisCache.getClassAnalysis(AnalysisCache.java:261)
[spotbugs] At edu.umd.cs.findbugs.classfile.engine.ClassInfoAnalysisEngine.analyze(ClassInfoAnalysisEngine.java:75)
[spotbugs] At edu.umd.cs.findbugs.classfile.engine.ClassInfoAnalysisEngine.analyze(ClassInfoAnalysisEngine.java:38)
[spotbugs] At edu.umd.cs.findbugs.classfile.impl.AnalysisCache.getClassAnalysis(AnalysisCache.java:261)
[spotbugs] At edu.umd.cs.findbugs.ba.XFactory.getXClass(XFactory.java:693)
[spotbugs] At edu.umd.cs.findbugs.ba.AnalysisContext.setAppClassList(AnalysisContext.java:975)
[spotbugs] At edu.umd.cs.findbugs.FindBugs2.setAppClassList(FindBugs2.java:909)
[spotbugs] At edu.umd.cs.findbugs.FindBugs2.execute(FindBugs2.java:252)
[spotbugs] At edu.umd.cs.findbugs.FindBugs.runMain(FindBugs.java:395)
[spotbugs] At edu.umd.cs.findbugs.FindBugs2.main(FindBugs2.java:1231)
[spotbugs] Couldn't get class info for java/util/Random
[spotbugs] java.lang.IllegalArgumentException: Unsupported class file major version 68
[spotbugs] At org.objectweb.asm.ClassReader.<init>(ClassReader.java:200)
[spotbugs] At org.objectweb.asm.ClassReader.<init>(ClassReader.java:180)
[spotbugs] At org.objectweb.asm.ClassReader.<init>(ClassReader.java:166)
[spotbugs] At edu.umd.cs.findbugs.asm.FBClassReader.<init>(FBClassReader.java:35)
[spotbugs] At edu.umd.cs.findbugs.classfile.engine.asm.ClassReaderAnalysisEngine.analyze(ClassReaderAnalysisEngine.java:48)
[spotbugs] At edu.umd.cs.findbugs.classfile.engine.asm.ClassReaderAnalysisEngine.analyze(ClassReaderAnalysisEngine.java:34)
[spotbugs] At edu.umd.cs.findbugs.classfile.impl.AnalysisCache.getClassAnalysis(AnalysisCache.java:261)
[spotbugs] At edu.umd.cs.findbugs.classfile.engine.ClassInfoAnalysisEngine.analyze(ClassInfoAnalysisEngine.java:75)
[spotbugs] At edu.umd.cs.findbugs.classfile.engine.ClassInfoAnalysisEngine.analyze(ClassInfoAnalysisEngine.java:38)
[spotbugs] At edu.umd.cs.findbugs.classfile.impl.AnalysisCache.getClassAnalysis(AnalysisCache.java:261)
[spotbugs] At edu.umd.cs.findbugs.ba.XFactory.getXClass(XFactory.java:693)
[spotbugs] At edu.umd.cs.findbugs.ba.AnalysisContext.setAppClassList(AnalysisContext.java:975)
[spotbugs] At edu.umd.cs.findbugs.FindBugs2.setAppClassList(FindBugs2.java:909)
[spotbugs] At edu.umd.cs.findbugs.FindBugs2.execute(FindBugs2.java:252)
[spotbugs] At edu.umd.cs.findbugs.FindBugs.runMain(FindBugs.java:395)
[spotbugs] At edu.umd.cs.findbugs.FindBugs2.main(FindBugs2.java:1231)
[spotbugs] Couldn't get class info for java/nio/file/attribute/BasicFileAttributes
[spotbugs] java.lang.IllegalArgumentException: Unsupported class file major version 68
[spotbugs] At org.objectweb.asm.ClassReader.<init>(ClassReader.java:200)
[spotbugs] At org.objectweb.asm.ClassReader.<init>(ClassReader.java:180)
[spotbugs] At org.objectweb.asm.ClassReader.<init>(ClassReader.java:166)
[spotbugs] At edu.umd.cs.findbugs.asm.FBClassReader.<init>(FBClassReader.java:35)
[spotbugs] At edu.umd.cs.findbugs.classfile.engine.asm.ClassReaderAnalysisEngine.analyze(ClassReaderAnalysisEngine.java:48)
[spotbugs] At edu.umd.cs.findbugs.classfile.engine.asm.ClassReaderAnalysisEngine.analyze(ClassReaderAnalysisEngine.java:34)
[spotbugs] At edu.umd.cs.findbugs.classfile.impl.AnalysisCache.getClassAnalysis(AnalysisCache.java:261)
[spotbugs] At edu.umd.cs.findbugs.classfile.engine.ClassInfoAnalysisEngine.analyze(ClassInfoAnalysisEngine.java:75)
[spotbugs] At edu.umd.cs.findbugs.classfile.engine.ClassInfoAnalysisEngine.analyze(ClassInfoAnalysisEngine.java:38)
[spotbugs] At edu.umd.cs.findbugs.classfile.impl.AnalysisCache.getClassAnalysis(AnalysisCache.java:261)
[spotbugs] At edu.umd.cs.findbugs.ba.XFactory.getXClass(XFactory.java:693)
[spotbugs] At edu.umd.cs.findbugs.ba.AnalysisContext.setAppClassList(AnalysisContext.java:975)
[spotbugs] At edu.umd.cs.findbugs.FindBugs2.setAppClassList(FindBugs2.java:909)
[spotbugs] At edu.umd.cs.findbugs.FindBugs2.execute(FindBugs2.java:252)
[spotbugs] At edu.umd.cs.findbugs.FindBugs.runMain(FindBugs.java:395)
[spotbugs] At edu.umd.cs.findbugs.FindBugs2.main(FindBugs2.java:1231)
[spotbugs] Couldn't get class info for java/util/Locale
[spotbugs] java.lang.IllegalArgumentException: Unsupported class file major version 68
[spotbugs] At org.objectweb.asm.ClassReader.<init>(ClassReader.java:200)
[spotbugs] At org.objectweb.asm.ClassReader.<init>(ClassReader.java:180)
[spotbugs] At org.objectweb.asm.ClassReader.<init>(ClassReader.java:166)
[spotbugs] At edu.umd.cs.findbugs.asm.FBClassReader.<init>(FBClassReader.java:35)
[spotbugs] At edu.umd.cs.findbugs.classfile.engine.asm.ClassReaderAnalysisEngine.analyze(ClassReaderAnalysisEngine.java:48)
[spotbugs] At edu.umd.cs.findbugs.classfile.engine.asm.ClassReaderAnalysisEngine.analyze(ClassReaderAnalysisEngine.java:34)
[spotbugs] At edu.umd.cs.findbugs.classfile.impl.AnalysisCache.getClassAnalysis(AnalysisCache.java:261)
[spotbugs] At edu.umd.cs.findbugs.classfile.engine.ClassInfoAnalysisEngine.analyze(ClassInfoAnalysisEngine.java:75)
[spotbugs] At edu.umd.cs.findbugs.classfile.engine.ClassInfoAnalysisEngine.analyze(ClassInfoAnalysisEngine.java:38)
[spotbugs] At edu.umd.cs.findbugs.classfile.impl.AnalysisCache.getClassAnalysis(AnalysisCache.java:261)
[spotbugs] At edu.umd.cs.findbugs.ba.XFactory.getXClass(XFactory.java:693)
[spotbugs] At edu.umd.cs.findbugs.ba.AnalysisContext.setAppClassList(AnalysisContext.java:975)
[spotbugs] At edu.umd.cs.findbugs.FindBugs2.setAppClassList(FindBugs2.java:909)
[spotbugs] At edu.umd.cs.findbugs.FindBugs2.execute(FindBugs2.java:252)
[spotbugs] At edu.umd.cs.findbugs.FindBugs.runMain(FindBugs.java:395)
[spotbugs] At edu.umd.cs.findbugs.FindBugs2.main(FindBugs2.java:1231)
[spotbugs] Couldn't get class info for java/util/zip/Deflater
[spotbugs] java.lang.IllegalArgumentException: Unsupported class file major version 68
[spotbugs] At org.objectweb.asm.ClassReader.<init>(ClassReader.java:200)
[spotbugs] At org.objectweb.asm.ClassReader.<init>(ClassReader.java:180)
[spotbugs] At org.objectweb.asm.ClassReader.<init>(ClassReader.java:166)
[spotbugs] At edu.umd.cs.findbugs.asm.FBClassReader.<init>(FBClassReader.java:35)
[spotbugs] At edu.umd.cs.findbugs.classfile.engine.asm.ClassReaderAnalysisEngine.analyze(ClassReaderAnalysisEngine.java:48)
[spotbugs] At edu.umd.cs.findbugs.classfile.engine.asm.ClassReaderAnalysisEngine.analyze(ClassReaderAnalysisEngine.java:34)
[spotbugs] At edu.umd.cs.findbugs.classfile.impl.AnalysisCache.getClassAnalysis(AnalysisCache.java:261)
[spotbugs] At edu.umd.cs.findbugs.classfile.engine.ClassInfoAnalysisEngine.analyze(ClassInfoAnalysisEngine.java:75)
[spotbugs] At edu.umd.cs.findbugs.classfile.engine.ClassInfoAnalysisEngine.analyze(ClassInfoAnalysisEngine.java:38)
[spotbugs] At edu.umd.cs.findbugs.classfile.impl.AnalysisCache.getClassAnalysis(AnalysisCache.java:261)
[spotbugs] At edu.umd.cs.findbugs.ba.XFactory.getXClass(XFactory.java:693)
[spotbugs] At edu.umd.cs.findbugs.ba.AnalysisContext.setAppClassList(AnalysisContext.java:975)
[spotbugs] At edu.umd.cs.findbugs.FindBugs2.setAppClassList(FindBugs2.java:909)
[spotbugs] At edu.umd.cs.findbugs.FindBugs2.execute(FindBugs2.java:252)
[spotbugs] At edu.umd.cs.findbugs.FindBugs.runMain(FindBugs.java:395)
[spotbugs] At edu.umd.cs.findbugs.FindBugs2.main(FindBugs2.java:1231)
[spotbugs] Couldn't get class info for java/lang/AssertionError
[spotbugs] java.lang.IllegalArgumentException: Unsupported class file major version 68
[spotbugs] At org.objectweb.asm.ClassReader.<init>(ClassReader.java:200)
[spotbugs] At org.objectweb.asm.ClassReader.<init>(ClassReader.java:180)
[spotbugs] At org.objectweb.asm.ClassReader.<init>(ClassReader.java:166)
[spotbugs] At edu.umd.cs.findbugs.asm.FBClassReader.<init>(FBClassReader.java:35)
[spotbugs] At edu.umd.cs.findbugs.classfile.engine.asm.ClassReaderAnalysisEngine.analyze(ClassReaderAnalysisEngine.java:48)
[spotbugs] At edu.umd.cs.findbugs.classfile.engine.asm.ClassReaderAnalysisEngine.analyze(ClassReaderAnalysisEngine.java:34)
[spotbugs] At edu.umd.cs.findbugs.classfile.impl.AnalysisCache.getClassAnalysis(AnalysisCache.java:261)
[spotbugs] At edu.umd.cs.findbugs.classfile.engine.ClassInfoAnalysisEngine.analyze(ClassInfoAnalysisEngine.java:75)
[spotbugs] At edu.umd.cs.findbugs.classfile.engine.ClassInfoAnalysisEngine.analyze(ClassInfoAnalysisEngine.java:38)
[spotbugs] At edu.umd.cs.findbugs.classfile.impl.AnalysisCache.getClassAnalysis(AnalysisCache.java:261)
[spotbugs] At edu.umd.cs.findbugs.ba.XFactory.getXClass(XFactory.java:693)
[spotbugs] At edu.umd.cs.findbugs.ba.AnalysisContext.setAppClassList(AnalysisContext.java:975)
[spotbugs] At edu.umd.cs.findbugs.FindBugs2.setAppClassList(FindBugs2.java:909)
[spotbugs] At edu.umd.cs.findbugs.FindBugs2.execute(FindBugs2.java:252)
[spotbugs] At edu.umd.cs.findbugs.FindBugs.runMain(FindBugs.java:395)
[spotbugs] At edu.umd.cs.findbugs.FindBugs2.main(FindBugs2.java:1231)
[spotbugs] Couldn't get class info for java/util/Set
[spotbugs] java.lang.IllegalArgumentException: Unsupported class file major version 68
[spotbugs] At org.objectweb.asm.ClassReader.<init>(ClassReader.java:200)
[spotbugs] At org.objectweb.asm.ClassReader.<init>(ClassReader.java:180)
[spotbugs] At org.objectweb.asm.ClassReader.<init>(ClassReader.java:166)
[spotbugs] At edu.umd.cs.findbugs.asm.FBClassReader.<init>(FBClassReader.java:35)
[spotbugs] At edu.umd.cs.findbugs.classfile.engine.asm.ClassReaderAnalysisEngine.analyze(ClassReaderAnalysisEngine.java:48)
[spotbugs] At edu.umd.cs.findbugs.classfile.engine.asm.ClassReaderAnalysisEngine.analyze(ClassReaderAnalysisEngine.java:34)
[spotbugs] At edu.umd.cs.findbugs.classfile.impl.AnalysisCache.getClassAnalysis(AnalysisCache.java:261)
[spotbugs] At edu.umd.cs.findbugs.classfile.engine.ClassInfoAnalysisEngine.analyze(ClassInfoAnalysisEngine.java:75)
[spotbugs] At edu.umd.cs.findbugs.classfile.engine.ClassInfoAnalysisEngine.analyze(ClassInfoAnalysisEngine.java:38)
[spotbugs] At edu.umd.cs.findbugs.classfile.impl.AnalysisCache.getClassAnalysis(AnalysisCache.java:261)
[spotbugs] At edu.umd.cs.findbugs.ba.XFactory.getXClass(XFactory.java:693)
[spotbugs] At edu.umd.cs.findbugs.ba.AnalysisContext.setAppClassList(AnalysisContext.java:975)
[spotbugs] At edu.umd.cs.findbugs.FindBugs2.setAppClassList(FindBugs2.java:909)
[spotbugs] At edu.umd.cs.findbugs.FindBugs2.execute(FindBugs2.java:252)
[spotbugs] At edu.umd.cs.findbugs.FindBugs.runMain(FindBugs.java:395)
[spotbugs] At edu.umd.cs.findbugs.FindBugs2.main(FindBugs2.java:1231)
[spotbugs] Couldn't get class info for java/io/FilterInputStream
[spotbugs] java.lang.IllegalArgumentException: Unsupported class file major version 68
[spotbugs] At org.objectweb.asm.ClassReader.<init>(ClassReader.java:200)
[spotbugs] At org.objectweb.asm.ClassReader.<init>(ClassReader.java:180)
[spotbugs] At org.objectweb.asm.ClassReader.<init>(ClassReader.java:166)
[spotbugs] At edu.umd.cs.findbugs.asm.FBClassReader.<init>(FBClassReader.java:35)
[spotbugs] At edu.umd.cs.findbugs.classfile.engine.asm.ClassReaderAnalysisEngine.analyze(ClassReaderAnalysisEngine.java:48)
[spotbugs] At edu.umd.cs.findbugs.classfile.engine.asm.ClassReaderAnalysisEngine.analyze(ClassReaderAnalysisEngine.java:34)
[spotbugs] At edu.umd.cs.findbugs.classfile.impl.AnalysisCache.getClassAnalysis(AnalysisCache.java:261)
[spotbugs] At edu.umd.cs.findbugs.classfile.engine.ClassInfoAnalysisEngine.analyze(ClassInfoAnalysisEngine.java:75)
[spotbugs] At edu.umd.cs.findbugs.classfile.engine.ClassInfoAnalysisEngine.analyze(ClassInfoAnalysisEngine.java:38)
[spotbugs] At edu.umd.cs.findbugs.classfile.impl.AnalysisCache.getClassAnalysis(AnalysisCache.java:261)
[spotbugs] At edu.umd.cs.findbugs.FindBugs2.buildReferencedClassSet(FindBugs2.java:806)
[spotbugs] At edu.umd.cs.findbugs.FindBugs2.execute(FindBugs2.java:249)
[spotbugs] At edu.umd.cs.findbugs.FindBugs.runMain(FindBugs.java:395)
[spotbugs] At edu.umd.cs.findbugs.FindBugs2.main(FindBugs2.java:1231)
[spotbugs] Couldn't get class info for java/awt/AlphaComposite
[spotbugs] java.lang.IllegalArgumentException: Unsupported class file major version 68
[spotbugs] At org.objectweb.asm.ClassReader.<init>(ClassReader.java:200)
[spotbugs] At org.objectweb.asm.ClassReader.<init>(ClassReader.java:180)
[spotbugs] At org.objectweb.asm.ClassReader.<init>(ClassReader.java:166)
[spotbugs] At edu.umd.cs.findbugs.asm.FBClassReader.<init>(FBClassReader.java:35)
[spotbugs] At edu.umd.cs.findbugs.classfile.engine.asm.ClassReaderAnalysisEngine.analyze(ClassReaderAnalysisEngine.java:48)
[spotbugs] At edu.umd.cs.findbugs.classfile.engine.asm.ClassReaderAnalysisEngine.analyze(ClassReaderAnalysisEngine.java:34)
[spotbugs] At edu.umd.cs.findbugs.classfile.impl.AnalysisCache.getClassAnalysis(AnalysisCache.java:261)
[spotbugs] At edu.umd.cs.findbugs.classfile.engine.ClassInfoAnalysisEngine.analyze(ClassInfoAnalysisEngine.java:75)
[spotbugs] At edu.umd.cs.findbugs.classfile.engine.ClassInfoAnalysisEngine.analyze(ClassInfoAnalysisEngine.java:38)
[spotbugs] At edu.umd.cs.findbugs.classfile.impl.AnalysisCache.getClassAnalysis(AnalysisCache.java:261)
[spotbugs] At edu.umd.cs.findbugs.ba.XFactory.getXClass(XFactory.java:693)
[spotbugs] At edu.umd.cs.findbugs.ba.AnalysisContext.setAppClassList(AnalysisContext.java:975)
[spotbugs] At edu.umd.cs.findbugs.FindBugs2.setAppClassList(FindBugs2.java:909)
[spotbugs] At edu.umd.cs.findbugs.FindBugs2.execute(FindBugs2.java:252)
[spotbugs] At edu.umd.cs.findbugs.FindBugs.runMain(FindBugs.java:395)
[spotbugs] At edu.umd.cs.findbugs.FindBugs2.main(FindBugs2.java:1231)
[spotbugs] Couldn't get class info for java/awt/geom/Arc2D
[spotbugs] java.lang.IllegalArgumentException: Unsupported class file major version 68
[spotbugs] At org.objectweb.asm.ClassReader.<init>(ClassReader.java:200)
[spotbugs] At org.objectweb.asm.ClassReader.<init>(ClassReader.java:180)
[spotbugs] At org.objectweb.asm.ClassReader.<init>(ClassReader.java:166)
[spotbugs] At edu.umd.cs.findbugs.asm.FBClassReader.<init>(FBClassReader.java:35)
[spotbugs] At edu.umd.cs.findbugs.classfile.engine.asm.ClassReaderAnalysisEngine.analyze(ClassReaderAnalysisEngine.java:48)
[spotbugs] At edu.umd.cs.findbugs.classfile.engine.asm.ClassReaderAnalysisEngine.analyze(ClassReaderAnalysisEngine.java:34)
[spotbugs] At edu.umd.cs.findbugs.classfile.impl.AnalysisCache.getClassAnalysis(AnalysisCache.java:261)
[spotbugs] At edu.umd.cs.findbugs.classfile.engine.ClassInfoAnalysisEngine.analyze(ClassInfoAnalysisEngine.java:75)
[spotbugs] At edu.umd.cs.findbugs.classfile.engine.ClassInfoAnalysisEngine.analyze(ClassInfoAnalysisEngine.java:38)
[spotbugs] At edu.umd.cs.findbugs.classfile.impl.AnalysisCache.getClassAnalysis(AnalysisCache.java:261)
[spotbugs] At edu.umd.cs.findbugs.ba.XFactory.getXClass(XFactory.java:693)
[spotbugs] At edu.umd.cs.findbugs.ba.AnalysisContext.setAppClassList(AnalysisContext.java:975)
[spotbugs] At edu.umd.cs.findbugs.FindBugs2.setAppClassList(FindBugs2.java:909)
[spotbugs] At edu.umd.cs.findbugs.FindBugs2.execute(FindBugs2.java:252)
[spotbugs] At edu.umd.cs.findbugs.FindBugs.runMain(FindBugs.java:395)
[spotbugs] At edu.umd.cs.findbugs.FindBugs2.main(FindBugs2.java:1231)
[spotbugs] Couldn't get class info for java/security/DigestException
[spotbugs] java.lang.IllegalArgumentException: Unsupported class file major version 68
[spotbugs] At org.objectweb.asm.ClassReader.<init>(ClassReader.java:200)
[spotbugs] At org.objectweb.asm.ClassReader.<init>(ClassReader.java:180)
[spotbugs] At org.objectweb.asm.ClassReader.<init>(ClassReader.java:166)
[spotbugs] At edu.umd.cs.findbugs.asm.FBClassReader.<init>(FBClassReader.java:35)
[spotbugs] At edu.umd.cs.findbugs.classfile.engine.asm.ClassReaderAnalysisEngine.analyze(ClassReaderAnalysisEngine.java:48)
[spotbugs] At edu.umd.cs.findbugs.classfile.engine.asm.ClassReaderAnalysisEngine.analyze(ClassReaderAnalysisEngine.java:34)
[spotbugs] At edu.umd.cs.findbugs.classfile.impl.AnalysisCache.getClassAnalysis(AnalysisCache.java:261)
[spotbugs] At edu.umd.cs.findbugs.classfile.engine.ClassInfoAnalysisEngine.analyze(ClassInfoAnalysisEngine.java:75)
[spotbugs] At edu.umd.cs.findbugs.classfile.engine.ClassInfoAnalysisEngine.analyze(ClassInfoAnalysisEngine.java:38)
[spotbugs] At edu.umd.cs.findbugs.classfile.impl.AnalysisCache.getClassAnalysis(AnalysisCache.java:261)
[spotbugs] At edu.umd.cs.findbugs.ba.XFactory.getXClass(XFactory.java:693)
[spotbugs] At edu.umd.cs.findbugs.ba.AnalysisContext.setAppClassList(AnalysisContext.java:975)
[spotbugs] At edu.umd.cs.findbugs.FindBugs2.setAppClassList(FindBugs2.java:909)
[spotbugs] At edu.umd.cs.findbugs.FindBugs2.execute(FindBugs2.java:252)
[spotbugs] At edu.umd.cs.findbugs.FindBugs.runMain(FindBugs.java:395)
[spotbugs] At edu.umd.cs.findbugs.FindBugs2.main(FindBugs2.java:1231)
[spotbugs]
[spotbugs] java.lang.IllegalArgumentException: Unsupported class file major version 68
[spotbugs] at org.objectweb.asm.ClassReader.<init>(ClassReader.java:200)
[spotbugs] at org.objectweb.asm.ClassReader.<init>(ClassReader.java:180)
[spotbugs] at org.objectweb.asm.ClassReader.<init>(ClassReader.java:166)
[spotbugs] at edu.umd.cs.findbugs.asm.FBClassReader.<init>(FBClassReader.java:35)
[spotbugs] at edu.umd.cs.findbugs.classfile.engine.asm.ClassReaderAnalysisEngine.analyze(ClassReaderAnalysisEngine.java:48)
[spotbugs] at edu.umd.cs.findbugs.classfile.engine.asm.ClassReaderAnalysisEngine.analyze(ClassReaderAnalysisEngine.java:34)
[spotbugs] at edu.umd.cs.findbugs.classfile.impl.AnalysisCache.getClassAnalysis(AnalysisCache.java:261)
[spotbugs] at edu.umd.cs.findbugs.classfile.engine.ClassInfoAnalysisEngine.analyze(ClassInfoAnalysisEngine.java:75)
[spotbugs] at edu.umd.cs.findbugs.classfile.engine.ClassInfoAnalysisEngine.analyze(ClassInfoAnalysisEngine.java:38)
[spotbugs] at edu.umd.cs.findbugs.classfile.impl.AnalysisCache.getClassAnalysis(AnalysisCache.java:261)
[spotbugs] at edu.umd.cs.findbugs.ba.XFactory.getXClass(XFactory.java:693)
[spotbugs] at edu.umd.cs.findbugs.ba.AnalysisContext.setAppClassList(AnalysisContext.java:975)
[spotbugs] at edu.umd.cs.findbugs.FindBugs2.setAppClassList(FindBugs2.java:909)
[spotbugs] at edu.umd.cs.findbugs.FindBugs2.execute(FindBugs2.java:252)
[spotbugs] at edu.umd.cs.findbugs.FindBugs.runMain(FindBugs.java:395)
[spotbugs] at edu.umd.cs.findbugs.FindBugs2.main(FindBugs2.java:1231)
[spotbugs] Java Result: 4
BUILD FAILED
<https://ci-builds.apache.org/job/POI/job/POI-DSL-1.24/ws/build.xml>:2651: Execution of SpotBugs failed.
Total time: 31 minutes 17 seconds
Build step 'Invoke Ant' marked build as failure
ERROR: Not all environment variables could be successfully injected. Check for similarly-named environment variables.
Archiving artifacts
ERROR: Not all environment variables could be successfully injected. Check for similarly-named environment variables.
Recording test results
ERROR: Not all environment variables could be successfully injected. Check for similarly-named environment variables.
[Checks API] No suitable checks publisher found.
ERROR: Not all environment variables could be successfully injected. Check for similarly-named environment variables.
---------------------------------------------------------------------
To unsubscribe, e-mail: dev-unsubscribe@poi.apache.org
For additional commands, e-mail: dev-help@poi.apache.org