You are viewing a plain text version of this content. The canonical link for it is here.
Posted to dev@geode.apache.org by Apache Jenkins Server <je...@builds.apache.org> on 2016/07/13 10:28:58 UTC
Build failed in Jenkins: Geode-release #8
See <https://builds.apache.org/job/Geode-release/8/changes>
Changes:
[wmarkito] GEODE-1598: fix auto-completion problems by telling jopt that all
------------------------------------------
[...truncated 595 lines...]
:geode-web:javadoc UP-TO-DATE
:geode-web:javadocJar
:geode-web:sourcesJar
:geode-web:war
:geode-web:signArchives SKIPPED
:geode-web-api:jar
:geode-web-api:javadoc
:geode-web-api:javadocJar
:geode-web-api:sourcesJar
:geode-web-api:war
:geode-web-api:signArchives SKIPPED
:geode-assembly:distTar
:geode-assembly:distZip
:geode-assembly:writeBuildInfo
:geode-assembly:srcDistTar
:geode-assembly:srcDistZip
:geode-assembly:signArchives SKIPPED
:geode-assembly:assemble
:geode-assembly:compileTestJavaNote: Some input files use or override a deprecated API.
Note: Recompile with -Xlint:deprecation for details.
Note: Some input files use unchecked or unsafe operations.
Note: Recompile with -Xlint:unchecked for details.
:geode-assembly:processTestResources
:geode-assembly:testClasses
:geode-assembly:checkMissedTests
:geode-assembly:installDist
:geode-assembly:test
:geode-assembly:check
:geode-assembly:build
:geode-assembly:distributedTest
:geode-assembly:flakyTest
:geode-assembly:integrationTest
:geode-common:assemble
:geode-common:compileTestJava
:geode-common:processTestResources UP-TO-DATE
:geode-common:testClasses
:geode-common:checkMissedTests
:geode-common:test
:geode-common:check
:geode-common:build
:geode-common:distributedTest
:geode-common:flakyTest
:geode-common:integrationTest
:geode-core:assemble
:geode-core:checkMissedTests
:geode-core:test
:geode-core:check
:geode-core:build
:geode-core:distributedTest
:geode-core:flakyTest
:geode-core:integrationTestUnexpected exception thrown.
org.gradle.messaging.remote.internal.MessageIOException: Could not read message from '/127.0.0.1:33936'.
at org.gradle.messaging.remote.internal.inet.SocketConnection.receive(SocketConnection.java:84)
at org.gradle.messaging.remote.internal.hub.MessageHub$ConnectionReceive.run(MessageHub.java:235)
at org.gradle.internal.concurrent.ExecutorPolicy$CatchAndRecordFailures.onExecute(ExecutorPolicy.java:54)
at org.gradle.internal.concurrent.StoppableExecutorImpl$1.run(StoppableExecutorImpl.java:40)
at java.util.concurrent.ThreadPoolExecutor.runWorker(ThreadPoolExecutor.java:1142)
at java.util.concurrent.ThreadPoolExecutor$Worker.run(ThreadPoolExecutor.java:617)
at java.lang.Thread.run(Thread.java:745)
Caused by: java.lang.IllegalArgumentException
at org.gradle.messaging.remote.internal.hub.InterHubMessageSerializer$MessageReader.read(InterHubMessageSerializer.java:71)
at org.gradle.messaging.remote.internal.hub.InterHubMessageSerializer$MessageReader.read(InterHubMessageSerializer.java:52)
at org.gradle.messaging.remote.internal.inet.SocketConnection.receive(SocketConnection.java:77)
... 6 more
org.gradle.messaging.remote.internal.ConnectException: Could not connect to server [f419712b-28c7-4a99-b2f2-d995d9c5ff2f port:39354, addresses:[/0:0:0:0:0:0:0:1%lo, /127.0.0.1]]. Tried addresses: [/0:0:0:0:0:0:0:1%lo, /127.0.0.1].
at org.gradle.messaging.remote.internal.inet.TcpOutgoingConnector.connect(TcpOutgoingConnector.java:68)
at org.gradle.messaging.remote.internal.hub.MessageHubBackedClient.getConnection(MessageHubBackedClient.java:35)
at org.gradle.process.internal.child.ActionExecutionWorker.execute(ActionExecutionWorker.java:58)
at org.gradle.process.internal.child.ActionExecutionWorker.execute(ActionExecutionWorker.java:37)
at org.gradle.process.internal.child.ImplementationClassLoaderWorker.execute(ImplementationClassLoaderWorker.java:87)
at org.gradle.process.internal.child.ImplementationClassLoaderWorker.execute(ImplementationClassLoaderWorker.java:41)
at org.gradle.process.internal.child.SystemApplicationClassLoaderWorker.call(SystemApplicationClassLoaderWorker.java:49)
at org.gradle.process.internal.child.SystemApplicationClassLoaderWorker.call(SystemApplicationClassLoaderWorker.java:33)
at jarjar.org.gradle.process.internal.launcher.GradleWorkerMain.run(GradleWorkerMain.java:69)
at jarjar.org.gradle.process.internal.launcher.GradleWorkerMain.main(GradleWorkerMain.java:74)
Caused by: java.net.ConnectException: Connection refused
at sun.nio.ch.SocketChannelImpl.checkConnect(Native Method)
at sun.nio.ch.SocketChannelImpl.finishConnect(SocketChannelImpl.java:717)
at sun.nio.ch.SocketAdaptor.connect(SocketAdaptor.java:111)
at org.gradle.messaging.remote.internal.inet.TcpOutgoingConnector.tryConnect(TcpOutgoingConnector.java:82)
at org.gradle.messaging.remote.internal.inet.TcpOutgoingConnector.connect(TcpOutgoingConnector.java:55)
... 9 more
FAILED
:geode-cq:assemble
:geode-cq:compileTestJavaNote: Some input files use or override a deprecated API.
Note: Recompile with -Xlint:deprecation for details.
Note: Some input files use unchecked or unsafe operations.
Note: Recompile with -Xlint:unchecked for details.
:geode-cq:processTestResources
:geode-cq:testClasses
:geode-cq:checkMissedTests
:geode-cq:test
:geode-cq:check
:geode-cq:build
:geode-cq:distributedTest
:geode-cq:flakyTest
:geode-cq:integrationTest
:geode-json:assemble
:geode-json:compileTestJava UP-TO-DATE
:geode-json:processTestResources UP-TO-DATE
:geode-json:testClasses UP-TO-DATE
:geode-json:checkMissedTests UP-TO-DATE
:geode-json:test UP-TO-DATE
:geode-json:check
:geode-json:build
:geode-json:distributedTest UP-TO-DATE
:geode-json:flakyTest UP-TO-DATE
:geode-json:integrationTest UP-TO-DATE
:geode-junit:javadoc
:geode-junit:javadocJar
:geode-junit:sourcesJar
:geode-junit:signArchives SKIPPED
:geode-junit:assemble
:geode-junit:compileTestJava
:geode-junit:processTestResources UP-TO-DATE
:geode-junit:testClasses
:geode-junit:checkMissedTests
:geode-junit:test
:geode-junit:check
:geode-junit:build
:geode-junit:distributedTest
:geode-junit:flakyTest
:geode-junit:integrationTest
:geode-lucene:assemble
:geode-lucene:compileTestJavaNote: Some input files use or override a deprecated API.
Note: Recompile with -Xlint:deprecation for details.
Note: Some input files use unchecked or unsafe operations.
Note: Recompile with -Xlint:unchecked for details.
:geode-lucene:processTestResources
:geode-lucene:testClasses
:geode-lucene:checkMissedTests
:geode-lucene:test
:geode-lucene:check
:geode-lucene:build
:geode-lucene:distributedTest
:geode-lucene:flakyTest
:geode-lucene:integrationTest
:geode-pulse:assemble
:geode-pulse:compileTestJavaNote: /x1/jenkins/jenkins-slave/workspace/Geode-release/geode-pulse/src/test/java/com/vmware/gemfire/tools/pulse/tests/PulseAbstractTest.java uses or overrides a deprecated API.
Note: Recompile with -Xlint:deprecation for details.
Note: Some input files use unchecked or unsafe operations.
Note: Recompile with -Xlint:unchecked for details.
:geode-pulse:processTestResources
:geode-pulse:testClasses
:geode-pulse:checkMissedTests
:geode-pulse:test
:geode-pulse:check
:geode-pulse:build
:geode-pulse:distributedTest
:geode-pulse:flakyTest
:geode-pulse:integrationTest
:geode-rebalancer:jar
:geode-rebalancer:javadoc
:geode-rebalancer:javadocJar
:geode-rebalancer:sourcesJar
:geode-rebalancer:signArchives SKIPPED
:geode-rebalancer:assemble
:geode-rebalancer:compileTestJava
:geode-rebalancer:processTestResources UP-TO-DATE
:geode-rebalancer:testClasses
:geode-rebalancer:checkMissedTests
:geode-rebalancer:test
:geode-rebalancer:check
:geode-rebalancer:build
:geode-rebalancer:distributedTest
:geode-rebalancer:flakyTest
:geode-rebalancer:integrationTest
:geode-wan:assemble
:geode-wan:compileTestJavaNote: Some input files use or override a deprecated API.
Note: Recompile with -Xlint:deprecation for details.
Note: Some input files use unchecked or unsafe operations.
Note: Recompile with -Xlint:unchecked for details.
:geode-wan:processTestResources
:geode-wan:testClasses
:geode-wan:checkMissedTests
:geode-wan:test
:geode-wan:check
:geode-wan:build
:geode-wan:distributedTest
:geode-wan:flakyTest
:geode-wan:integrationTest
:geode-web:assemble
:geode-web:compileTestJavaNote: /x1/jenkins/jenkins-slave/workspace/Geode-release/geode-web/src/test/java/com/gemstone/gemfire/management/internal/cli/commands/DataCommandsOverHttpDistributedTest.java uses or overrides a deprecated API.
Note: Recompile with -Xlint:deprecation for details.
Note: Some input files use unchecked or unsafe operations.
Note: Recompile with -Xlint:unchecked for details.
:geode-web:processTestResources UP-TO-DATE
:geode-web:testClasses
:geode-web:checkMissedTests
:geode-web:test
:geode-web:check
:geode-web:build
:geode-web:distributedTest
:geode-web:flakyTest
:geode-web:integrationTest
:geode-web-api:assemble
:geode-web-api:compileTestJava UP-TO-DATE
:geode-web-api:processTestResources UP-TO-DATE
:geode-web-api:testClasses UP-TO-DATE
:geode-web-api:checkMissedTests UP-TO-DATE
:geode-web-api:test UP-TO-DATE
:geode-web-api:check
:geode-web-api:build
:geode-web-api:distributedTest UP-TO-DATE
:geode-web-api:flakyTest UP-TO-DATE
:geode-web-api:integrationTest UP-TO-DATE
:combineReports
All test reports at /x1/jenkins/jenkins-slave/workspace/Geode-release/build/reports/combined
:extensions/geode-modules:precheckin
:extensions/geode-modules-assembly:precheckin
:extensions/geode-modules-hibernate:precheckin
:extensions/geode-modules-session:precheckin
:extensions/geode-modules-session-internal:precheckin
:extensions/geode-modules-tomcat7:precheckin
:geode-assembly:precheckin
:geode-common:precheckin
:geode-cq:precheckin
:geode-json:precheckin
:geode-junit:precheckin
:geode-lucene:precheckin
:geode-pulse:precheckin
:geode-rebalancer:precheckin
:geode-wan:precheckin
:geode-web:precheckin
:geode-web-api:precheckin
FAILURE: Build failed with an exception.
* What went wrong:
Execution failed for task ':geode-core:integrationTest'.
> Process 'Gradle Test Executor 2180' finished with non-zero exit value 1
* Try:
Run with --stacktrace option to get the stack trace. Run with --info or --debug option to get more log output.
BUILD FAILED
Total time: 11 hrs 18 mins 26.744 secs
Build step 'Invoke Gradle script' changed build result to FAILURE
Build step 'Invoke Gradle script' marked build as failure
Archiving artifacts
Compressed 251.12 MB of artifacts by 26.5% relative to #7
Recording test results
Build failed in Jenkins: Geode-release #19
Posted by Apache Jenkins Server <je...@builds.apache.org>.
See <https://builds.apache.org/job/Geode-release/19/>
------------------------------------------
[...truncated 916 lines...]
:geode-assembly:distTar
:geode-assembly:distZip
:geode-assembly:writeBuildInfo
:geode-assembly:srcDistTar
:geode-assembly:srcDistZip
:geode-assembly:signArchives SKIPPED
:geode-assembly:assemble
:geode-assembly:compileTestJava
Download https://repo1.maven.org/maven2/org/apache/httpcomponents/httpclient/4.5.1/httpclient-4.5.1.pom
Download https://repo1.maven.org/maven2/org/apache/httpcomponents/httpcomponents-client/4.5.1/httpcomponents-client-4.5.1.pom
Download https://repo1.maven.org/maven2/org/apache/httpcomponents/httpcore/4.4.3/httpcore-4.4.3.pom
Download https://repo1.maven.org/maven2/org/apache/httpcomponents/httpcomponents-core/4.4.3/httpcomponents-core-4.4.3.pom
Download https://repo1.maven.org/maven2/org/apache/httpcomponents/httpclient/4.5.1/httpclient-4.5.1.jar
Download https://repo1.maven.org/maven2/org/apache/httpcomponents/httpcore/4.4.3/httpcore-4.4.3.jar
Note: Some input files use or override a deprecated API.
Note: Recompile with -Xlint:deprecation for details.
Note: Some input files use unchecked or unsafe operations.
Note: Recompile with -Xlint:unchecked for details.
:geode-assembly:processTestResources
:geode-assembly:testClasses
:geode-assembly:checkMissedTests
:geode-assembly:installDist
:geode-assembly:test
:geode-assembly:check
:geode-assembly:build
:geode-assembly:distributedTest
:geode-assembly:flakyTest
com.gemstone.gemfire.rest.internal.web.controllers.RestAPIsOnMembersFunctionExecutionDUnitTest > testFunctionExecutionOnAllMembers FAILED
java.lang.AssertionError: unable to locate geode-web-api WAR file
java.lang.NullPointerException
1 test completed, 1 failed
:geode-assembly:flakyTest FAILED
:geode-assembly:integrationTest
:geode-common:assemble
:geode-common:compileTestJava
:geode-common:processTestResources UP-TO-DATE
:geode-common:testClasses
:geode-common:checkMissedTests
:geode-common:test
:geode-common:check
:geode-common:build
:geode-common:distributedTest
:geode-common:flakyTest
:geode-common:integrationTest
:geode-core:assemble
:geode-core:checkMissedTests
Download https://repo1.maven.org/maven2/org/apache/derby/derby/10.2.2.0/derby-10.2.2.0.pom
Download https://repo1.maven.org/maven2/org/apache/derby/derby/10.2.2.0/derby-10.2.2.0.jar
:geode-core:test
:geode-core:check
:geode-core:build
:geode-core:distributedTest
:geode-core:flakyTest
:geode-core:integrationTest
:geode-cq:assemble
:geode-cq:compileTestJavaNote: Some input files use or override a deprecated API.
Note: Recompile with -Xlint:deprecation for details.
Note: Some input files use unchecked or unsafe operations.
Note: Recompile with -Xlint:unchecked for details.
:geode-cq:processTestResources
:geode-cq:testClasses
:geode-cq:checkMissedTests
:geode-cq:test
:geode-cq:check
:geode-cq:build
:geode-cq:distributedTest
:geode-cq:flakyTest
:geode-cq:integrationTest
:geode-json:assemble
:geode-json:compileTestJava UP-TO-DATE
:geode-json:processTestResources UP-TO-DATE
:geode-json:testClasses UP-TO-DATE
:geode-json:checkMissedTests UP-TO-DATE
:geode-json:test UP-TO-DATE
:geode-json:check
:geode-json:build
:geode-json:distributedTest UP-TO-DATE
:geode-json:flakyTest UP-TO-DATE
:geode-json:integrationTest UP-TO-DATE
:geode-junit:javadoc
:geode-junit:javadocJar
:geode-junit:sourcesJar
:geode-junit:signArchives SKIPPED
:geode-junit:assemble
:geode-junit:compileTestJava
:geode-junit:processTestResources UP-TO-DATE
:geode-junit:testClasses
:geode-junit:checkMissedTests
:geode-junit:test
:geode-junit:check
:geode-junit:build
:geode-junit:distributedTest
:geode-junit:flakyTest
:geode-junit:integrationTest
:geode-lucene:assemble
:geode-lucene:compileTestJava
Download https://repo1.maven.org/maven2/org/apache/lucene/lucene-test-framework/6.0.0/lucene-test-framework-6.0.0.pom
Download https://repo1.maven.org/maven2/org/apache/lucene/lucene-codecs/6.0.0/lucene-codecs-6.0.0.pom
Download https://repo1.maven.org/maven2/com/carrotsearch/randomizedtesting/randomizedtesting-runner/2.3.2/randomizedtesting-runner-2.3.2.pom
Download https://repo1.maven.org/maven2/com/carrotsearch/randomizedtesting/randomizedtesting-parent/2.3.2/randomizedtesting-parent-2.3.2.pom
Download https://repo1.maven.org/maven2/org/apache/lucene/lucene-test-framework/6.0.0/lucene-test-framework-6.0.0.jar
Download https://repo1.maven.org/maven2/org/apache/lucene/lucene-codecs/6.0.0/lucene-codecs-6.0.0.jar
Download https://repo1.maven.org/maven2/com/carrotsearch/randomizedtesting/randomizedtesting-runner/2.3.2/randomizedtesting-runner-2.3.2.jar
Note: Some input files use or override a deprecated API.
Note: Recompile with -Xlint:deprecation for details.
Note: Some input files use unchecked or unsafe operations.
Note: Recompile with -Xlint:unchecked for details.
:geode-lucene:processTestResources
:geode-lucene:testClasses
:geode-lucene:checkMissedTests
:geode-lucene:test
:geode-lucene:check
:geode-lucene:build
:geode-lucene:distributedTest
:geode-lucene:flakyTest
:geode-lucene:integrationTest
:geode-pulse:assemble
:geode-pulse:compileTestJava
Download https://repo1.maven.org/maven2/org/seleniumhq/selenium/selenium-firefox-driver/2.53.1/selenium-firefox-driver-2.53.1.pom
Download https://repo1.maven.org/maven2/org/seleniumhq/selenium/selenium-parent/2.53.1/selenium-parent-2.53.1.pom
Download https://repo1.maven.org/maven2/org/seleniumhq/selenium/selenium-api/2.53.1/selenium-api-2.53.1.pom
Download https://repo1.maven.org/maven2/org/seleniumhq/selenium/selenium-remote-driver/2.53.1/selenium-remote-driver-2.53.1.pom
Download https://repo1.maven.org/maven2/org/seleniumhq/selenium/selenium-support/2.53.1/selenium-support-2.53.1.pom
Download https://repo1.maven.org/maven2/org/springframework/spring-test/4.2.4.RELEASE/spring-test-4.2.4.RELEASE.pom
Download https://repo1.maven.org/maven2/com/google/code/gson/gson/2.3.1/gson-2.3.1.pom
Download https://repo1.maven.org/maven2/org/seleniumhq/selenium/selenium-firefox-driver/2.53.1/selenium-firefox-driver-2.53.1.jar
Download https://repo1.maven.org/maven2/org/seleniumhq/selenium/selenium-api/2.53.1/selenium-api-2.53.1.jar
Download https://repo1.maven.org/maven2/org/seleniumhq/selenium/selenium-remote-driver/2.53.1/selenium-remote-driver-2.53.1.jar
Download https://repo1.maven.org/maven2/org/seleniumhq/selenium/selenium-support/2.53.1/selenium-support-2.53.1.jar
Download https://repo1.maven.org/maven2/org/springframework/spring-test/4.2.4.RELEASE/spring-test-4.2.4.RELEASE.jar
Download https://repo1.maven.org/maven2/com/google/code/gson/gson/2.3.1/gson-2.3.1.jar
Note: <https://builds.apache.org/job/Geode-release/ws/geode-pulse/src/test/java/com/vmware/gemfire/tools/pulse/tests/PulseAbstractTest.java> uses or overrides a deprecated API.
Note: Recompile with -Xlint:deprecation for details.
Note: Some input files use unchecked or unsafe operations.
Note: Recompile with -Xlint:unchecked for details.
:geode-pulse:processTestResources
:geode-pulse:testClasses
:geode-pulse:checkMissedTests
Download https://repo1.maven.org/maven2/com/jayway/jsonpath/json-path/1.2.0/json-path-1.2.0.pom
Download https://repo1.maven.org/maven2/net/minidev/json-smart/2.1.0/json-smart-2.1.0.pom
Download https://repo1.maven.org/maven2/net/minidev/parent/2.1.0/parent-2.1.0.pom
Download https://repo1.maven.org/maven2/net/minidev/asm/1.0.2/asm-1.0.2.pom
Download https://repo1.maven.org/maven2/com/jayway/jsonpath/json-path/1.2.0/json-path-1.2.0.jar
Download https://repo1.maven.org/maven2/net/minidev/json-smart/2.1.0/json-smart-2.1.0.jar
Download https://repo1.maven.org/maven2/net/minidev/asm/1.0.2/asm-1.0.2.jar
:geode-pulse:test
:geode-pulse:check
:geode-pulse:build
:geode-pulse:distributedTest
:geode-pulse:flakyTest
:geode-pulse:integrationTest
:geode-rebalancer:jar
:geode-rebalancer:javadoc
:geode-rebalancer:javadocJar
:geode-rebalancer:sourcesJar
:geode-rebalancer:signArchives SKIPPED
:geode-rebalancer:assemble
:geode-rebalancer:compileTestJava
:geode-rebalancer:processTestResources UP-TO-DATE
:geode-rebalancer:testClasses
:geode-rebalancer:checkMissedTests
:geode-rebalancer:test
:geode-rebalancer:check
:geode-rebalancer:build
:geode-rebalancer:distributedTest
:geode-rebalancer:flakyTest
:geode-rebalancer:integrationTest
:geode-wan:assemble
:geode-wan:compileTestJavaNote: Some input files use or override a deprecated API.
Note: Recompile with -Xlint:deprecation for details.
Note: Some input files use unchecked or unsafe operations.
Note: Recompile with -Xlint:unchecked for details.
:geode-wan:processTestResources
:geode-wan:testClasses
:geode-wan:checkMissedTests
:geode-wan:test
:geode-wan:check
:geode-wan:build
:geode-wan:distributedTest
:geode-wan:flakyTest
:geode-wan:integrationTest
:geode-web:assemble
:geode-web:compileTestJavaNote: <https://builds.apache.org/job/Geode-release/ws/geode-web/src/test/java/com/gemstone/gemfire/management/internal/cli/commands/DataCommandsOverHttpDistributedTest.java> uses or overrides a deprecated API.
Note: Recompile with -Xlint:deprecation for details.
Note: Some input files use unchecked or unsafe operations.
Note: Recompile with -Xlint:unchecked for details.
:geode-web:processTestResources UP-TO-DATE
:geode-web:testClasses
:geode-web:checkMissedTests
:geode-web:test
:geode-web:check
:geode-web:build
:geode-web:distributedTest
:geode-web:flakyTest
:geode-web:integrationTest
:geode-web-api:assemble
:geode-web-api:compileTestJava UP-TO-DATE
:geode-web-api:processTestResources UP-TO-DATE
:geode-web-api:testClasses UP-TO-DATE
:geode-web-api:checkMissedTests UP-TO-DATE
:geode-web-api:test UP-TO-DATE
:geode-web-api:check
:geode-web-api:build
:geode-web-api:distributedTest UP-TO-DATE
:geode-web-api:flakyTest UP-TO-DATE
:geode-web-api:integrationTest UP-TO-DATE
:combineReports
All test reports at <https://builds.apache.org/job/Geode-release/ws/build/reports/combined>
:extensions/geode-modules:precheckin
:extensions/geode-modules-assembly:precheckin
:extensions/geode-modules-hibernate:precheckin
:extensions/geode-modules-session:precheckin
:extensions/geode-modules-session-internal:precheckin
:extensions/geode-modules-tomcat7:precheckin
:geode-common:precheckin
:geode-core:precheckin
:geode-cq:precheckin
:geode-json:precheckin
:geode-junit:precheckin
:geode-lucene:precheckin
:geode-pulse:precheckin
:geode-rebalancer:precheckin
:geode-wan:precheckin
:geode-web:precheckin
:geode-web-api:precheckin
FAILURE: Build failed with an exception.
* What went wrong:
Execution failed for task ':geode-assembly:flakyTest'.
> There were failing tests. See the report at: file://<https://builds.apache.org/job/Geode-release/ws/geode-assembly/build/reports/flakyTest/index.html>
* Try:
Run with --stacktrace option to get the stack trace. Run with --info or --debug option to get more log output.
BUILD FAILED
Total time: 10 hrs 54 mins 23.877 secs
Build step 'Invoke Gradle script' changed build result to FAILURE
Build step 'Invoke Gradle script' marked build as failure
Archiving artifacts
Compressed 250.79 MB of artifacts by 12.1% relative to #7
Recording test results
Re: Build failed in Jenkins: Geode-release #18
Posted by Mark Bretl <as...@gmail.com>.
So the report publisher has '**/build/test-results/*.xml,
**/build/test-results-flaky/*.xml' which should work. I am not sure why it
is not picking up the flaky test failures, however, I did update to remove
the space between the two patterns,
'**/build/test-results/*.xml,**/build/test-results-flaky/*.xml'. I hope
that will fix it, as maybe it was trimming the space at the beginning of
the second pattern and using it as is.
I should note I updated both the release and nightly builds, as they have
the same patterns.
--Mark
On Thu, Jul 28, 2016 at 11:56 AM, Dan Smith <ds...@pivotal.io> wrote:
> Also, the release branch jenkins job needs to pick up failures from this
> flakyTest target because they are not showing up in the test results. Can
> someone with access to jenkins fix that?
>
> -Dan
>
> On Thu, Jul 28, 2016 at 10:57 AM, Bruce Schuchardt <bschuchardt@pivotal.io
> >
> wrote:
>
> > This is a problem in the geode-assembly build.gradle configuration. The
> > flakyTest task needs to depend on the installed product, like
> > distributedTest does. I've fixed that on the develop branch.
> >
> >
> > Le 7/28/2016 à 10:45 AM, Apache Jenkins Server a écrit :
> >
> >> l.web.controllers.RestAPIsOnMembersFunctionExecutionDUnitTest >
> >> testFunctionExecutionOnAllMembers FAILED
> >> java.lang.AssertionError: unable to locate geode-web-api WAR file
> >>
> >> java.lang.NullPointerException
> >>
> >
> >
>
Re: Build failed in Jenkins: Geode-release #18
Posted by Dan Smith <ds...@pivotal.io>.
Also, the release branch jenkins job needs to pick up failures from this
flakyTest target because they are not showing up in the test results. Can
someone with access to jenkins fix that?
-Dan
On Thu, Jul 28, 2016 at 10:57 AM, Bruce Schuchardt <bs...@pivotal.io>
wrote:
> This is a problem in the geode-assembly build.gradle configuration. The
> flakyTest task needs to depend on the installed product, like
> distributedTest does. I've fixed that on the develop branch.
>
>
> Le 7/28/2016 à 10:45 AM, Apache Jenkins Server a écrit :
>
>> l.web.controllers.RestAPIsOnMembersFunctionExecutionDUnitTest >
>> testFunctionExecutionOnAllMembers FAILED
>> java.lang.AssertionError: unable to locate geode-web-api WAR file
>>
>> java.lang.NullPointerException
>>
>
>
Re: Build failed in Jenkins: Geode-release #18
Posted by Bruce Schuchardt <bs...@pivotal.io>.
This is a problem in the geode-assembly build.gradle configuration. The
flakyTest task needs to depend on the installed product, like
distributedTest does. I've fixed that on the develop branch.
Le 7/28/2016 � 10:45 AM, Apache Jenkins Server a �crit :
> l.web.controllers.RestAPIsOnMembersFunctionExecutionDUnitTest > testFunctionExecutionOnAllMembers FAILED
> java.lang.AssertionError: unable to locate geode-web-api WAR file
>
> java.lang.NullPointerException
Build failed in Jenkins: Geode-release #18
Posted by Apache Jenkins Server <je...@builds.apache.org>.
See <https://builds.apache.org/job/Geode-release/18/>
------------------------------------------
[...truncated 558 lines...]
:geode-core:webJar
:geode-cq:jar
:geode-cq:javadoc
:geode-cq:javadocJar
:geode-cq:sourcesJar
:geode-cq:signArchives SKIPPED
:geode-json:javadocJar
:geode-json:sourcesJar
:geode-json:signArchives SKIPPED
:geode-lucene:jar
:geode-lucene:javadoc
:geode-lucene:javadocJar
:geode-lucene:sourcesJar
:geode-lucene:signArchives SKIPPED
:geode-pulse:javadoc
:geode-pulse:javadocJar
:geode-pulse:sourcesJar
:geode-pulse:war
:geode-pulse:signArchives SKIPPED
:geode-wan:jar
:geode-wan:javadoc
:geode-wan:javadocJar
:geode-wan:sourcesJar
:geode-wan:signArchives SKIPPED
:geode-web:javadoc UP-TO-DATE
:geode-web:javadocJar
:geode-web:sourcesJar
:geode-web:war
:geode-web:signArchives SKIPPED
:geode-web-api:jar
:geode-web-api:javadoc
:geode-web-api:javadocJar
:geode-web-api:sourcesJar
:geode-web-api:war
:geode-web-api:signArchives SKIPPED
:geode-assembly:distTar
:geode-assembly:distZip
:geode-assembly:writeBuildInfo
:geode-assembly:srcDistTar
:geode-assembly:srcDistZip
:geode-assembly:signArchives SKIPPED
:geode-assembly:assemble
:geode-assembly:compileTestJavaNote: Some input files use or override a deprecated API.
Note: Recompile with -Xlint:deprecation for details.
Note: Some input files use unchecked or unsafe operations.
Note: Recompile with -Xlint:unchecked for details.
:geode-assembly:processTestResources
:geode-assembly:testClasses
:geode-assembly:checkMissedTests
:geode-assembly:installDist
:geode-assembly:test
:geode-assembly:check
:geode-assembly:build
:geode-assembly:distributedTest
:geode-assembly:flakyTest
com.gemstone.gemfire.rest.internal.web.controllers.RestAPIsOnMembersFunctionExecutionDUnitTest > testFunctionExecutionOnAllMembers FAILED
java.lang.AssertionError: unable to locate geode-web-api WAR file
java.lang.NullPointerException
1 test completed, 1 failed
:geode-assembly:flakyTest FAILED
:geode-assembly:integrationTest
:geode-common:assemble
:geode-common:compileTestJava
:geode-common:processTestResources UP-TO-DATE
:geode-common:testClasses
:geode-common:checkMissedTests
:geode-common:test
:geode-common:check
:geode-common:build
:geode-common:distributedTest
:geode-common:flakyTest
:geode-common:integrationTest
:geode-core:assemble
:geode-core:checkMissedTests
:geode-core:test
:geode-core:check
:geode-core:build
:geode-core:distributedTest
:geode-core:flakyTest
:geode-core:integrationTest
:geode-cq:assemble
:geode-cq:compileTestJavaNote: Some input files use or override a deprecated API.
Note: Recompile with -Xlint:deprecation for details.
Note: Some input files use unchecked or unsafe operations.
Note: Recompile with -Xlint:unchecked for details.
:geode-cq:processTestResources
:geode-cq:testClasses
:geode-cq:checkMissedTests
:geode-cq:test
:geode-cq:check
:geode-cq:build
:geode-cq:distributedTest
:geode-cq:flakyTest
:geode-cq:integrationTest
:geode-json:assemble
:geode-json:compileTestJava UP-TO-DATE
:geode-json:processTestResources UP-TO-DATE
:geode-json:testClasses UP-TO-DATE
:geode-json:checkMissedTests UP-TO-DATE
:geode-json:test UP-TO-DATE
:geode-json:check
:geode-json:build
:geode-json:distributedTest UP-TO-DATE
:geode-json:flakyTest UP-TO-DATE
:geode-json:integrationTest UP-TO-DATE
:geode-junit:javadoc
:geode-junit:javadocJar
:geode-junit:sourcesJar
:geode-junit:signArchives SKIPPED
:geode-junit:assemble
:geode-junit:compileTestJava
:geode-junit:processTestResources UP-TO-DATE
:geode-junit:testClasses
:geode-junit:checkMissedTests
:geode-junit:test
:geode-junit:check
:geode-junit:build
:geode-junit:distributedTest
:geode-junit:flakyTest
:geode-junit:integrationTest
:geode-lucene:assemble
:geode-lucene:compileTestJavaNote: Some input files use or override a deprecated API.
Note: Recompile with -Xlint:deprecation for details.
Note: Some input files use unchecked or unsafe operations.
Note: Recompile with -Xlint:unchecked for details.
:geode-lucene:processTestResources
:geode-lucene:testClasses
:geode-lucene:checkMissedTests
:geode-lucene:test
:geode-lucene:check
:geode-lucene:build
:geode-lucene:distributedTest
:geode-lucene:flakyTest
:geode-lucene:integrationTest
:geode-pulse:assemble
:geode-pulse:compileTestJavaNote: /x1/jenkins/jenkins-slave/workspace/Geode-release/geode-pulse/src/test/java/com/vmware/gemfire/tools/pulse/tests/PulseAbstractTest.java uses or overrides a deprecated API.
Note: Recompile with -Xlint:deprecation for details.
Note: Some input files use unchecked or unsafe operations.
Note: Recompile with -Xlint:unchecked for details.
:geode-pulse:processTestResources
:geode-pulse:testClasses
:geode-pulse:checkMissedTests
:geode-pulse:test
:geode-pulse:check
:geode-pulse:build
:geode-pulse:distributedTest
:geode-pulse:flakyTest
:geode-pulse:integrationTest
:geode-rebalancer:jar
:geode-rebalancer:javadoc
:geode-rebalancer:javadocJar
:geode-rebalancer:sourcesJar
:geode-rebalancer:signArchives SKIPPED
:geode-rebalancer:assemble
:geode-rebalancer:compileTestJava
:geode-rebalancer:processTestResources UP-TO-DATE
:geode-rebalancer:testClasses
:geode-rebalancer:checkMissedTests
:geode-rebalancer:test
:geode-rebalancer:check
:geode-rebalancer:build
:geode-rebalancer:distributedTest
:geode-rebalancer:flakyTest
:geode-rebalancer:integrationTest
:geode-wan:assemble
:geode-wan:compileTestJavaNote: Some input files use or override a deprecated API.
Note: Recompile with -Xlint:deprecation for details.
Note: Some input files use unchecked or unsafe operations.
Note: Recompile with -Xlint:unchecked for details.
:geode-wan:processTestResources
:geode-wan:testClasses
:geode-wan:checkMissedTests
:geode-wan:test
:geode-wan:check
:geode-wan:build
:geode-wan:distributedTest
:geode-wan:flakyTest
:geode-wan:integrationTest
:geode-web:assemble
:geode-web:compileTestJavaNote: /x1/jenkins/jenkins-slave/workspace/Geode-release/geode-web/src/test/java/com/gemstone/gemfire/management/internal/cli/commands/DataCommandsOverHttpDistributedTest.java uses or overrides a deprecated API.
Note: Recompile with -Xlint:deprecation for details.
Note: Some input files use unchecked or unsafe operations.
Note: Recompile with -Xlint:unchecked for details.
:geode-web:processTestResources UP-TO-DATE
:geode-web:testClasses
:geode-web:checkMissedTests
:geode-web:test
:geode-web:check
:geode-web:build
:geode-web:distributedTest
:geode-web:flakyTest
:geode-web:integrationTest
:geode-web-api:assemble
:geode-web-api:compileTestJava UP-TO-DATE
:geode-web-api:processTestResources UP-TO-DATE
:geode-web-api:testClasses UP-TO-DATE
:geode-web-api:checkMissedTests UP-TO-DATE
:geode-web-api:test UP-TO-DATE
:geode-web-api:check
:geode-web-api:build
:geode-web-api:distributedTest UP-TO-DATE
:geode-web-api:flakyTest UP-TO-DATE
:geode-web-api:integrationTest UP-TO-DATE
:combineReports
All test reports at /x1/jenkins/jenkins-slave/workspace/Geode-release/build/reports/combined
:extensions/geode-modules:precheckin
:extensions/geode-modules-assembly:precheckin
:extensions/geode-modules-hibernate:precheckin
:extensions/geode-modules-session:precheckin
:extensions/geode-modules-session-internal:precheckin
:extensions/geode-modules-tomcat7:precheckin
:geode-common:precheckin
:geode-core:precheckin
:geode-cq:precheckin
:geode-json:precheckin
:geode-junit:precheckin
:geode-lucene:precheckin
:geode-pulse:precheckin
:geode-rebalancer:precheckin
:geode-wan:precheckin
:geode-web:precheckin
:geode-web-api:precheckin
FAILURE: Build failed with an exception.
* What went wrong:
Execution failed for task ':geode-assembly:flakyTest'.
> There were failing tests. See the report at: file:///x1/jenkins/jenkins-slave/workspace/Geode-release/geode-assembly/build/reports/flakyTest/index.html
* Try:
Run with --stacktrace option to get the stack trace. Run with --info or --debug option to get more log output.
BUILD FAILED
Total time: 11 hrs 10 mins 32.997 secs
Build step 'Invoke Gradle script' changed build result to FAILURE
Build step 'Invoke Gradle script' marked build as failure
Archiving artifacts
Compressed 250.83 MB of artifacts by 16.5% relative to #7
Recording test results
Re: Build failed in Jenkins: Geode-release #17
Posted by Bruce Schuchardt <bs...@pivotal.io>.
A "ulimit -a" would be sufficient
Le 7/28/2016 � 9:56 AM, Mark Bretl a �crit :
> We don't have any information, however, we could add a few shell commands
> at the beginning of the build to help debug possible issues that could come
> up?
>
> If we need anything specific, we would have to create an INFRA ticket.
>
> --Mark
>
> On Thu, Jul 28, 2016 at 8:58 AM, Bruce Schuchardt <bs...@pivotal.io>
> wrote:
>
>> Do we have any information on the ulimit settings in the account running
>> the tests? This may just be an issue with how the account is configured.
>>
>>
>> Le 7/27/2016 � 9:21 AM, Kirk Lund a �crit :
>>
>>> Looks like OutOfMemory is the cause of this failure. Do we need to
>>> increase
>>> heap size for Jenkins or is there a way to get debug info?
>>>
>>> -Kirk
>>>
>>>
>>> On Wed, Jul 27, 2016 at 12:37 AM, Apache Jenkins Server <
>>> jenkins@builds.apache.org> wrote:
>>>
>>> See <https://builds.apache.org/job/Geode-release/17/changes>
>>>> Changes:
>>>>
>>>> [wmarkito] GEODE-1696 - Updating release version
>>>>
>>>> ------------------------------------------
>>>> [...truncated 1019 lines...]
>>>> at
>>>>
>>>> com.gemstone.gemfire.internal.admin.remote.AdminRegion.destroyRegion(AdminRegion.java:128)
>>>> at
>>>>
>>>> com.gemstone.gemfire.distributed.internal.ConsoleDistributionManagerDUnitTest.testApplications(ConsoleDistributionManagerDUnitTest.java:308)
>>>>
>>>> 7433 tests completed, 1 failed, 587 skipped
>>>> :geode-core:distributedTest FAILED
>>>> :geode-core:flakyTest
>>>>
>>>> com.gemstone.gemfire.security.ClientAuthenticationDUnitTest >
>>>> testCredentialsForNotifications FAILED
>>>> com.gemstone.gemfire.test.dunit.RMIException: While invoking
>>>>
>>>> com.gemstone.gemfire.security.ClientAuthenticationTestCase$$Lambda$16/180944566.run
>>>> in VM 2 running on Host asf900.gq1.ygridcore.net with 4 VMs
>>>> at com.gemstone.gemfire.test.dunit.VM.invoke(VM.java:389)
>>>> at com.gemstone.gemfire.test.dunit.VM.invoke(VM.java:355)
>>>> at com.gemstone.gemfire.test.dunit.VM.invoke(VM.java:293)
>>>> at
>>>>
>>>> com.gemstone.gemfire.security.ClientAuthenticationTestCase.createClient1NoException(ClientAuthenticationTestCase.java:540)
>>>> at
>>>>
>>>> com.gemstone.gemfire.security.ClientAuthenticationTestCase.doTestCredentialsForNotifications(ClientAuthenticationTestCase.java:427)
>>>> at
>>>>
>>>> com.gemstone.gemfire.security.ClientAuthenticationDUnitTest.testCredentialsForNotifications(ClientAuthenticationDUnitTest.java:82)
>>>>
>>>> Caused by:
>>>> java.lang.OutOfMemoryError: unable to create new native thread
>>>>
>>>> java.lang.AssertionError: Suspicious strings were written to the log
>>>> during this run.
>>>> Fix the strings or use IgnoredException.addIgnoredException to
>>>> ignore.
>>>>
>>>> -----------------------------------------------------------------------
>>>> Found suspect string in log4j at line 1157
>>>>
>>>> [error 2016/07/27 02:00:23.987 UTC <RMI TCP
>>>> Connection(1)-67.195.81.144> tid=0x1b] java.lang.OutOfMemoryError: unable
>>>> to create new native thread
>>>>
>>>>
>>>> com.gemstone.gemfire.distributed.internal.deadlock.GemFireDeadlockDetectorDUnitTest
>>>>
>>>>> classMethod FAILED
>>>>>
>>>> java.lang.RuntimeException: Unable to launch dunit VMS
>>>>
>>>> Caused by:
>>>> java.lang.RuntimeException: VMs did not start up with 30 seconds
>>>>
>>>> 189 tests completed, 2 failed, 6 skipped
>>>> :geode-core:flakyTest FAILED
>>>> :geode-core:integrationTest
>>>> :geode-cq:assemble
>>>> :geode-cq:compileTestJavaNote: Some input files use or override a
>>>> deprecated API.
>>>> Note: Recompile with -Xlint:deprecation for details.
>>>> Note: Some input files use unchecked or unsafe operations.
>>>> Note: Recompile with -Xlint:unchecked for details.
>>>>
>>>> :geode-cq:processTestResources
>>>> :geode-cq:testClasses
>>>> :geode-cq:checkMissedTests
>>>> :geode-cq:test
>>>> :geode-cq:check
>>>> :geode-cq:build
>>>> :geode-cq:distributedTest
>>>> :geode-cq:flakyTest
>>>> :geode-cq:integrationTest
>>>> :geode-json:assemble
>>>> :geode-json:compileTestJava UP-TO-DATE
>>>> :geode-json:processTestResources UP-TO-DATE
>>>> :geode-json:testClasses UP-TO-DATE
>>>> :geode-json:checkMissedTests UP-TO-DATE
>>>> :geode-json:test UP-TO-DATE
>>>> :geode-json:check
>>>> :geode-json:build
>>>> :geode-json:distributedTest UP-TO-DATE
>>>> :geode-json:flakyTest UP-TO-DATE
>>>> :geode-json:integrationTest UP-TO-DATE
>>>> :geode-junit:javadoc
>>>> :geode-junit:javadocJar
>>>> :geode-junit:sourcesJar
>>>> :geode-junit:signArchives SKIPPED
>>>> :geode-junit:assemble
>>>> :geode-junit:compileTestJava
>>>> :geode-junit:processTestResources UP-TO-DATE
>>>> :geode-junit:testClasses
>>>> :geode-junit:checkMissedTests
>>>> :geode-junit:test
>>>> :geode-junit:check
>>>> :geode-junit:build
>>>> :geode-junit:distributedTest
>>>> :geode-junit:flakyTest
>>>> :geode-junit:integrationTest
>>>> :geode-lucene:assemble
>>>> :geode-lucene:compileTestJava
>>>> Download
>>>>
>>>> https://repo1.maven.org/maven2/org/apache/lucene/lucene-test-framework/6.0.0/lucene-test-framework-6.0.0.pom
>>>> Download
>>>>
>>>> https://repo1.maven.org/maven2/org/apache/lucene/lucene-codecs/6.0.0/lucene-codecs-6.0.0.pom
>>>> Download
>>>>
>>>> https://repo1.maven.org/maven2/com/carrotsearch/randomizedtesting/randomizedtesting-runner/2.3.2/randomizedtesting-runner-2.3.2.pom
>>>> Download
>>>>
>>>> https://repo1.maven.org/maven2/com/carrotsearch/randomizedtesting/randomizedtesting-parent/2.3.2/randomizedtesting-parent-2.3.2.pom
>>>> Download
>>>>
>>>> https://repo1.maven.org/maven2/org/apache/lucene/lucene-test-framework/6.0.0/lucene-test-framework-6.0.0.jar
>>>> Download
>>>>
>>>> https://repo1.maven.org/maven2/org/apache/lucene/lucene-codecs/6.0.0/lucene-codecs-6.0.0.jar
>>>> Download
>>>>
>>>> https://repo1.maven.org/maven2/com/carrotsearch/randomizedtesting/randomizedtesting-runner/2.3.2/randomizedtesting-runner-2.3.2.jar
>>>> Note: Some input files use or override a deprecated API.
>>>> Note: Recompile with -Xlint:deprecation for details.
>>>> Note: Some input files use unchecked or unsafe operations.
>>>> Note: Recompile with -Xlint:unchecked for details.
>>>> :geode-lucene:processTestResources
>>>> :geode-lucene:testClasses
>>>> :geode-lucene:checkMissedTests
>>>> :geode-lucene:test
>>>> :geode-lucene:check
>>>> :geode-lucene:build
>>>> :geode-lucene:distributedTest
>>>> :geode-lucene:flakyTest
>>>> :geode-lucene:integrationTest
>>>> :geode-pulse:assemble
>>>> :geode-pulse:compileTestJava
>>>> Download
>>>>
>>>> https://repo1.maven.org/maven2/org/seleniumhq/selenium/selenium-firefox-driver/2.53.1/selenium-firefox-driver-2.53.1.pom
>>>> Download
>>>>
>>>> https://repo1.maven.org/maven2/org/seleniumhq/selenium/selenium-parent/2.53.1/selenium-parent-2.53.1.pom
>>>> Download
>>>>
>>>> https://repo1.maven.org/maven2/org/seleniumhq/selenium/selenium-api/2.53.1/selenium-api-2.53.1.pom
>>>> Download
>>>>
>>>> https://repo1.maven.org/maven2/org/seleniumhq/selenium/selenium-remote-driver/2.53.1/selenium-remote-driver-2.53.1.pom
>>>> Download
>>>>
>>>> https://repo1.maven.org/maven2/org/seleniumhq/selenium/selenium-support/2.53.1/selenium-support-2.53.1.pom
>>>> Download
>>>>
>>>> https://repo1.maven.org/maven2/org/springframework/spring-test/4.2.4.RELEASE/spring-test-4.2.4.RELEASE.pom
>>>> Download
>>>>
>>>> https://repo1.maven.org/maven2/com/google/code/gson/gson/2.3.1/gson-2.3.1.pom
>>>> Download
>>>>
>>>> https://repo1.maven.org/maven2/org/seleniumhq/selenium/selenium-firefox-driver/2.53.1/selenium-firefox-driver-2.53.1.jar
>>>> Download
>>>>
>>>> https://repo1.maven.org/maven2/org/seleniumhq/selenium/selenium-api/2.53.1/selenium-api-2.53.1.jar
>>>> Download
>>>>
>>>> https://repo1.maven.org/maven2/org/seleniumhq/selenium/selenium-remote-driver/2.53.1/selenium-remote-driver-2.53.1.jar
>>>> Download
>>>>
>>>> https://repo1.maven.org/maven2/org/seleniumhq/selenium/selenium-support/2.53.1/selenium-support-2.53.1.jar
>>>> Download
>>>>
>>>> https://repo1.maven.org/maven2/org/springframework/spring-test/4.2.4.RELEASE/spring-test-4.2.4.RELEASE.jar
>>>> Download
>>>>
>>>> https://repo1.maven.org/maven2/com/google/code/gson/gson/2.3.1/gson-2.3.1.jar
>>>> Note: <
>>>>
>>>> https://builds.apache.org/job/Geode-release/ws/geode-pulse/src/test/java/com/vmware/gemfire/tools/pulse/tests/PulseAbstractTest.java
>>>> uses or overrides a deprecated API.
>>>> Note: Recompile with -Xlint:deprecation for details.
>>>> Note: Some input files use unchecked or unsafe operations.
>>>> Note: Recompile with -Xlint:unchecked for details.
>>>> :geode-pulse:processTestResources
>>>> :geode-pulse:testClasses
>>>> :geode-pulse:checkMissedTests
>>>> Download
>>>>
>>>> https://repo1.maven.org/maven2/com/jayway/jsonpath/json-path/1.2.0/json-path-1.2.0.pom
>>>> Download
>>>>
>>>> https://repo1.maven.org/maven2/net/minidev/json-smart/2.1.0/json-smart-2.1.0.pom
>>>> Download
>>>> https://repo1.maven.org/maven2/net/minidev/parent/2.1.0/parent-2.1.0.pom
>>>> Download
>>>> https://repo1.maven.org/maven2/net/minidev/asm/1.0.2/asm-1.0.2.pom
>>>> Download
>>>>
>>>> https://repo1.maven.org/maven2/com/jayway/jsonpath/json-path/1.2.0/json-path-1.2.0.jar
>>>> Download
>>>>
>>>> https://repo1.maven.org/maven2/net/minidev/json-smart/2.1.0/json-smart-2.1.0.jar
>>>> Download
>>>> https://repo1.maven.org/maven2/net/minidev/asm/1.0.2/asm-1.0.2.jar
>>>> :geode-pulse:test
>>>> :geode-pulse:check
>>>> :geode-pulse:build
>>>> :geode-pulse:distributedTest
>>>> :geode-pulse:flakyTest
>>>> :geode-pulse:integrationTest
>>>> :geode-rebalancer:jar
>>>> :geode-rebalancer:javadoc
>>>> :geode-rebalancer:javadocJar
>>>> :geode-rebalancer:sourcesJar
>>>> :geode-rebalancer:signArchives SKIPPED
>>>> :geode-rebalancer:assemble
>>>> :geode-rebalancer:compileTestJava
>>>> :geode-rebalancer:processTestResources UP-TO-DATE
>>>> :geode-rebalancer:testClasses
>>>> :geode-rebalancer:checkMissedTests
>>>> :geode-rebalancer:test
>>>> :geode-rebalancer:check
>>>> :geode-rebalancer:build
>>>> :geode-rebalancer:distributedTest
>>>> :geode-rebalancer:flakyTest
>>>> :geode-rebalancer:integrationTest
>>>> :geode-wan:assemble
>>>> :geode-wan:compileTestJavaNote: Some input files use or override a
>>>> deprecated API.
>>>> Note: Recompile with -Xlint:deprecation for details.
>>>> Note: Some input files use unchecked or unsafe operations.
>>>> Note: Recompile with -Xlint:unchecked for details.
>>>>
>>>> :geode-wan:processTestResources
>>>> :geode-wan:testClasses
>>>> :geode-wan:checkMissedTests
>>>> :geode-wan:test
>>>> :geode-wan:check
>>>> :geode-wan:build
>>>> :geode-wan:distributedTest
>>>> :geode-wan:flakyTest
>>>> :geode-wan:integrationTest
>>>> :geode-web:assemble
>>>> :geode-web:compileTestJavaNote: <
>>>>
>>>> https://builds.apache.org/job/Geode-release/ws/geode-web/src/test/java/com/gemstone/gemfire/management/internal/cli/commands/DataCommandsOverHttpDistributedTest.java
>>>> uses or overrides a deprecated API.
>>>> Note: Recompile with -Xlint:deprecation for details.
>>>> Note: Some input files use unchecked or unsafe operations.
>>>> Note: Recompile with -Xlint:unchecked for details.
>>>>
>>>> :geode-web:processTestResources UP-TO-DATE
>>>> :geode-web:testClasses
>>>> :geode-web:checkMissedTests
>>>> :geode-web:test
>>>> :geode-web:check
>>>> :geode-web:build
>>>> :geode-web:distributedTest
>>>> :geode-web:flakyTest
>>>> :geode-web:integrationTest
>>>> :geode-web-api:assemble
>>>> :geode-web-api:compileTestJava UP-TO-DATE
>>>> :geode-web-api:processTestResources UP-TO-DATE
>>>> :geode-web-api:testClasses UP-TO-DATE
>>>> :geode-web-api:checkMissedTests UP-TO-DATE
>>>> :geode-web-api:test UP-TO-DATE
>>>> :geode-web-api:check
>>>> :geode-web-api:build
>>>> :geode-web-api:distributedTest UP-TO-DATE
>>>> :geode-web-api:flakyTest UP-TO-DATE
>>>> :geode-web-api:integrationTest UP-TO-DATE
>>>> :combineReports
>>>> All test reports at <
>>>> https://builds.apache.org/job/Geode-release/ws/build/reports/combined>
>>>> :extensions/geode-modules:precheckin
>>>> :extensions/geode-modules-assembly:precheckin
>>>> :extensions/geode-modules-hibernate:precheckin
>>>> :extensions/geode-modules-session:precheckin
>>>> :extensions/geode-modules-session-internal:precheckin
>>>> :extensions/geode-modules-tomcat7:precheckin
>>>> :geode-common:precheckin
>>>> :geode-cq:precheckin
>>>> :geode-json:precheckin
>>>> :geode-junit:precheckin
>>>> :geode-lucene:precheckin
>>>> :geode-pulse:precheckin
>>>> :geode-rebalancer:precheckin
>>>> :geode-wan:precheckin
>>>> :geode-web:precheckin
>>>> :geode-web-api:precheckin
>>>>
>>>> FAILURE: Build completed with 3 failures.
>>>>
>>>> 1: Task failed with an exception.
>>>> -----------
>>>> * What went wrong:
>>>> Execution failed for task ':geode-assembly:flakyTest'.
>>>>
>>>>> There were failing tests. See the report at: file://<
>>>>>
>>>> https://builds.apache.org/job/Geode-release/ws/geode-assembly/build/reports/flakyTest/index.html
>>>> * Try:
>>>> Run with --stacktrace option to get the stack trace. Run with --info or
>>>> --debug option to get more log output.
>>>>
>>>>
>>>> ==============================================================================
>>>>
>>>> 2: Task failed with an exception.
>>>> -----------
>>>> * What went wrong:
>>>> Execution failed for task ':geode-core:distributedTest'.
>>>>
>>>>> There were failing tests. See the report at: file://<
>>>>>
>>>> https://builds.apache.org/job/Geode-release/ws/geode-core/build/reports/distributedTest/index.html
>>>> * Try:
>>>> Run with --stacktrace option to get the stack trace. Run with --info or
>>>> --debug option to get more log output.
>>>>
>>>>
>>>> ==============================================================================
>>>>
>>>> 3: Task failed with an exception.
>>>> -----------
>>>> * What went wrong:
>>>> Execution failed for task ':geode-core:flakyTest'.
>>>>
>>>>> There were failing tests. See the report at: file://<
>>>>>
>>>> https://builds.apache.org/job/Geode-release/ws/geode-core/build/reports/flakyTest/index.html
>>>> * Try:
>>>> Run with --stacktrace option to get the stack trace. Run with --info or
>>>> --debug option to get more log output.
>>>>
>>>>
>>>> ==============================================================================
>>>>
>>>> BUILD FAILED
>>>>
>>>> Total time: 11 hrs 26 mins 30.535 secs
>>>> Build step 'Invoke Gradle script' changed build result to FAILURE
>>>> Build step 'Invoke Gradle script' marked build as failure
>>>> Archiving artifacts
>>>> Compressed 250.79 MB of artifacts by 12.1% relative to #7
>>>> Recording test results
>>>>
>>>>
Re: Build failed in Jenkins: Geode-release #17
Posted by Mark Bretl <as...@gmail.com>.
We don't have any information, however, we could add a few shell commands
at the beginning of the build to help debug possible issues that could come
up?
If we need anything specific, we would have to create an INFRA ticket.
--Mark
On Thu, Jul 28, 2016 at 8:58 AM, Bruce Schuchardt <bs...@pivotal.io>
wrote:
> Do we have any information on the ulimit settings in the account running
> the tests? This may just be an issue with how the account is configured.
>
>
> Le 7/27/2016 à 9:21 AM, Kirk Lund a écrit :
>
>> Looks like OutOfMemory is the cause of this failure. Do we need to
>> increase
>> heap size for Jenkins or is there a way to get debug info?
>>
>> -Kirk
>>
>>
>> On Wed, Jul 27, 2016 at 12:37 AM, Apache Jenkins Server <
>> jenkins@builds.apache.org> wrote:
>>
>> See <https://builds.apache.org/job/Geode-release/17/changes>
>>>
>>> Changes:
>>>
>>> [wmarkito] GEODE-1696 - Updating release version
>>>
>>> ------------------------------------------
>>> [...truncated 1019 lines...]
>>> at
>>>
>>> com.gemstone.gemfire.internal.admin.remote.AdminRegion.destroyRegion(AdminRegion.java:128)
>>> at
>>>
>>> com.gemstone.gemfire.distributed.internal.ConsoleDistributionManagerDUnitTest.testApplications(ConsoleDistributionManagerDUnitTest.java:308)
>>>
>>> 7433 tests completed, 1 failed, 587 skipped
>>> :geode-core:distributedTest FAILED
>>> :geode-core:flakyTest
>>>
>>> com.gemstone.gemfire.security.ClientAuthenticationDUnitTest >
>>> testCredentialsForNotifications FAILED
>>> com.gemstone.gemfire.test.dunit.RMIException: While invoking
>>>
>>> com.gemstone.gemfire.security.ClientAuthenticationTestCase$$Lambda$16/180944566.run
>>> in VM 2 running on Host asf900.gq1.ygridcore.net with 4 VMs
>>> at com.gemstone.gemfire.test.dunit.VM.invoke(VM.java:389)
>>> at com.gemstone.gemfire.test.dunit.VM.invoke(VM.java:355)
>>> at com.gemstone.gemfire.test.dunit.VM.invoke(VM.java:293)
>>> at
>>>
>>> com.gemstone.gemfire.security.ClientAuthenticationTestCase.createClient1NoException(ClientAuthenticationTestCase.java:540)
>>> at
>>>
>>> com.gemstone.gemfire.security.ClientAuthenticationTestCase.doTestCredentialsForNotifications(ClientAuthenticationTestCase.java:427)
>>> at
>>>
>>> com.gemstone.gemfire.security.ClientAuthenticationDUnitTest.testCredentialsForNotifications(ClientAuthenticationDUnitTest.java:82)
>>>
>>> Caused by:
>>> java.lang.OutOfMemoryError: unable to create new native thread
>>>
>>> java.lang.AssertionError: Suspicious strings were written to the log
>>> during this run.
>>> Fix the strings or use IgnoredException.addIgnoredException to
>>> ignore.
>>>
>>> -----------------------------------------------------------------------
>>> Found suspect string in log4j at line 1157
>>>
>>> [error 2016/07/27 02:00:23.987 UTC <RMI TCP
>>> Connection(1)-67.195.81.144> tid=0x1b] java.lang.OutOfMemoryError: unable
>>> to create new native thread
>>>
>>>
>>> com.gemstone.gemfire.distributed.internal.deadlock.GemFireDeadlockDetectorDUnitTest
>>>
>>>> classMethod FAILED
>>>>
>>> java.lang.RuntimeException: Unable to launch dunit VMS
>>>
>>> Caused by:
>>> java.lang.RuntimeException: VMs did not start up with 30 seconds
>>>
>>> 189 tests completed, 2 failed, 6 skipped
>>> :geode-core:flakyTest FAILED
>>> :geode-core:integrationTest
>>> :geode-cq:assemble
>>> :geode-cq:compileTestJavaNote: Some input files use or override a
>>> deprecated API.
>>> Note: Recompile with -Xlint:deprecation for details.
>>> Note: Some input files use unchecked or unsafe operations.
>>> Note: Recompile with -Xlint:unchecked for details.
>>>
>>> :geode-cq:processTestResources
>>> :geode-cq:testClasses
>>> :geode-cq:checkMissedTests
>>> :geode-cq:test
>>> :geode-cq:check
>>> :geode-cq:build
>>> :geode-cq:distributedTest
>>> :geode-cq:flakyTest
>>> :geode-cq:integrationTest
>>> :geode-json:assemble
>>> :geode-json:compileTestJava UP-TO-DATE
>>> :geode-json:processTestResources UP-TO-DATE
>>> :geode-json:testClasses UP-TO-DATE
>>> :geode-json:checkMissedTests UP-TO-DATE
>>> :geode-json:test UP-TO-DATE
>>> :geode-json:check
>>> :geode-json:build
>>> :geode-json:distributedTest UP-TO-DATE
>>> :geode-json:flakyTest UP-TO-DATE
>>> :geode-json:integrationTest UP-TO-DATE
>>> :geode-junit:javadoc
>>> :geode-junit:javadocJar
>>> :geode-junit:sourcesJar
>>> :geode-junit:signArchives SKIPPED
>>> :geode-junit:assemble
>>> :geode-junit:compileTestJava
>>> :geode-junit:processTestResources UP-TO-DATE
>>> :geode-junit:testClasses
>>> :geode-junit:checkMissedTests
>>> :geode-junit:test
>>> :geode-junit:check
>>> :geode-junit:build
>>> :geode-junit:distributedTest
>>> :geode-junit:flakyTest
>>> :geode-junit:integrationTest
>>> :geode-lucene:assemble
>>> :geode-lucene:compileTestJava
>>> Download
>>>
>>> https://repo1.maven.org/maven2/org/apache/lucene/lucene-test-framework/6.0.0/lucene-test-framework-6.0.0.pom
>>> Download
>>>
>>> https://repo1.maven.org/maven2/org/apache/lucene/lucene-codecs/6.0.0/lucene-codecs-6.0.0.pom
>>> Download
>>>
>>> https://repo1.maven.org/maven2/com/carrotsearch/randomizedtesting/randomizedtesting-runner/2.3.2/randomizedtesting-runner-2.3.2.pom
>>> Download
>>>
>>> https://repo1.maven.org/maven2/com/carrotsearch/randomizedtesting/randomizedtesting-parent/2.3.2/randomizedtesting-parent-2.3.2.pom
>>> Download
>>>
>>> https://repo1.maven.org/maven2/org/apache/lucene/lucene-test-framework/6.0.0/lucene-test-framework-6.0.0.jar
>>> Download
>>>
>>> https://repo1.maven.org/maven2/org/apache/lucene/lucene-codecs/6.0.0/lucene-codecs-6.0.0.jar
>>> Download
>>>
>>> https://repo1.maven.org/maven2/com/carrotsearch/randomizedtesting/randomizedtesting-runner/2.3.2/randomizedtesting-runner-2.3.2.jar
>>> Note: Some input files use or override a deprecated API.
>>> Note: Recompile with -Xlint:deprecation for details.
>>> Note: Some input files use unchecked or unsafe operations.
>>> Note: Recompile with -Xlint:unchecked for details.
>>> :geode-lucene:processTestResources
>>> :geode-lucene:testClasses
>>> :geode-lucene:checkMissedTests
>>> :geode-lucene:test
>>> :geode-lucene:check
>>> :geode-lucene:build
>>> :geode-lucene:distributedTest
>>> :geode-lucene:flakyTest
>>> :geode-lucene:integrationTest
>>> :geode-pulse:assemble
>>> :geode-pulse:compileTestJava
>>> Download
>>>
>>> https://repo1.maven.org/maven2/org/seleniumhq/selenium/selenium-firefox-driver/2.53.1/selenium-firefox-driver-2.53.1.pom
>>> Download
>>>
>>> https://repo1.maven.org/maven2/org/seleniumhq/selenium/selenium-parent/2.53.1/selenium-parent-2.53.1.pom
>>> Download
>>>
>>> https://repo1.maven.org/maven2/org/seleniumhq/selenium/selenium-api/2.53.1/selenium-api-2.53.1.pom
>>> Download
>>>
>>> https://repo1.maven.org/maven2/org/seleniumhq/selenium/selenium-remote-driver/2.53.1/selenium-remote-driver-2.53.1.pom
>>> Download
>>>
>>> https://repo1.maven.org/maven2/org/seleniumhq/selenium/selenium-support/2.53.1/selenium-support-2.53.1.pom
>>> Download
>>>
>>> https://repo1.maven.org/maven2/org/springframework/spring-test/4.2.4.RELEASE/spring-test-4.2.4.RELEASE.pom
>>> Download
>>>
>>> https://repo1.maven.org/maven2/com/google/code/gson/gson/2.3.1/gson-2.3.1.pom
>>> Download
>>>
>>> https://repo1.maven.org/maven2/org/seleniumhq/selenium/selenium-firefox-driver/2.53.1/selenium-firefox-driver-2.53.1.jar
>>> Download
>>>
>>> https://repo1.maven.org/maven2/org/seleniumhq/selenium/selenium-api/2.53.1/selenium-api-2.53.1.jar
>>> Download
>>>
>>> https://repo1.maven.org/maven2/org/seleniumhq/selenium/selenium-remote-driver/2.53.1/selenium-remote-driver-2.53.1.jar
>>> Download
>>>
>>> https://repo1.maven.org/maven2/org/seleniumhq/selenium/selenium-support/2.53.1/selenium-support-2.53.1.jar
>>> Download
>>>
>>> https://repo1.maven.org/maven2/org/springframework/spring-test/4.2.4.RELEASE/spring-test-4.2.4.RELEASE.jar
>>> Download
>>>
>>> https://repo1.maven.org/maven2/com/google/code/gson/gson/2.3.1/gson-2.3.1.jar
>>> Note: <
>>>
>>> https://builds.apache.org/job/Geode-release/ws/geode-pulse/src/test/java/com/vmware/gemfire/tools/pulse/tests/PulseAbstractTest.java
>>> >
>>> uses or overrides a deprecated API.
>>> Note: Recompile with -Xlint:deprecation for details.
>>> Note: Some input files use unchecked or unsafe operations.
>>> Note: Recompile with -Xlint:unchecked for details.
>>> :geode-pulse:processTestResources
>>> :geode-pulse:testClasses
>>> :geode-pulse:checkMissedTests
>>> Download
>>>
>>> https://repo1.maven.org/maven2/com/jayway/jsonpath/json-path/1.2.0/json-path-1.2.0.pom
>>> Download
>>>
>>> https://repo1.maven.org/maven2/net/minidev/json-smart/2.1.0/json-smart-2.1.0.pom
>>> Download
>>> https://repo1.maven.org/maven2/net/minidev/parent/2.1.0/parent-2.1.0.pom
>>> Download
>>> https://repo1.maven.org/maven2/net/minidev/asm/1.0.2/asm-1.0.2.pom
>>> Download
>>>
>>> https://repo1.maven.org/maven2/com/jayway/jsonpath/json-path/1.2.0/json-path-1.2.0.jar
>>> Download
>>>
>>> https://repo1.maven.org/maven2/net/minidev/json-smart/2.1.0/json-smart-2.1.0.jar
>>> Download
>>> https://repo1.maven.org/maven2/net/minidev/asm/1.0.2/asm-1.0.2.jar
>>> :geode-pulse:test
>>> :geode-pulse:check
>>> :geode-pulse:build
>>> :geode-pulse:distributedTest
>>> :geode-pulse:flakyTest
>>> :geode-pulse:integrationTest
>>> :geode-rebalancer:jar
>>> :geode-rebalancer:javadoc
>>> :geode-rebalancer:javadocJar
>>> :geode-rebalancer:sourcesJar
>>> :geode-rebalancer:signArchives SKIPPED
>>> :geode-rebalancer:assemble
>>> :geode-rebalancer:compileTestJava
>>> :geode-rebalancer:processTestResources UP-TO-DATE
>>> :geode-rebalancer:testClasses
>>> :geode-rebalancer:checkMissedTests
>>> :geode-rebalancer:test
>>> :geode-rebalancer:check
>>> :geode-rebalancer:build
>>> :geode-rebalancer:distributedTest
>>> :geode-rebalancer:flakyTest
>>> :geode-rebalancer:integrationTest
>>> :geode-wan:assemble
>>> :geode-wan:compileTestJavaNote: Some input files use or override a
>>> deprecated API.
>>> Note: Recompile with -Xlint:deprecation for details.
>>> Note: Some input files use unchecked or unsafe operations.
>>> Note: Recompile with -Xlint:unchecked for details.
>>>
>>> :geode-wan:processTestResources
>>> :geode-wan:testClasses
>>> :geode-wan:checkMissedTests
>>> :geode-wan:test
>>> :geode-wan:check
>>> :geode-wan:build
>>> :geode-wan:distributedTest
>>> :geode-wan:flakyTest
>>> :geode-wan:integrationTest
>>> :geode-web:assemble
>>> :geode-web:compileTestJavaNote: <
>>>
>>> https://builds.apache.org/job/Geode-release/ws/geode-web/src/test/java/com/gemstone/gemfire/management/internal/cli/commands/DataCommandsOverHttpDistributedTest.java
>>> >
>>> uses or overrides a deprecated API.
>>> Note: Recompile with -Xlint:deprecation for details.
>>> Note: Some input files use unchecked or unsafe operations.
>>> Note: Recompile with -Xlint:unchecked for details.
>>>
>>> :geode-web:processTestResources UP-TO-DATE
>>> :geode-web:testClasses
>>> :geode-web:checkMissedTests
>>> :geode-web:test
>>> :geode-web:check
>>> :geode-web:build
>>> :geode-web:distributedTest
>>> :geode-web:flakyTest
>>> :geode-web:integrationTest
>>> :geode-web-api:assemble
>>> :geode-web-api:compileTestJava UP-TO-DATE
>>> :geode-web-api:processTestResources UP-TO-DATE
>>> :geode-web-api:testClasses UP-TO-DATE
>>> :geode-web-api:checkMissedTests UP-TO-DATE
>>> :geode-web-api:test UP-TO-DATE
>>> :geode-web-api:check
>>> :geode-web-api:build
>>> :geode-web-api:distributedTest UP-TO-DATE
>>> :geode-web-api:flakyTest UP-TO-DATE
>>> :geode-web-api:integrationTest UP-TO-DATE
>>> :combineReports
>>> All test reports at <
>>> https://builds.apache.org/job/Geode-release/ws/build/reports/combined>
>>> :extensions/geode-modules:precheckin
>>> :extensions/geode-modules-assembly:precheckin
>>> :extensions/geode-modules-hibernate:precheckin
>>> :extensions/geode-modules-session:precheckin
>>> :extensions/geode-modules-session-internal:precheckin
>>> :extensions/geode-modules-tomcat7:precheckin
>>> :geode-common:precheckin
>>> :geode-cq:precheckin
>>> :geode-json:precheckin
>>> :geode-junit:precheckin
>>> :geode-lucene:precheckin
>>> :geode-pulse:precheckin
>>> :geode-rebalancer:precheckin
>>> :geode-wan:precheckin
>>> :geode-web:precheckin
>>> :geode-web-api:precheckin
>>>
>>> FAILURE: Build completed with 3 failures.
>>>
>>> 1: Task failed with an exception.
>>> -----------
>>> * What went wrong:
>>> Execution failed for task ':geode-assembly:flakyTest'.
>>>
>>>> There were failing tests. See the report at: file://<
>>>>
>>>
>>> https://builds.apache.org/job/Geode-release/ws/geode-assembly/build/reports/flakyTest/index.html
>>> * Try:
>>> Run with --stacktrace option to get the stack trace. Run with --info or
>>> --debug option to get more log output.
>>>
>>>
>>> ==============================================================================
>>>
>>> 2: Task failed with an exception.
>>> -----------
>>> * What went wrong:
>>> Execution failed for task ':geode-core:distributedTest'.
>>>
>>>> There were failing tests. See the report at: file://<
>>>>
>>>
>>> https://builds.apache.org/job/Geode-release/ws/geode-core/build/reports/distributedTest/index.html
>>> * Try:
>>> Run with --stacktrace option to get the stack trace. Run with --info or
>>> --debug option to get more log output.
>>>
>>>
>>> ==============================================================================
>>>
>>> 3: Task failed with an exception.
>>> -----------
>>> * What went wrong:
>>> Execution failed for task ':geode-core:flakyTest'.
>>>
>>>> There were failing tests. See the report at: file://<
>>>>
>>>
>>> https://builds.apache.org/job/Geode-release/ws/geode-core/build/reports/flakyTest/index.html
>>> * Try:
>>> Run with --stacktrace option to get the stack trace. Run with --info or
>>> --debug option to get more log output.
>>>
>>>
>>> ==============================================================================
>>>
>>> BUILD FAILED
>>>
>>> Total time: 11 hrs 26 mins 30.535 secs
>>> Build step 'Invoke Gradle script' changed build result to FAILURE
>>> Build step 'Invoke Gradle script' marked build as failure
>>> Archiving artifacts
>>> Compressed 250.79 MB of artifacts by 12.1% relative to #7
>>> Recording test results
>>>
>>>
>
Re: Build failed in Jenkins: Geode-release #17
Posted by Bruce Schuchardt <bs...@pivotal.io>.
Do we have any information on the ulimit settings in the account running
the tests? This may just be an issue with how the account is configured.
Le 7/27/2016 � 9:21 AM, Kirk Lund a �crit :
> Looks like OutOfMemory is the cause of this failure. Do we need to increase
> heap size for Jenkins or is there a way to get debug info?
>
> -Kirk
>
>
> On Wed, Jul 27, 2016 at 12:37 AM, Apache Jenkins Server <
> jenkins@builds.apache.org> wrote:
>
>> See <https://builds.apache.org/job/Geode-release/17/changes>
>>
>> Changes:
>>
>> [wmarkito] GEODE-1696 - Updating release version
>>
>> ------------------------------------------
>> [...truncated 1019 lines...]
>> at
>> com.gemstone.gemfire.internal.admin.remote.AdminRegion.destroyRegion(AdminRegion.java:128)
>> at
>> com.gemstone.gemfire.distributed.internal.ConsoleDistributionManagerDUnitTest.testApplications(ConsoleDistributionManagerDUnitTest.java:308)
>>
>> 7433 tests completed, 1 failed, 587 skipped
>> :geode-core:distributedTest FAILED
>> :geode-core:flakyTest
>>
>> com.gemstone.gemfire.security.ClientAuthenticationDUnitTest >
>> testCredentialsForNotifications FAILED
>> com.gemstone.gemfire.test.dunit.RMIException: While invoking
>> com.gemstone.gemfire.security.ClientAuthenticationTestCase$$Lambda$16/180944566.run
>> in VM 2 running on Host asf900.gq1.ygridcore.net with 4 VMs
>> at com.gemstone.gemfire.test.dunit.VM.invoke(VM.java:389)
>> at com.gemstone.gemfire.test.dunit.VM.invoke(VM.java:355)
>> at com.gemstone.gemfire.test.dunit.VM.invoke(VM.java:293)
>> at
>> com.gemstone.gemfire.security.ClientAuthenticationTestCase.createClient1NoException(ClientAuthenticationTestCase.java:540)
>> at
>> com.gemstone.gemfire.security.ClientAuthenticationTestCase.doTestCredentialsForNotifications(ClientAuthenticationTestCase.java:427)
>> at
>> com.gemstone.gemfire.security.ClientAuthenticationDUnitTest.testCredentialsForNotifications(ClientAuthenticationDUnitTest.java:82)
>>
>> Caused by:
>> java.lang.OutOfMemoryError: unable to create new native thread
>>
>> java.lang.AssertionError: Suspicious strings were written to the log
>> during this run.
>> Fix the strings or use IgnoredException.addIgnoredException to ignore.
>> -----------------------------------------------------------------------
>> Found suspect string in log4j at line 1157
>>
>> [error 2016/07/27 02:00:23.987 UTC <RMI TCP
>> Connection(1)-67.195.81.144> tid=0x1b] java.lang.OutOfMemoryError: unable
>> to create new native thread
>>
>> com.gemstone.gemfire.distributed.internal.deadlock.GemFireDeadlockDetectorDUnitTest
>>> classMethod FAILED
>> java.lang.RuntimeException: Unable to launch dunit VMS
>>
>> Caused by:
>> java.lang.RuntimeException: VMs did not start up with 30 seconds
>>
>> 189 tests completed, 2 failed, 6 skipped
>> :geode-core:flakyTest FAILED
>> :geode-core:integrationTest
>> :geode-cq:assemble
>> :geode-cq:compileTestJavaNote: Some input files use or override a
>> deprecated API.
>> Note: Recompile with -Xlint:deprecation for details.
>> Note: Some input files use unchecked or unsafe operations.
>> Note: Recompile with -Xlint:unchecked for details.
>>
>> :geode-cq:processTestResources
>> :geode-cq:testClasses
>> :geode-cq:checkMissedTests
>> :geode-cq:test
>> :geode-cq:check
>> :geode-cq:build
>> :geode-cq:distributedTest
>> :geode-cq:flakyTest
>> :geode-cq:integrationTest
>> :geode-json:assemble
>> :geode-json:compileTestJava UP-TO-DATE
>> :geode-json:processTestResources UP-TO-DATE
>> :geode-json:testClasses UP-TO-DATE
>> :geode-json:checkMissedTests UP-TO-DATE
>> :geode-json:test UP-TO-DATE
>> :geode-json:check
>> :geode-json:build
>> :geode-json:distributedTest UP-TO-DATE
>> :geode-json:flakyTest UP-TO-DATE
>> :geode-json:integrationTest UP-TO-DATE
>> :geode-junit:javadoc
>> :geode-junit:javadocJar
>> :geode-junit:sourcesJar
>> :geode-junit:signArchives SKIPPED
>> :geode-junit:assemble
>> :geode-junit:compileTestJava
>> :geode-junit:processTestResources UP-TO-DATE
>> :geode-junit:testClasses
>> :geode-junit:checkMissedTests
>> :geode-junit:test
>> :geode-junit:check
>> :geode-junit:build
>> :geode-junit:distributedTest
>> :geode-junit:flakyTest
>> :geode-junit:integrationTest
>> :geode-lucene:assemble
>> :geode-lucene:compileTestJava
>> Download
>> https://repo1.maven.org/maven2/org/apache/lucene/lucene-test-framework/6.0.0/lucene-test-framework-6.0.0.pom
>> Download
>> https://repo1.maven.org/maven2/org/apache/lucene/lucene-codecs/6.0.0/lucene-codecs-6.0.0.pom
>> Download
>> https://repo1.maven.org/maven2/com/carrotsearch/randomizedtesting/randomizedtesting-runner/2.3.2/randomizedtesting-runner-2.3.2.pom
>> Download
>> https://repo1.maven.org/maven2/com/carrotsearch/randomizedtesting/randomizedtesting-parent/2.3.2/randomizedtesting-parent-2.3.2.pom
>> Download
>> https://repo1.maven.org/maven2/org/apache/lucene/lucene-test-framework/6.0.0/lucene-test-framework-6.0.0.jar
>> Download
>> https://repo1.maven.org/maven2/org/apache/lucene/lucene-codecs/6.0.0/lucene-codecs-6.0.0.jar
>> Download
>> https://repo1.maven.org/maven2/com/carrotsearch/randomizedtesting/randomizedtesting-runner/2.3.2/randomizedtesting-runner-2.3.2.jar
>> Note: Some input files use or override a deprecated API.
>> Note: Recompile with -Xlint:deprecation for details.
>> Note: Some input files use unchecked or unsafe operations.
>> Note: Recompile with -Xlint:unchecked for details.
>> :geode-lucene:processTestResources
>> :geode-lucene:testClasses
>> :geode-lucene:checkMissedTests
>> :geode-lucene:test
>> :geode-lucene:check
>> :geode-lucene:build
>> :geode-lucene:distributedTest
>> :geode-lucene:flakyTest
>> :geode-lucene:integrationTest
>> :geode-pulse:assemble
>> :geode-pulse:compileTestJava
>> Download
>> https://repo1.maven.org/maven2/org/seleniumhq/selenium/selenium-firefox-driver/2.53.1/selenium-firefox-driver-2.53.1.pom
>> Download
>> https://repo1.maven.org/maven2/org/seleniumhq/selenium/selenium-parent/2.53.1/selenium-parent-2.53.1.pom
>> Download
>> https://repo1.maven.org/maven2/org/seleniumhq/selenium/selenium-api/2.53.1/selenium-api-2.53.1.pom
>> Download
>> https://repo1.maven.org/maven2/org/seleniumhq/selenium/selenium-remote-driver/2.53.1/selenium-remote-driver-2.53.1.pom
>> Download
>> https://repo1.maven.org/maven2/org/seleniumhq/selenium/selenium-support/2.53.1/selenium-support-2.53.1.pom
>> Download
>> https://repo1.maven.org/maven2/org/springframework/spring-test/4.2.4.RELEASE/spring-test-4.2.4.RELEASE.pom
>> Download
>> https://repo1.maven.org/maven2/com/google/code/gson/gson/2.3.1/gson-2.3.1.pom
>> Download
>> https://repo1.maven.org/maven2/org/seleniumhq/selenium/selenium-firefox-driver/2.53.1/selenium-firefox-driver-2.53.1.jar
>> Download
>> https://repo1.maven.org/maven2/org/seleniumhq/selenium/selenium-api/2.53.1/selenium-api-2.53.1.jar
>> Download
>> https://repo1.maven.org/maven2/org/seleniumhq/selenium/selenium-remote-driver/2.53.1/selenium-remote-driver-2.53.1.jar
>> Download
>> https://repo1.maven.org/maven2/org/seleniumhq/selenium/selenium-support/2.53.1/selenium-support-2.53.1.jar
>> Download
>> https://repo1.maven.org/maven2/org/springframework/spring-test/4.2.4.RELEASE/spring-test-4.2.4.RELEASE.jar
>> Download
>> https://repo1.maven.org/maven2/com/google/code/gson/gson/2.3.1/gson-2.3.1.jar
>> Note: <
>> https://builds.apache.org/job/Geode-release/ws/geode-pulse/src/test/java/com/vmware/gemfire/tools/pulse/tests/PulseAbstractTest.java>
>> uses or overrides a deprecated API.
>> Note: Recompile with -Xlint:deprecation for details.
>> Note: Some input files use unchecked or unsafe operations.
>> Note: Recompile with -Xlint:unchecked for details.
>> :geode-pulse:processTestResources
>> :geode-pulse:testClasses
>> :geode-pulse:checkMissedTests
>> Download
>> https://repo1.maven.org/maven2/com/jayway/jsonpath/json-path/1.2.0/json-path-1.2.0.pom
>> Download
>> https://repo1.maven.org/maven2/net/minidev/json-smart/2.1.0/json-smart-2.1.0.pom
>> Download
>> https://repo1.maven.org/maven2/net/minidev/parent/2.1.0/parent-2.1.0.pom
>> Download
>> https://repo1.maven.org/maven2/net/minidev/asm/1.0.2/asm-1.0.2.pom
>> Download
>> https://repo1.maven.org/maven2/com/jayway/jsonpath/json-path/1.2.0/json-path-1.2.0.jar
>> Download
>> https://repo1.maven.org/maven2/net/minidev/json-smart/2.1.0/json-smart-2.1.0.jar
>> Download
>> https://repo1.maven.org/maven2/net/minidev/asm/1.0.2/asm-1.0.2.jar
>> :geode-pulse:test
>> :geode-pulse:check
>> :geode-pulse:build
>> :geode-pulse:distributedTest
>> :geode-pulse:flakyTest
>> :geode-pulse:integrationTest
>> :geode-rebalancer:jar
>> :geode-rebalancer:javadoc
>> :geode-rebalancer:javadocJar
>> :geode-rebalancer:sourcesJar
>> :geode-rebalancer:signArchives SKIPPED
>> :geode-rebalancer:assemble
>> :geode-rebalancer:compileTestJava
>> :geode-rebalancer:processTestResources UP-TO-DATE
>> :geode-rebalancer:testClasses
>> :geode-rebalancer:checkMissedTests
>> :geode-rebalancer:test
>> :geode-rebalancer:check
>> :geode-rebalancer:build
>> :geode-rebalancer:distributedTest
>> :geode-rebalancer:flakyTest
>> :geode-rebalancer:integrationTest
>> :geode-wan:assemble
>> :geode-wan:compileTestJavaNote: Some input files use or override a
>> deprecated API.
>> Note: Recompile with -Xlint:deprecation for details.
>> Note: Some input files use unchecked or unsafe operations.
>> Note: Recompile with -Xlint:unchecked for details.
>>
>> :geode-wan:processTestResources
>> :geode-wan:testClasses
>> :geode-wan:checkMissedTests
>> :geode-wan:test
>> :geode-wan:check
>> :geode-wan:build
>> :geode-wan:distributedTest
>> :geode-wan:flakyTest
>> :geode-wan:integrationTest
>> :geode-web:assemble
>> :geode-web:compileTestJavaNote: <
>> https://builds.apache.org/job/Geode-release/ws/geode-web/src/test/java/com/gemstone/gemfire/management/internal/cli/commands/DataCommandsOverHttpDistributedTest.java>
>> uses or overrides a deprecated API.
>> Note: Recompile with -Xlint:deprecation for details.
>> Note: Some input files use unchecked or unsafe operations.
>> Note: Recompile with -Xlint:unchecked for details.
>>
>> :geode-web:processTestResources UP-TO-DATE
>> :geode-web:testClasses
>> :geode-web:checkMissedTests
>> :geode-web:test
>> :geode-web:check
>> :geode-web:build
>> :geode-web:distributedTest
>> :geode-web:flakyTest
>> :geode-web:integrationTest
>> :geode-web-api:assemble
>> :geode-web-api:compileTestJava UP-TO-DATE
>> :geode-web-api:processTestResources UP-TO-DATE
>> :geode-web-api:testClasses UP-TO-DATE
>> :geode-web-api:checkMissedTests UP-TO-DATE
>> :geode-web-api:test UP-TO-DATE
>> :geode-web-api:check
>> :geode-web-api:build
>> :geode-web-api:distributedTest UP-TO-DATE
>> :geode-web-api:flakyTest UP-TO-DATE
>> :geode-web-api:integrationTest UP-TO-DATE
>> :combineReports
>> All test reports at <
>> https://builds.apache.org/job/Geode-release/ws/build/reports/combined>
>> :extensions/geode-modules:precheckin
>> :extensions/geode-modules-assembly:precheckin
>> :extensions/geode-modules-hibernate:precheckin
>> :extensions/geode-modules-session:precheckin
>> :extensions/geode-modules-session-internal:precheckin
>> :extensions/geode-modules-tomcat7:precheckin
>> :geode-common:precheckin
>> :geode-cq:precheckin
>> :geode-json:precheckin
>> :geode-junit:precheckin
>> :geode-lucene:precheckin
>> :geode-pulse:precheckin
>> :geode-rebalancer:precheckin
>> :geode-wan:precheckin
>> :geode-web:precheckin
>> :geode-web-api:precheckin
>>
>> FAILURE: Build completed with 3 failures.
>>
>> 1: Task failed with an exception.
>> -----------
>> * What went wrong:
>> Execution failed for task ':geode-assembly:flakyTest'.
>>> There were failing tests. See the report at: file://<
>> https://builds.apache.org/job/Geode-release/ws/geode-assembly/build/reports/flakyTest/index.html
>> * Try:
>> Run with --stacktrace option to get the stack trace. Run with --info or
>> --debug option to get more log output.
>>
>> ==============================================================================
>>
>> 2: Task failed with an exception.
>> -----------
>> * What went wrong:
>> Execution failed for task ':geode-core:distributedTest'.
>>> There were failing tests. See the report at: file://<
>> https://builds.apache.org/job/Geode-release/ws/geode-core/build/reports/distributedTest/index.html
>> * Try:
>> Run with --stacktrace option to get the stack trace. Run with --info or
>> --debug option to get more log output.
>>
>> ==============================================================================
>>
>> 3: Task failed with an exception.
>> -----------
>> * What went wrong:
>> Execution failed for task ':geode-core:flakyTest'.
>>> There were failing tests. See the report at: file://<
>> https://builds.apache.org/job/Geode-release/ws/geode-core/build/reports/flakyTest/index.html
>> * Try:
>> Run with --stacktrace option to get the stack trace. Run with --info or
>> --debug option to get more log output.
>>
>> ==============================================================================
>>
>> BUILD FAILED
>>
>> Total time: 11 hrs 26 mins 30.535 secs
>> Build step 'Invoke Gradle script' changed build result to FAILURE
>> Build step 'Invoke Gradle script' marked build as failure
>> Archiving artifacts
>> Compressed 250.79 MB of artifacts by 12.1% relative to #7
>> Recording test results
>>
Re: Build failed in Jenkins: Geode-release #17
Posted by Kirk Lund <kl...@pivotal.io>.
Looks like OutOfMemory is the cause of this failure. Do we need to increase
heap size for Jenkins or is there a way to get debug info?
-Kirk
On Wed, Jul 27, 2016 at 12:37 AM, Apache Jenkins Server <
jenkins@builds.apache.org> wrote:
> See <https://builds.apache.org/job/Geode-release/17/changes>
>
> Changes:
>
> [wmarkito] GEODE-1696 - Updating release version
>
> ------------------------------------------
> [...truncated 1019 lines...]
> at
> com.gemstone.gemfire.internal.admin.remote.AdminRegion.destroyRegion(AdminRegion.java:128)
> at
> com.gemstone.gemfire.distributed.internal.ConsoleDistributionManagerDUnitTest.testApplications(ConsoleDistributionManagerDUnitTest.java:308)
>
> 7433 tests completed, 1 failed, 587 skipped
> :geode-core:distributedTest FAILED
> :geode-core:flakyTest
>
> com.gemstone.gemfire.security.ClientAuthenticationDUnitTest >
> testCredentialsForNotifications FAILED
> com.gemstone.gemfire.test.dunit.RMIException: While invoking
> com.gemstone.gemfire.security.ClientAuthenticationTestCase$$Lambda$16/180944566.run
> in VM 2 running on Host asf900.gq1.ygridcore.net with 4 VMs
> at com.gemstone.gemfire.test.dunit.VM.invoke(VM.java:389)
> at com.gemstone.gemfire.test.dunit.VM.invoke(VM.java:355)
> at com.gemstone.gemfire.test.dunit.VM.invoke(VM.java:293)
> at
> com.gemstone.gemfire.security.ClientAuthenticationTestCase.createClient1NoException(ClientAuthenticationTestCase.java:540)
> at
> com.gemstone.gemfire.security.ClientAuthenticationTestCase.doTestCredentialsForNotifications(ClientAuthenticationTestCase.java:427)
> at
> com.gemstone.gemfire.security.ClientAuthenticationDUnitTest.testCredentialsForNotifications(ClientAuthenticationDUnitTest.java:82)
>
> Caused by:
> java.lang.OutOfMemoryError: unable to create new native thread
>
> java.lang.AssertionError: Suspicious strings were written to the log
> during this run.
> Fix the strings or use IgnoredException.addIgnoredException to ignore.
> -----------------------------------------------------------------------
> Found suspect string in log4j at line 1157
>
> [error 2016/07/27 02:00:23.987 UTC <RMI TCP
> Connection(1)-67.195.81.144> tid=0x1b] java.lang.OutOfMemoryError: unable
> to create new native thread
>
> com.gemstone.gemfire.distributed.internal.deadlock.GemFireDeadlockDetectorDUnitTest
> > classMethod FAILED
> java.lang.RuntimeException: Unable to launch dunit VMS
>
> Caused by:
> java.lang.RuntimeException: VMs did not start up with 30 seconds
>
> 189 tests completed, 2 failed, 6 skipped
> :geode-core:flakyTest FAILED
> :geode-core:integrationTest
> :geode-cq:assemble
> :geode-cq:compileTestJavaNote: Some input files use or override a
> deprecated API.
> Note: Recompile with -Xlint:deprecation for details.
> Note: Some input files use unchecked or unsafe operations.
> Note: Recompile with -Xlint:unchecked for details.
>
> :geode-cq:processTestResources
> :geode-cq:testClasses
> :geode-cq:checkMissedTests
> :geode-cq:test
> :geode-cq:check
> :geode-cq:build
> :geode-cq:distributedTest
> :geode-cq:flakyTest
> :geode-cq:integrationTest
> :geode-json:assemble
> :geode-json:compileTestJava UP-TO-DATE
> :geode-json:processTestResources UP-TO-DATE
> :geode-json:testClasses UP-TO-DATE
> :geode-json:checkMissedTests UP-TO-DATE
> :geode-json:test UP-TO-DATE
> :geode-json:check
> :geode-json:build
> :geode-json:distributedTest UP-TO-DATE
> :geode-json:flakyTest UP-TO-DATE
> :geode-json:integrationTest UP-TO-DATE
> :geode-junit:javadoc
> :geode-junit:javadocJar
> :geode-junit:sourcesJar
> :geode-junit:signArchives SKIPPED
> :geode-junit:assemble
> :geode-junit:compileTestJava
> :geode-junit:processTestResources UP-TO-DATE
> :geode-junit:testClasses
> :geode-junit:checkMissedTests
> :geode-junit:test
> :geode-junit:check
> :geode-junit:build
> :geode-junit:distributedTest
> :geode-junit:flakyTest
> :geode-junit:integrationTest
> :geode-lucene:assemble
> :geode-lucene:compileTestJava
> Download
> https://repo1.maven.org/maven2/org/apache/lucene/lucene-test-framework/6.0.0/lucene-test-framework-6.0.0.pom
> Download
> https://repo1.maven.org/maven2/org/apache/lucene/lucene-codecs/6.0.0/lucene-codecs-6.0.0.pom
> Download
> https://repo1.maven.org/maven2/com/carrotsearch/randomizedtesting/randomizedtesting-runner/2.3.2/randomizedtesting-runner-2.3.2.pom
> Download
> https://repo1.maven.org/maven2/com/carrotsearch/randomizedtesting/randomizedtesting-parent/2.3.2/randomizedtesting-parent-2.3.2.pom
> Download
> https://repo1.maven.org/maven2/org/apache/lucene/lucene-test-framework/6.0.0/lucene-test-framework-6.0.0.jar
> Download
> https://repo1.maven.org/maven2/org/apache/lucene/lucene-codecs/6.0.0/lucene-codecs-6.0.0.jar
> Download
> https://repo1.maven.org/maven2/com/carrotsearch/randomizedtesting/randomizedtesting-runner/2.3.2/randomizedtesting-runner-2.3.2.jar
> Note: Some input files use or override a deprecated API.
> Note: Recompile with -Xlint:deprecation for details.
> Note: Some input files use unchecked or unsafe operations.
> Note: Recompile with -Xlint:unchecked for details.
> :geode-lucene:processTestResources
> :geode-lucene:testClasses
> :geode-lucene:checkMissedTests
> :geode-lucene:test
> :geode-lucene:check
> :geode-lucene:build
> :geode-lucene:distributedTest
> :geode-lucene:flakyTest
> :geode-lucene:integrationTest
> :geode-pulse:assemble
> :geode-pulse:compileTestJava
> Download
> https://repo1.maven.org/maven2/org/seleniumhq/selenium/selenium-firefox-driver/2.53.1/selenium-firefox-driver-2.53.1.pom
> Download
> https://repo1.maven.org/maven2/org/seleniumhq/selenium/selenium-parent/2.53.1/selenium-parent-2.53.1.pom
> Download
> https://repo1.maven.org/maven2/org/seleniumhq/selenium/selenium-api/2.53.1/selenium-api-2.53.1.pom
> Download
> https://repo1.maven.org/maven2/org/seleniumhq/selenium/selenium-remote-driver/2.53.1/selenium-remote-driver-2.53.1.pom
> Download
> https://repo1.maven.org/maven2/org/seleniumhq/selenium/selenium-support/2.53.1/selenium-support-2.53.1.pom
> Download
> https://repo1.maven.org/maven2/org/springframework/spring-test/4.2.4.RELEASE/spring-test-4.2.4.RELEASE.pom
> Download
> https://repo1.maven.org/maven2/com/google/code/gson/gson/2.3.1/gson-2.3.1.pom
> Download
> https://repo1.maven.org/maven2/org/seleniumhq/selenium/selenium-firefox-driver/2.53.1/selenium-firefox-driver-2.53.1.jar
> Download
> https://repo1.maven.org/maven2/org/seleniumhq/selenium/selenium-api/2.53.1/selenium-api-2.53.1.jar
> Download
> https://repo1.maven.org/maven2/org/seleniumhq/selenium/selenium-remote-driver/2.53.1/selenium-remote-driver-2.53.1.jar
> Download
> https://repo1.maven.org/maven2/org/seleniumhq/selenium/selenium-support/2.53.1/selenium-support-2.53.1.jar
> Download
> https://repo1.maven.org/maven2/org/springframework/spring-test/4.2.4.RELEASE/spring-test-4.2.4.RELEASE.jar
> Download
> https://repo1.maven.org/maven2/com/google/code/gson/gson/2.3.1/gson-2.3.1.jar
> Note: <
> https://builds.apache.org/job/Geode-release/ws/geode-pulse/src/test/java/com/vmware/gemfire/tools/pulse/tests/PulseAbstractTest.java>
> uses or overrides a deprecated API.
> Note: Recompile with -Xlint:deprecation for details.
> Note: Some input files use unchecked or unsafe operations.
> Note: Recompile with -Xlint:unchecked for details.
> :geode-pulse:processTestResources
> :geode-pulse:testClasses
> :geode-pulse:checkMissedTests
> Download
> https://repo1.maven.org/maven2/com/jayway/jsonpath/json-path/1.2.0/json-path-1.2.0.pom
> Download
> https://repo1.maven.org/maven2/net/minidev/json-smart/2.1.0/json-smart-2.1.0.pom
> Download
> https://repo1.maven.org/maven2/net/minidev/parent/2.1.0/parent-2.1.0.pom
> Download
> https://repo1.maven.org/maven2/net/minidev/asm/1.0.2/asm-1.0.2.pom
> Download
> https://repo1.maven.org/maven2/com/jayway/jsonpath/json-path/1.2.0/json-path-1.2.0.jar
> Download
> https://repo1.maven.org/maven2/net/minidev/json-smart/2.1.0/json-smart-2.1.0.jar
> Download
> https://repo1.maven.org/maven2/net/minidev/asm/1.0.2/asm-1.0.2.jar
> :geode-pulse:test
> :geode-pulse:check
> :geode-pulse:build
> :geode-pulse:distributedTest
> :geode-pulse:flakyTest
> :geode-pulse:integrationTest
> :geode-rebalancer:jar
> :geode-rebalancer:javadoc
> :geode-rebalancer:javadocJar
> :geode-rebalancer:sourcesJar
> :geode-rebalancer:signArchives SKIPPED
> :geode-rebalancer:assemble
> :geode-rebalancer:compileTestJava
> :geode-rebalancer:processTestResources UP-TO-DATE
> :geode-rebalancer:testClasses
> :geode-rebalancer:checkMissedTests
> :geode-rebalancer:test
> :geode-rebalancer:check
> :geode-rebalancer:build
> :geode-rebalancer:distributedTest
> :geode-rebalancer:flakyTest
> :geode-rebalancer:integrationTest
> :geode-wan:assemble
> :geode-wan:compileTestJavaNote: Some input files use or override a
> deprecated API.
> Note: Recompile with -Xlint:deprecation for details.
> Note: Some input files use unchecked or unsafe operations.
> Note: Recompile with -Xlint:unchecked for details.
>
> :geode-wan:processTestResources
> :geode-wan:testClasses
> :geode-wan:checkMissedTests
> :geode-wan:test
> :geode-wan:check
> :geode-wan:build
> :geode-wan:distributedTest
> :geode-wan:flakyTest
> :geode-wan:integrationTest
> :geode-web:assemble
> :geode-web:compileTestJavaNote: <
> https://builds.apache.org/job/Geode-release/ws/geode-web/src/test/java/com/gemstone/gemfire/management/internal/cli/commands/DataCommandsOverHttpDistributedTest.java>
> uses or overrides a deprecated API.
> Note: Recompile with -Xlint:deprecation for details.
> Note: Some input files use unchecked or unsafe operations.
> Note: Recompile with -Xlint:unchecked for details.
>
> :geode-web:processTestResources UP-TO-DATE
> :geode-web:testClasses
> :geode-web:checkMissedTests
> :geode-web:test
> :geode-web:check
> :geode-web:build
> :geode-web:distributedTest
> :geode-web:flakyTest
> :geode-web:integrationTest
> :geode-web-api:assemble
> :geode-web-api:compileTestJava UP-TO-DATE
> :geode-web-api:processTestResources UP-TO-DATE
> :geode-web-api:testClasses UP-TO-DATE
> :geode-web-api:checkMissedTests UP-TO-DATE
> :geode-web-api:test UP-TO-DATE
> :geode-web-api:check
> :geode-web-api:build
> :geode-web-api:distributedTest UP-TO-DATE
> :geode-web-api:flakyTest UP-TO-DATE
> :geode-web-api:integrationTest UP-TO-DATE
> :combineReports
> All test reports at <
> https://builds.apache.org/job/Geode-release/ws/build/reports/combined>
> :extensions/geode-modules:precheckin
> :extensions/geode-modules-assembly:precheckin
> :extensions/geode-modules-hibernate:precheckin
> :extensions/geode-modules-session:precheckin
> :extensions/geode-modules-session-internal:precheckin
> :extensions/geode-modules-tomcat7:precheckin
> :geode-common:precheckin
> :geode-cq:precheckin
> :geode-json:precheckin
> :geode-junit:precheckin
> :geode-lucene:precheckin
> :geode-pulse:precheckin
> :geode-rebalancer:precheckin
> :geode-wan:precheckin
> :geode-web:precheckin
> :geode-web-api:precheckin
>
> FAILURE: Build completed with 3 failures.
>
> 1: Task failed with an exception.
> -----------
> * What went wrong:
> Execution failed for task ':geode-assembly:flakyTest'.
> > There were failing tests. See the report at: file://<
> https://builds.apache.org/job/Geode-release/ws/geode-assembly/build/reports/flakyTest/index.html
> >
>
> * Try:
> Run with --stacktrace option to get the stack trace. Run with --info or
> --debug option to get more log output.
>
> ==============================================================================
>
> 2: Task failed with an exception.
> -----------
> * What went wrong:
> Execution failed for task ':geode-core:distributedTest'.
> > There were failing tests. See the report at: file://<
> https://builds.apache.org/job/Geode-release/ws/geode-core/build/reports/distributedTest/index.html
> >
>
> * Try:
> Run with --stacktrace option to get the stack trace. Run with --info or
> --debug option to get more log output.
>
> ==============================================================================
>
> 3: Task failed with an exception.
> -----------
> * What went wrong:
> Execution failed for task ':geode-core:flakyTest'.
> > There were failing tests. See the report at: file://<
> https://builds.apache.org/job/Geode-release/ws/geode-core/build/reports/flakyTest/index.html
> >
>
> * Try:
> Run with --stacktrace option to get the stack trace. Run with --info or
> --debug option to get more log output.
>
> ==============================================================================
>
> BUILD FAILED
>
> Total time: 11 hrs 26 mins 30.535 secs
> Build step 'Invoke Gradle script' changed build result to FAILURE
> Build step 'Invoke Gradle script' marked build as failure
> Archiving artifacts
> Compressed 250.79 MB of artifacts by 12.1% relative to #7
> Recording test results
>
Build failed in Jenkins: Geode-release #17
Posted by Apache Jenkins Server <je...@builds.apache.org>.
See <https://builds.apache.org/job/Geode-release/17/changes>
Changes:
[wmarkito] GEODE-1696 - Updating release version
------------------------------------------
[...truncated 1019 lines...]
at com.gemstone.gemfire.internal.admin.remote.AdminRegion.destroyRegion(AdminRegion.java:128)
at com.gemstone.gemfire.distributed.internal.ConsoleDistributionManagerDUnitTest.testApplications(ConsoleDistributionManagerDUnitTest.java:308)
7433 tests completed, 1 failed, 587 skipped
:geode-core:distributedTest FAILED
:geode-core:flakyTest
com.gemstone.gemfire.security.ClientAuthenticationDUnitTest > testCredentialsForNotifications FAILED
com.gemstone.gemfire.test.dunit.RMIException: While invoking com.gemstone.gemfire.security.ClientAuthenticationTestCase$$Lambda$16/180944566.run in VM 2 running on Host asf900.gq1.ygridcore.net with 4 VMs
at com.gemstone.gemfire.test.dunit.VM.invoke(VM.java:389)
at com.gemstone.gemfire.test.dunit.VM.invoke(VM.java:355)
at com.gemstone.gemfire.test.dunit.VM.invoke(VM.java:293)
at com.gemstone.gemfire.security.ClientAuthenticationTestCase.createClient1NoException(ClientAuthenticationTestCase.java:540)
at com.gemstone.gemfire.security.ClientAuthenticationTestCase.doTestCredentialsForNotifications(ClientAuthenticationTestCase.java:427)
at com.gemstone.gemfire.security.ClientAuthenticationDUnitTest.testCredentialsForNotifications(ClientAuthenticationDUnitTest.java:82)
Caused by:
java.lang.OutOfMemoryError: unable to create new native thread
java.lang.AssertionError: Suspicious strings were written to the log during this run.
Fix the strings or use IgnoredException.addIgnoredException to ignore.
-----------------------------------------------------------------------
Found suspect string in log4j at line 1157
[error 2016/07/27 02:00:23.987 UTC <RMI TCP Connection(1)-67.195.81.144> tid=0x1b] java.lang.OutOfMemoryError: unable to create new native thread
com.gemstone.gemfire.distributed.internal.deadlock.GemFireDeadlockDetectorDUnitTest > classMethod FAILED
java.lang.RuntimeException: Unable to launch dunit VMS
Caused by:
java.lang.RuntimeException: VMs did not start up with 30 seconds
189 tests completed, 2 failed, 6 skipped
:geode-core:flakyTest FAILED
:geode-core:integrationTest
:geode-cq:assemble
:geode-cq:compileTestJavaNote: Some input files use or override a deprecated API.
Note: Recompile with -Xlint:deprecation for details.
Note: Some input files use unchecked or unsafe operations.
Note: Recompile with -Xlint:unchecked for details.
:geode-cq:processTestResources
:geode-cq:testClasses
:geode-cq:checkMissedTests
:geode-cq:test
:geode-cq:check
:geode-cq:build
:geode-cq:distributedTest
:geode-cq:flakyTest
:geode-cq:integrationTest
:geode-json:assemble
:geode-json:compileTestJava UP-TO-DATE
:geode-json:processTestResources UP-TO-DATE
:geode-json:testClasses UP-TO-DATE
:geode-json:checkMissedTests UP-TO-DATE
:geode-json:test UP-TO-DATE
:geode-json:check
:geode-json:build
:geode-json:distributedTest UP-TO-DATE
:geode-json:flakyTest UP-TO-DATE
:geode-json:integrationTest UP-TO-DATE
:geode-junit:javadoc
:geode-junit:javadocJar
:geode-junit:sourcesJar
:geode-junit:signArchives SKIPPED
:geode-junit:assemble
:geode-junit:compileTestJava
:geode-junit:processTestResources UP-TO-DATE
:geode-junit:testClasses
:geode-junit:checkMissedTests
:geode-junit:test
:geode-junit:check
:geode-junit:build
:geode-junit:distributedTest
:geode-junit:flakyTest
:geode-junit:integrationTest
:geode-lucene:assemble
:geode-lucene:compileTestJava
Download https://repo1.maven.org/maven2/org/apache/lucene/lucene-test-framework/6.0.0/lucene-test-framework-6.0.0.pom
Download https://repo1.maven.org/maven2/org/apache/lucene/lucene-codecs/6.0.0/lucene-codecs-6.0.0.pom
Download https://repo1.maven.org/maven2/com/carrotsearch/randomizedtesting/randomizedtesting-runner/2.3.2/randomizedtesting-runner-2.3.2.pom
Download https://repo1.maven.org/maven2/com/carrotsearch/randomizedtesting/randomizedtesting-parent/2.3.2/randomizedtesting-parent-2.3.2.pom
Download https://repo1.maven.org/maven2/org/apache/lucene/lucene-test-framework/6.0.0/lucene-test-framework-6.0.0.jar
Download https://repo1.maven.org/maven2/org/apache/lucene/lucene-codecs/6.0.0/lucene-codecs-6.0.0.jar
Download https://repo1.maven.org/maven2/com/carrotsearch/randomizedtesting/randomizedtesting-runner/2.3.2/randomizedtesting-runner-2.3.2.jar
Note: Some input files use or override a deprecated API.
Note: Recompile with -Xlint:deprecation for details.
Note: Some input files use unchecked or unsafe operations.
Note: Recompile with -Xlint:unchecked for details.
:geode-lucene:processTestResources
:geode-lucene:testClasses
:geode-lucene:checkMissedTests
:geode-lucene:test
:geode-lucene:check
:geode-lucene:build
:geode-lucene:distributedTest
:geode-lucene:flakyTest
:geode-lucene:integrationTest
:geode-pulse:assemble
:geode-pulse:compileTestJava
Download https://repo1.maven.org/maven2/org/seleniumhq/selenium/selenium-firefox-driver/2.53.1/selenium-firefox-driver-2.53.1.pom
Download https://repo1.maven.org/maven2/org/seleniumhq/selenium/selenium-parent/2.53.1/selenium-parent-2.53.1.pom
Download https://repo1.maven.org/maven2/org/seleniumhq/selenium/selenium-api/2.53.1/selenium-api-2.53.1.pom
Download https://repo1.maven.org/maven2/org/seleniumhq/selenium/selenium-remote-driver/2.53.1/selenium-remote-driver-2.53.1.pom
Download https://repo1.maven.org/maven2/org/seleniumhq/selenium/selenium-support/2.53.1/selenium-support-2.53.1.pom
Download https://repo1.maven.org/maven2/org/springframework/spring-test/4.2.4.RELEASE/spring-test-4.2.4.RELEASE.pom
Download https://repo1.maven.org/maven2/com/google/code/gson/gson/2.3.1/gson-2.3.1.pom
Download https://repo1.maven.org/maven2/org/seleniumhq/selenium/selenium-firefox-driver/2.53.1/selenium-firefox-driver-2.53.1.jar
Download https://repo1.maven.org/maven2/org/seleniumhq/selenium/selenium-api/2.53.1/selenium-api-2.53.1.jar
Download https://repo1.maven.org/maven2/org/seleniumhq/selenium/selenium-remote-driver/2.53.1/selenium-remote-driver-2.53.1.jar
Download https://repo1.maven.org/maven2/org/seleniumhq/selenium/selenium-support/2.53.1/selenium-support-2.53.1.jar
Download https://repo1.maven.org/maven2/org/springframework/spring-test/4.2.4.RELEASE/spring-test-4.2.4.RELEASE.jar
Download https://repo1.maven.org/maven2/com/google/code/gson/gson/2.3.1/gson-2.3.1.jar
Note: <https://builds.apache.org/job/Geode-release/ws/geode-pulse/src/test/java/com/vmware/gemfire/tools/pulse/tests/PulseAbstractTest.java> uses or overrides a deprecated API.
Note: Recompile with -Xlint:deprecation for details.
Note: Some input files use unchecked or unsafe operations.
Note: Recompile with -Xlint:unchecked for details.
:geode-pulse:processTestResources
:geode-pulse:testClasses
:geode-pulse:checkMissedTests
Download https://repo1.maven.org/maven2/com/jayway/jsonpath/json-path/1.2.0/json-path-1.2.0.pom
Download https://repo1.maven.org/maven2/net/minidev/json-smart/2.1.0/json-smart-2.1.0.pom
Download https://repo1.maven.org/maven2/net/minidev/parent/2.1.0/parent-2.1.0.pom
Download https://repo1.maven.org/maven2/net/minidev/asm/1.0.2/asm-1.0.2.pom
Download https://repo1.maven.org/maven2/com/jayway/jsonpath/json-path/1.2.0/json-path-1.2.0.jar
Download https://repo1.maven.org/maven2/net/minidev/json-smart/2.1.0/json-smart-2.1.0.jar
Download https://repo1.maven.org/maven2/net/minidev/asm/1.0.2/asm-1.0.2.jar
:geode-pulse:test
:geode-pulse:check
:geode-pulse:build
:geode-pulse:distributedTest
:geode-pulse:flakyTest
:geode-pulse:integrationTest
:geode-rebalancer:jar
:geode-rebalancer:javadoc
:geode-rebalancer:javadocJar
:geode-rebalancer:sourcesJar
:geode-rebalancer:signArchives SKIPPED
:geode-rebalancer:assemble
:geode-rebalancer:compileTestJava
:geode-rebalancer:processTestResources UP-TO-DATE
:geode-rebalancer:testClasses
:geode-rebalancer:checkMissedTests
:geode-rebalancer:test
:geode-rebalancer:check
:geode-rebalancer:build
:geode-rebalancer:distributedTest
:geode-rebalancer:flakyTest
:geode-rebalancer:integrationTest
:geode-wan:assemble
:geode-wan:compileTestJavaNote: Some input files use or override a deprecated API.
Note: Recompile with -Xlint:deprecation for details.
Note: Some input files use unchecked or unsafe operations.
Note: Recompile with -Xlint:unchecked for details.
:geode-wan:processTestResources
:geode-wan:testClasses
:geode-wan:checkMissedTests
:geode-wan:test
:geode-wan:check
:geode-wan:build
:geode-wan:distributedTest
:geode-wan:flakyTest
:geode-wan:integrationTest
:geode-web:assemble
:geode-web:compileTestJavaNote: <https://builds.apache.org/job/Geode-release/ws/geode-web/src/test/java/com/gemstone/gemfire/management/internal/cli/commands/DataCommandsOverHttpDistributedTest.java> uses or overrides a deprecated API.
Note: Recompile with -Xlint:deprecation for details.
Note: Some input files use unchecked or unsafe operations.
Note: Recompile with -Xlint:unchecked for details.
:geode-web:processTestResources UP-TO-DATE
:geode-web:testClasses
:geode-web:checkMissedTests
:geode-web:test
:geode-web:check
:geode-web:build
:geode-web:distributedTest
:geode-web:flakyTest
:geode-web:integrationTest
:geode-web-api:assemble
:geode-web-api:compileTestJava UP-TO-DATE
:geode-web-api:processTestResources UP-TO-DATE
:geode-web-api:testClasses UP-TO-DATE
:geode-web-api:checkMissedTests UP-TO-DATE
:geode-web-api:test UP-TO-DATE
:geode-web-api:check
:geode-web-api:build
:geode-web-api:distributedTest UP-TO-DATE
:geode-web-api:flakyTest UP-TO-DATE
:geode-web-api:integrationTest UP-TO-DATE
:combineReports
All test reports at <https://builds.apache.org/job/Geode-release/ws/build/reports/combined>
:extensions/geode-modules:precheckin
:extensions/geode-modules-assembly:precheckin
:extensions/geode-modules-hibernate:precheckin
:extensions/geode-modules-session:precheckin
:extensions/geode-modules-session-internal:precheckin
:extensions/geode-modules-tomcat7:precheckin
:geode-common:precheckin
:geode-cq:precheckin
:geode-json:precheckin
:geode-junit:precheckin
:geode-lucene:precheckin
:geode-pulse:precheckin
:geode-rebalancer:precheckin
:geode-wan:precheckin
:geode-web:precheckin
:geode-web-api:precheckin
FAILURE: Build completed with 3 failures.
1: Task failed with an exception.
-----------
* What went wrong:
Execution failed for task ':geode-assembly:flakyTest'.
> There were failing tests. See the report at: file://<https://builds.apache.org/job/Geode-release/ws/geode-assembly/build/reports/flakyTest/index.html>
* Try:
Run with --stacktrace option to get the stack trace. Run with --info or --debug option to get more log output.
==============================================================================
2: Task failed with an exception.
-----------
* What went wrong:
Execution failed for task ':geode-core:distributedTest'.
> There were failing tests. See the report at: file://<https://builds.apache.org/job/Geode-release/ws/geode-core/build/reports/distributedTest/index.html>
* Try:
Run with --stacktrace option to get the stack trace. Run with --info or --debug option to get more log output.
==============================================================================
3: Task failed with an exception.
-----------
* What went wrong:
Execution failed for task ':geode-core:flakyTest'.
> There were failing tests. See the report at: file://<https://builds.apache.org/job/Geode-release/ws/geode-core/build/reports/flakyTest/index.html>
* Try:
Run with --stacktrace option to get the stack trace. Run with --info or --debug option to get more log output.
==============================================================================
BUILD FAILED
Total time: 11 hrs 26 mins 30.535 secs
Build step 'Invoke Gradle script' changed build result to FAILURE
Build step 'Invoke Gradle script' marked build as failure
Archiving artifacts
Compressed 250.79 MB of artifacts by 12.1% relative to #7
Recording test results
Build failed in Jenkins: Geode-release #16
Posted by Apache Jenkins Server <je...@builds.apache.org>.
See <https://builds.apache.org/job/Geode-release/16/changes>
Changes:
[boglesby] GEODE-1641: The Gateway Conflict Resolver is supported again in
[wmarkito] M3 release branch done. Bumping the release version to 1.0.0
[huynhja] GEODE-1614: CI failure:
[eshu] GOEDE-1621: Do not throw IllegalArgumentException in TXState cleanup()
[jiliao] GEODE-1571: security code tidy up.
[huynhja] GEODE-1588: AckReader and Dispatching thread are shut down before
[klund] GEODE-1452: annotate disabled tests with @Ignore and rename
[gzhou] GEODE-11: GFSH commands for Lucene
[jiliao] GEODE-1571: documentation and code cleanup
[sbawaskar] fixing the version from 1.0.0-incubating.1.0.0-SNAPSHOT to
[eshu] GEODE-1649: Fixes IllegalStateException in mock junit test.
[jiliao] GEODE-1571: fix nightly failure
[klund] GEODE-1598: fix auto-completion problems by telling jopt that all
[bschuchardt] GEODE-1642 Add conveniance method isCancelInProgress to CancelCriterion
[klund] GEODE-1646: repackage new Security classes in org.apache.geode.security
[jiliao] GEODE-1571: use constructor instead of static method to create
[jiliao] GEODE-1571: fix compiling error after the merge
[nnag] GEODE-1587: Replaced AtomicInteger with AtomicIntegerFieldUpdater
[nnag] GEODE-1639: Receivers selects a different port if the selected port is
[upthewaterspout] GEODE-11 Adding tests of closing a cache during index updates
[jiliao] GEODE-1571: fix permission needed for remove data command
[klund] GEODE-1656: fix compilation warnings with @SuppressWarnings annotations
[klund] GEODE-1654: Fix Javadoc warnings
[klund] GEODE-1660: fix compilation warnings
[nnag] GEODE-1600: startLocatorAndDS takes 0 as port number parameter
[gzhou] This closes #205
[huynhja] GEODE-1644: ClassCastException is thrown with in queries against a map
[gzhou] GEODE-11:Dunit test to verify stats in list lucene gfsh command
[klund] GEODE-1667: update CacheTestCase to JUnit 4 by default
[jiliao] GEODE-1571: have auth-init accept either a constructor or a static
[jiliao] GEODE-1571: simplify security check
[dschneider] GEODE-1590: add defragmentationsInProgress stat
[jiliao] GEODE-1571: revert previous two changes
[nnag] GEODE-1612: Gets a list of random ports at once
[jiliao] GEODE-1571: more revert.
[jiliao] GEODE-746: When starting a locator using --bind-address, gfsh prints
[gzhou] GEODE-11: GFSH command fixes
[jiliao] GEODE-1571: Allow AuthInit to take either a constructor or a static
[bschuchardt] Removing unreferenced ParentLocalizedStrings. All remaining
[bschuchardt] Performance enhancements ported from GemFire 8.2.0.x
[gzhou] GEODE-11:Gfsh command for lucene query
[bschuchardt] GEODE-1655: CI Failure in
[jiliao] GEODE-1647: Add Integrated Security to Peer Authentication
[jiliao] GEODE-1647: add more unit test
[jiliao] GEODE-1680: Change "list regions" to DATA:READ permissions
[bschuchardt] GEODE-1685 Upgrade to JGroups 3.6.10.Final
[dschneider] GEODE-1420: fix 100ms delay in stopping tombstone sweeper
[boglesby] GEODE-1677: Events are now added to tmpQueuedEvents while shadow pr is
[agingade] GEODE-1669: Made changes to add/remove list of interested keys using
[jiliao] GEODE-17: update selenium-firefox driver to run uiTest
[jiliao] GEODE-17: fix javadoc warnings
[bschuchardt] javadoc clean-up for commmunications/membership classes
[jiliao] GEODE-1617: Regions can be created with a variety of characters that
[klund] GEODE-1673: fail start if security.json cannot be found
[bschuchardt] Marking test as flaky - see GEODE-1594
[huynhja] GEODE-1617: CreateRegionFunction was not attaching a cache listener
------------------------------------------
[...truncated 652 lines...]
at java.util.concurrent.Executors$RunnableAdapter.call(Executors.java:511)
at java.util.concurrent.FutureTask.run(FutureTask.java:266)
at java.util.concurrent.ThreadPoolExecutor.runWorker(ThreadPoolExecutor.java:1142)
at java.util.concurrent.ThreadPoolExecutor$Worker.run(ThreadPoolExecutor.java:617)
at com.gemstone.gemfire.distributed.internal.DistributionManager.runUntilShutdown(DistributionManager.java:611)
at com.gemstone.gemfire.distributed.internal.DistributionManager$4$1.run(DistributionManager.java:885)
at java.lang.Thread.run(Thread.java:745)
Caused by: com.gemstone.gemfire.cache.DiskAccessException: For DiskStore: cluster_config: Could not lock "/x1/jenkins/jenkins-slave/workspace/Geode-release/geode-core/build/distributedTest/dunit/vm1/ConfigDiskDir_/DRLK_IFcluster_config.lk". Other JVMs might have created diskstore with same name using the same directory., caused by java.nio.channels.OverlappingFileLockException
at com.gemstone.gemfire.internal.cache.DiskStoreImpl.createLockFile(DiskStoreImpl.java:1832)
at com.gemstone.gemfire.internal.cache.DiskStoreImpl.loadFiles(DiskStoreImpl.java:1921)
at com.gemstone.gemfire.internal.cache.DiskStoreImpl.<init>(DiskStoreImpl.java:438)
at com.gemstone.gemfire.internal.cache.DiskStoreImpl.<init>(DiskStoreImpl.java:351)
at com.gemstone.gemfire.internal.cache.DiskStoreImpl.<init>(DiskStoreImpl.java:346)
at com.gemstone.gemfire.internal.cache.DiskStoreFactoryImpl.create(DiskStoreFactoryImpl.java:139)
at com.gemstone.gemfire.distributed.internal.SharedConfiguration.getConfigurationRegion(SharedConfiguration.java:708)
... 9 more
Caused by: java.nio.channels.OverlappingFileLockException
at sun.nio.ch.SharedFileLockTable.checkList(FileLockTable.java:255)
at sun.nio.ch.SharedFileLockTable.add(FileLockTable.java:152)
at sun.nio.ch.FileChannelImpl.tryLock(FileChannelImpl.java:1108)
at java.nio.channels.FileChannel.tryLock(FileChannel.java:1155)
at com.gemstone.gemfire.internal.cache.DiskStoreImpl.createLockFile(DiskStoreImpl.java:1800)
... 15 more
com.gemstone.gemfire.management.LocatorManagementDUnitTest > testWillingManagersWithPortZero FAILED
java.lang.AssertionError: Suspicious strings were written to the log during this run.
Fix the strings or use IgnoredException.addIgnoredException to ignore.
-----------------------------------------------------------------------
Found suspect string in log4j at line 896
[error 2016/07/26 08:26:44.322 UTC <Pooled Message Processor 1> tid=0x4e9] Error occurred while initializing cluster configuration
java.lang.Exception: Error occurred while initializing cluster configuration
at com.gemstone.gemfire.distributed.internal.SharedConfiguration.getConfigurationRegion(SharedConfiguration.java:732)
at com.gemstone.gemfire.distributed.internal.SharedConfiguration.initSharedConfiguration(SharedConfiguration.java:234)
at com.gemstone.gemfire.distributed.internal.InternalLocator$SharedConfigurationRunnable.run(InternalLocator.java:687)
at java.util.concurrent.Executors$RunnableAdapter.call(Executors.java:511)
at java.util.concurrent.FutureTask.run(FutureTask.java:266)
at java.util.concurrent.ThreadPoolExecutor.runWorker(ThreadPoolExecutor.java:1142)
at java.util.concurrent.ThreadPoolExecutor$Worker.run(ThreadPoolExecutor.java:617)
at com.gemstone.gemfire.distributed.internal.DistributionManager.runUntilShutdown(DistributionManager.java:611)
at com.gemstone.gemfire.distributed.internal.DistributionManager$4$1.run(DistributionManager.java:885)
at java.lang.Thread.run(Thread.java:745)
Caused by: com.gemstone.gemfire.cache.DiskAccessException: For DiskStore: cluster_config: Could not lock "/x1/jenkins/jenkins-slave/workspace/Geode-release/geode-core/build/distributedTest/dunit/vm1/ConfigDiskDir_/DRLK_IFcluster_config.lk". Other JVMs might have created diskstore with same name using the same directory., caused by java.nio.channels.OverlappingFileLockException
at com.gemstone.gemfire.internal.cache.DiskStoreImpl.createLockFile(DiskStoreImpl.java:1832)
at com.gemstone.gemfire.internal.cache.DiskStoreImpl.loadFiles(DiskStoreImpl.java:1921)
at com.gemstone.gemfire.internal.cache.DiskStoreImpl.<init>(DiskStoreImpl.java:438)
at com.gemstone.gemfire.internal.cache.DiskStoreImpl.<init>(DiskStoreImpl.java:351)
at com.gemstone.gemfire.internal.cache.DiskStoreImpl.<init>(DiskStoreImpl.java:346)
at com.gemstone.gemfire.internal.cache.DiskStoreFactoryImpl.create(DiskStoreFactoryImpl.java:139)
at com.gemstone.gemfire.distributed.internal.SharedConfiguration.getConfigurationRegion(SharedConfiguration.java:708)
... 9 more
Caused by: java.nio.channels.OverlappingFileLockException
at sun.nio.ch.SharedFileLockTable.checkList(FileLockTable.java:255)
at sun.nio.ch.SharedFileLockTable.add(FileLockTable.java:152)
at sun.nio.ch.FileChannelImpl.tryLock(FileChannelImpl.java:1108)
at java.nio.channels.FileChannel.tryLock(FileChannel.java:1155)
at com.gemstone.gemfire.internal.cache.DiskStoreImpl.createLockFile(DiskStoreImpl.java:1800)
... 15 more
7433 tests completed, 2 failed, 587 skipped
:geode-core:distributedTest FAILED
:geode-core:flakyTest
:geode-core:integrationTest
:geode-cq:assemble
:geode-cq:compileTestJavaNote: Some input files use or override a deprecated API.
Note: Recompile with -Xlint:deprecation for details.
Note: Some input files use unchecked or unsafe operations.
Note: Recompile with -Xlint:unchecked for details.
:geode-cq:processTestResources
:geode-cq:testClasses
:geode-cq:checkMissedTests
:geode-cq:test
:geode-cq:check
:geode-cq:build
:geode-cq:distributedTest
:geode-cq:flakyTest
:geode-cq:integrationTest
:geode-json:assemble
:geode-json:compileTestJava UP-TO-DATE
:geode-json:processTestResources UP-TO-DATE
:geode-json:testClasses UP-TO-DATE
:geode-json:checkMissedTests UP-TO-DATE
:geode-json:test UP-TO-DATE
:geode-json:check
:geode-json:build
:geode-json:distributedTest UP-TO-DATE
:geode-json:flakyTest UP-TO-DATE
:geode-json:integrationTest UP-TO-DATE
:geode-junit:javadoc
:geode-junit:javadocJar
:geode-junit:sourcesJar
:geode-junit:signArchives SKIPPED
:geode-junit:assemble
:geode-junit:compileTestJava
:geode-junit:processTestResources UP-TO-DATE
:geode-junit:testClasses
:geode-junit:checkMissedTests
:geode-junit:test
:geode-junit:check
:geode-junit:build
:geode-junit:distributedTest
:geode-junit:flakyTest
:geode-junit:integrationTest
:geode-lucene:assemble
:geode-lucene:compileTestJavaNote: Some input files use or override a deprecated API.
Note: Recompile with -Xlint:deprecation for details.
Note: Some input files use unchecked or unsafe operations.
Note: Recompile with -Xlint:unchecked for details.
:geode-lucene:processTestResources
:geode-lucene:testClasses
:geode-lucene:checkMissedTests
:geode-lucene:test
:geode-lucene:check
:geode-lucene:build
:geode-lucene:distributedTest
:geode-lucene:flakyTest
:geode-lucene:integrationTest
:geode-pulse:assemble
:geode-pulse:compileTestJava
Download https://repo1.maven.org/maven2/org/seleniumhq/selenium/selenium-firefox-driver/2.53.1/selenium-firefox-driver-2.53.1.pom
Download https://repo1.maven.org/maven2/org/seleniumhq/selenium/selenium-parent/2.53.1/selenium-parent-2.53.1.pom
Download https://repo1.maven.org/maven2/org/seleniumhq/selenium/selenium-api/2.53.1/selenium-api-2.53.1.pom
Download https://repo1.maven.org/maven2/org/seleniumhq/selenium/selenium-remote-driver/2.53.1/selenium-remote-driver-2.53.1.pom
Download https://repo1.maven.org/maven2/org/seleniumhq/selenium/selenium-support/2.53.1/selenium-support-2.53.1.pom
Download https://repo1.maven.org/maven2/org/seleniumhq/selenium/selenium-firefox-driver/2.53.1/selenium-firefox-driver-2.53.1.jar
Download https://repo1.maven.org/maven2/org/seleniumhq/selenium/selenium-api/2.53.1/selenium-api-2.53.1.jar
Download https://repo1.maven.org/maven2/org/seleniumhq/selenium/selenium-remote-driver/2.53.1/selenium-remote-driver-2.53.1.jar
Download https://repo1.maven.org/maven2/org/seleniumhq/selenium/selenium-support/2.53.1/selenium-support-2.53.1.jar
Note: /x1/jenkins/jenkins-slave/workspace/Geode-release/geode-pulse/src/test/java/com/vmware/gemfire/tools/pulse/tests/PulseAbstractTest.java uses or overrides a deprecated API.
Note: Recompile with -Xlint:deprecation for details.
Note: Some input files use unchecked or unsafe operations.
Note: Recompile with -Xlint:unchecked for details.
:geode-pulse:processTestResources
:geode-pulse:testClasses
:geode-pulse:checkMissedTests
:geode-pulse:test
:geode-pulse:check
:geode-pulse:build
:geode-pulse:distributedTest
:geode-pulse:flakyTest
:geode-pulse:integrationTest
:geode-rebalancer:jar
:geode-rebalancer:javadoc
:geode-rebalancer:javadocJar
:geode-rebalancer:sourcesJar
:geode-rebalancer:signArchives SKIPPED
:geode-rebalancer:assemble
:geode-rebalancer:compileTestJava
:geode-rebalancer:processTestResources UP-TO-DATE
:geode-rebalancer:testClasses
:geode-rebalancer:checkMissedTests
:geode-rebalancer:test
:geode-rebalancer:check
:geode-rebalancer:build
:geode-rebalancer:distributedTest
:geode-rebalancer:flakyTest
:geode-rebalancer:integrationTest
:geode-wan:assemble
:geode-wan:compileTestJavaNote: Some input files use or override a deprecated API.
Note: Recompile with -Xlint:deprecation for details.
Note: Some input files use unchecked or unsafe operations.
Note: Recompile with -Xlint:unchecked for details.
:geode-wan:processTestResources
:geode-wan:testClasses
:geode-wan:checkMissedTests
:geode-wan:test
:geode-wan:check
:geode-wan:build
:geode-wan:distributedTest
:geode-wan:flakyTest
:geode-wan:integrationTest
:geode-web:assemble
:geode-web:compileTestJavaNote: /x1/jenkins/jenkins-slave/workspace/Geode-release/geode-web/src/test/java/com/gemstone/gemfire/management/internal/cli/commands/DataCommandsOverHttpDistributedTest.java uses or overrides a deprecated API.
Note: Recompile with -Xlint:deprecation for details.
Note: Some input files use unchecked or unsafe operations.
Note: Recompile with -Xlint:unchecked for details.
:geode-web:processTestResources UP-TO-DATE
:geode-web:testClasses
:geode-web:checkMissedTests
:geode-web:test
:geode-web:check
:geode-web:build
:geode-web:distributedTest
:geode-web:flakyTest
:geode-web:integrationTest
:geode-web-api:assemble
:geode-web-api:compileTestJava UP-TO-DATE
:geode-web-api:processTestResources UP-TO-DATE
:geode-web-api:testClasses UP-TO-DATE
:geode-web-api:checkMissedTests UP-TO-DATE
:geode-web-api:test UP-TO-DATE
:geode-web-api:check
:geode-web-api:build
:geode-web-api:distributedTest UP-TO-DATE
:geode-web-api:flakyTest UP-TO-DATE
:geode-web-api:integrationTest UP-TO-DATE
:combineReports
All test reports at /x1/jenkins/jenkins-slave/workspace/Geode-release/build/reports/combined
:extensions/geode-modules:precheckin
:extensions/geode-modules-assembly:precheckin
:extensions/geode-modules-hibernate:precheckin
:extensions/geode-modules-session:precheckin
:extensions/geode-modules-session-internal:precheckin
:extensions/geode-modules-tomcat7:precheckin
:geode-common:precheckin
:geode-cq:precheckin
:geode-json:precheckin
:geode-junit:precheckin
:geode-lucene:precheckin
:geode-pulse:precheckin
:geode-rebalancer:precheckin
:geode-wan:precheckin
:geode-web:precheckin
:geode-web-api:precheckin
FAILURE: Build completed with 2 failures.
1: Task failed with an exception.
-----------
* What went wrong:
Execution failed for task ':geode-assembly:flakyTest'.
> There were failing tests. See the report at: file:///x1/jenkins/jenkins-slave/workspace/Geode-release/geode-assembly/build/reports/flakyTest/index.html
* Try:
Run with --stacktrace option to get the stack trace. Run with --info or --debug option to get more log output.
==============================================================================
2: Task failed with an exception.
-----------
* What went wrong:
Execution failed for task ':geode-core:distributedTest'.
> There were failing tests. See the report at: file:///x1/jenkins/jenkins-slave/workspace/Geode-release/geode-core/build/reports/distributedTest/index.html
* Try:
Run with --stacktrace option to get the stack trace. Run with --info or --debug option to get more log output.
==============================================================================
BUILD FAILED
Total time: 11 hrs 46 mins 47.833 secs
Build step 'Invoke Gradle script' changed build result to FAILURE
Build step 'Invoke Gradle script' marked build as failure
Archiving artifacts
Compressed 250.94 MB of artifacts by 12.4% relative to #7
Recording test results
Build failed in Jenkins: Geode-release #15
Posted by Apache Jenkins Server <je...@builds.apache.org>.
See <https://builds.apache.org/job/Geode-release/15/>
------------------------------------------
[...truncated 579 lines...]
:geode-cq:sourcesJar
:geode-cq:signArchives SKIPPED
:geode-json:javadocJar
:geode-json:sourcesJar
:geode-json:signArchives SKIPPED
:geode-lucene:jar
:geode-lucene:javadoc
:geode-lucene:javadocJar
:geode-lucene:sourcesJar
:geode-lucene:signArchives SKIPPED
:geode-pulse:javadoc
:geode-pulse:javadocJar
:geode-pulse:sourcesJar
:geode-pulse:war
:geode-pulse:signArchives SKIPPED
:geode-wan:jar
:geode-wan:javadoc
:geode-wan:javadocJar
:geode-wan:sourcesJar
:geode-wan:signArchives SKIPPED
:geode-web:javadoc UP-TO-DATE
:geode-web:javadocJar
:geode-web:sourcesJar
:geode-web:war
:geode-web:signArchives SKIPPED
:geode-web-api:jar
:geode-web-api:javadoc
:geode-web-api:javadocJar
:geode-web-api:sourcesJar
:geode-web-api:war
:geode-web-api:signArchives SKIPPED
:geode-assembly:distTar
:geode-assembly:distZip
:geode-assembly:writeBuildInfo
:geode-assembly:srcDistTar
:geode-assembly:srcDistZip
:geode-assembly:signArchives SKIPPED
:geode-assembly:assemble
:geode-assembly:compileTestJavaNote: Some input files use or override a deprecated API.
Note: Recompile with -Xlint:deprecation for details.
Note: Some input files use unchecked or unsafe operations.
Note: Recompile with -Xlint:unchecked for details.
:geode-assembly:processTestResources
:geode-assembly:testClasses
:geode-assembly:checkMissedTests
:geode-assembly:installDist
:geode-assembly:test
:geode-assembly:check
:geode-assembly:build
:geode-assembly:distributedTest
com.gemstone.gemfire.management.internal.configuration.SharedConfigurationEndToEndDUnitTest > testStartServerAndExecuteCommands FAILED
java.lang.AssertionError: expected:<OK> but was:<ERROR>
at org.junit.Assert.fail(Assert.java:88)
at org.junit.Assert.failNotEquals(Assert.java:834)
at org.junit.Assert.assertEquals(Assert.java:118)
at org.junit.Assert.assertEquals(Assert.java:144)
at com.gemstone.gemfire.management.internal.configuration.SharedConfigurationEndToEndDUnitTest.startServers(SharedConfigurationEndToEndDUnitTest.java:147)
at com.gemstone.gemfire.management.internal.configuration.SharedConfigurationEndToEndDUnitTest.testStartServerAndExecuteCommands(SharedConfigurationEndToEndDUnitTest.java:122)
36 tests completed, 1 failed
:geode-assembly:distributedTest FAILED
:geode-assembly:flakyTest
:geode-assembly:integrationTest
:geode-common:assemble
:geode-common:compileTestJava
:geode-common:processTestResources UP-TO-DATE
:geode-common:testClasses
:geode-common:checkMissedTests
:geode-common:test
:geode-common:check
:geode-common:build
:geode-common:distributedTest
:geode-common:flakyTest
:geode-common:integrationTest
:geode-core:assemble
:geode-core:checkMissedTests
:geode-core:test
:geode-core:check
:geode-core:build
:geode-core:distributedTest
:geode-core:flakyTest
:geode-core:integrationTest
:geode-cq:assemble
:geode-cq:compileTestJavaNote: Some input files use or override a deprecated API.
Note: Recompile with -Xlint:deprecation for details.
Note: Some input files use unchecked or unsafe operations.
Note: Recompile with -Xlint:unchecked for details.
:geode-cq:processTestResources
:geode-cq:testClasses
:geode-cq:checkMissedTests
:geode-cq:test
:geode-cq:check
:geode-cq:build
:geode-cq:distributedTest
:geode-cq:flakyTest
:geode-cq:integrationTest
:geode-json:assemble
:geode-json:compileTestJava UP-TO-DATE
:geode-json:processTestResources UP-TO-DATE
:geode-json:testClasses UP-TO-DATE
:geode-json:checkMissedTests UP-TO-DATE
:geode-json:test UP-TO-DATE
:geode-json:check
:geode-json:build
:geode-json:distributedTest UP-TO-DATE
:geode-json:flakyTest UP-TO-DATE
:geode-json:integrationTest UP-TO-DATE
:geode-junit:javadoc
:geode-junit:javadocJar
:geode-junit:sourcesJar
:geode-junit:signArchives SKIPPED
:geode-junit:assemble
:geode-junit:compileTestJava
:geode-junit:processTestResources UP-TO-DATE
:geode-junit:testClasses
:geode-junit:checkMissedTests
:geode-junit:test
:geode-junit:check
:geode-junit:build
:geode-junit:distributedTest
:geode-junit:flakyTest
:geode-junit:integrationTest
:geode-lucene:assemble
:geode-lucene:compileTestJavaNote: Some input files use or override a deprecated API.
Note: Recompile with -Xlint:deprecation for details.
Note: Some input files use unchecked or unsafe operations.
Note: Recompile with -Xlint:unchecked for details.
:geode-lucene:processTestResources
:geode-lucene:testClasses
:geode-lucene:checkMissedTests
:geode-lucene:test
:geode-lucene:check
:geode-lucene:build
:geode-lucene:distributedTest
:geode-lucene:flakyTest
:geode-lucene:integrationTest
:geode-pulse:assemble
:geode-pulse:compileTestJavaNote: /x1/jenkins/jenkins-slave/workspace/Geode-release/geode-pulse/src/test/java/com/vmware/gemfire/tools/pulse/tests/PulseAbstractTest.java uses or overrides a deprecated API.
Note: Recompile with -Xlint:deprecation for details.
Note: Some input files use unchecked or unsafe operations.
Note: Recompile with -Xlint:unchecked for details.
:geode-pulse:processTestResources
:geode-pulse:testClasses
:geode-pulse:checkMissedTests
:geode-pulse:test
:geode-pulse:check
:geode-pulse:build
:geode-pulse:distributedTest
:geode-pulse:flakyTest
:geode-pulse:integrationTest
:geode-rebalancer:jar
:geode-rebalancer:javadoc
:geode-rebalancer:javadocJar
:geode-rebalancer:sourcesJar
:geode-rebalancer:signArchives SKIPPED
:geode-rebalancer:assemble
:geode-rebalancer:compileTestJava
:geode-rebalancer:processTestResources UP-TO-DATE
:geode-rebalancer:testClasses
:geode-rebalancer:checkMissedTests
:geode-rebalancer:test
:geode-rebalancer:check
:geode-rebalancer:build
:geode-rebalancer:distributedTest
:geode-rebalancer:flakyTest
:geode-rebalancer:integrationTest
:geode-wan:assemble
:geode-wan:compileTestJavaNote: Some input files use or override a deprecated API.
Note: Recompile with -Xlint:deprecation for details.
Note: Some input files use unchecked or unsafe operations.
Note: Recompile with -Xlint:unchecked for details.
:geode-wan:processTestResources
:geode-wan:testClasses
:geode-wan:checkMissedTests
:geode-wan:test
:geode-wan:check
:geode-wan:build
:geode-wan:distributedTest
:geode-wan:flakyTest
:geode-wan:integrationTest
:geode-web:assemble
:geode-web:compileTestJavaNote: /x1/jenkins/jenkins-slave/workspace/Geode-release/geode-web/src/test/java/com/gemstone/gemfire/management/internal/cli/commands/DataCommandsOverHttpDistributedTest.java uses or overrides a deprecated API.
Note: Recompile with -Xlint:deprecation for details.
Note: Some input files use unchecked or unsafe operations.
Note: Recompile with -Xlint:unchecked for details.
:geode-web:processTestResources UP-TO-DATE
:geode-web:testClasses
:geode-web:checkMissedTests
:geode-web:test
:geode-web:check
:geode-web:build
:geode-web:distributedTest
:geode-web:flakyTest
:geode-web:integrationTest
:geode-web-api:assemble
:geode-web-api:compileTestJava UP-TO-DATE
:geode-web-api:processTestResources UP-TO-DATE
:geode-web-api:testClasses UP-TO-DATE
:geode-web-api:checkMissedTests UP-TO-DATE
:geode-web-api:test UP-TO-DATE
:geode-web-api:check
:geode-web-api:build
:geode-web-api:distributedTest UP-TO-DATE
:geode-web-api:flakyTest UP-TO-DATE
:geode-web-api:integrationTest UP-TO-DATE
:combineReports
All test reports at /x1/jenkins/jenkins-slave/workspace/Geode-release/build/reports/combined
:extensions/geode-modules:precheckin
:extensions/geode-modules-assembly:precheckin
:extensions/geode-modules-hibernate:precheckin
:extensions/geode-modules-session:precheckin
:extensions/geode-modules-session-internal:precheckin
:extensions/geode-modules-tomcat7:precheckin
:geode-common:precheckin
:geode-core:precheckin
:geode-cq:precheckin
:geode-json:precheckin
:geode-junit:precheckin
:geode-lucene:precheckin
:geode-pulse:precheckin
:geode-rebalancer:precheckin
:geode-wan:precheckin
:geode-web:precheckin
:geode-web-api:precheckin
FAILURE: Build failed with an exception.
* What went wrong:
Execution failed for task ':geode-assembly:distributedTest'.
> There were failing tests. See the report at: file:///x1/jenkins/jenkins-slave/workspace/Geode-release/geode-assembly/build/reports/distributedTest/index.html
* Try:
Run with --stacktrace option to get the stack trace. Run with --info or --debug option to get more log output.
BUILD FAILED
Total time: 11 hrs 49 mins 48.651 secs
Build step 'Invoke Gradle script' changed build result to FAILURE
Build step 'Invoke Gradle script' marked build as failure
Archiving artifacts
Compressed 250.99 MB of artifacts by 20.3% relative to #7
Recording test results
Re: Build failed in Jenkins: Geode-release #14
Posted by Kirk Lund <kl...@pivotal.io>.
There is a 3rd option for #1:
c) apply our custom JUnit 4 RetryRule to any test that uses random ports so
that the test would be reattempted if it fails due to a BindException
We could modify RetryRule to only reattempt a failed test if the output
from any of the DUnit VMs contained some specified string such as
"BindException" -- this would avoid reattempts for real failures.
-Kirk
On Tue, Jul 19, 2016 at 6:13 PM, Kirk Lund <kl...@pivotal.io> wrote:
> 1) GemfireDataCommandsDUnitTest failed because a TCP port that was
> determined to be available was no longer available when the code finally
> attempted to use it, resulting in a "java.net.BindException: Address
> already in use"
>
> Every test that uses getRandomAvailableTCPPorts is prone to hit this
> occasionally. We would have to either:
> a) categorize all such tests as Flaky or
> b) change the Geode APIs (gemfire.properties) to use "0" to mean that the
> product will let the system pick up an ephemeral port during bind instead
> of interpreting it as disabling the service that "0" is being specified for
> (this would break backwards compatibility for any User using "0" to disable
> anything)
>
> final int[] ports =
> AvailablePortHelper.getRandomAvailableTCPPorts(2);
>
> jmxPort = ports[0];
> httpPort = ports[1];
>
> localProps.setProperty(JMX_MANAGER, "true");
> localProps.setProperty(JMX_MANAGER_START, "true");
> localProps.setProperty(JMX_MANAGER_BIND_ADDRESS,
> String.valueOf(jmxHost));
> localProps.setProperty(JMX_MANAGER_PORT, String.valueOf(jmxPort));
> localProps.setProperty(HTTP_SERVICE_PORT, String.valueOf(httpPort));
>
> getSystem(localProps);
> verifyManagementServiceStarted(getCache());
>
> 2) ConsoleDistributionManagerDUnitTest failed because the
> InternalDistributedSystem connection shut down for an unknown reason during
> the test (just as Bruce already mentioned)
>
> ConsoleDistributionManagerDUnitTest is testing the old deprecated Admin
> API. We could create a new category such as "DeprecatedTest" to temporarily
> exclude such tests from the standard test targets. Ultimately this test and
> the Admin API should be removed which requires some investment of time.
> Unfortunately, the team currently working on GEODE-17 Integrated Security
> doesn't have any time (yet) to dedicate to removal the Admin API and its
> tests.
>
> I don't think release/1.0.0-incubating.M3 is any less stable than develop.
> I believe these tests could potentially hit the same failures on develop,
> though I really don't know what's happening in
> ConsoleDistributionManagerDUnitTest.
>
> Is the system that's running the build for release/1.0.0-incubating.M3
> different in any way from the infrastructure running the nightly build for
> Geode?
>
> -Kirk
>
>
> On Tue, Jul 19, 2016 at 10:49 AM, Bruce Schuchardt <bschuchardt@pivotal.io
> > wrote:
>
>> The ConsoleDistributionManagerDUnitTest failure isn't a PDX problem. The
>> admin distributed system is being shut down for some reason before the test
>> attempts to send an admin request message. Build-artifacts don't have any
>> useful information on why that is happening.
>>
>> Unfortunately the test passes repeatedly when run on its own.
>>
>>
>>
>> Le 7/17/2016 à 8:56 PM, Apache Jenkins Server a écrit :
>>
>>> See <https://builds.apache.org/job/Geode-release/14/>
>>>
>>> ------------------------------------------
>>> [...truncated 697 lines...]
>>> java.lang.AssertionError: Suspicious strings were written to the
>>> log during this run.
>>> Fix the strings or use IgnoredException.addIgnoredException to
>>> ignore.
>>>
>>> -----------------------------------------------------------------------
>>> Found suspect string in log4j at line 257
>>>
>>> [error 2016/07/17 21:46:41.931 UTC <RMI TCP
>>> Connection(1)-67.195.81.144> tid=0x1b] Jmx manager could not be started
>>> because java.rmi.server.ExportException: Port already in use: 24744; nested
>>> exception is:
>>> java.net.BindException: Failed to create server socket on
>>> asf900.gq1.ygridcore.net/67.195.81.144[24,744]
>>> <http://asf900.gq1.ygridcore.net/67.195.81.144%5B24,744%5D>
>>> com.gemstone.gemfire.management.ManagementException:
>>> java.rmi.server.ExportException: Port already in use: 24744; nested
>>> exception is:
>>> java.net.BindException: Failed to create server socket on
>>> asf900.gq1.ygridcore.net/67.195.81.144[24,744]
>>> <http://asf900.gq1.ygridcore.net/67.195.81.144%5B24,744%5D>
>>> at
>>> com.gemstone.gemfire.management.internal.ManagementAgent.startAgent(ManagementAgent.java:147)
>>> at
>>> com.gemstone.gemfire.management.internal.SystemManagementService.startManager(SystemManagementService.java:479)
>>> at
>>> com.gemstone.gemfire.management.internal.beans.ManagementAdapter.handleCacheCreation(ManagementAdapter.java:197)
>>> at
>>> com.gemstone.gemfire.management.internal.beans.ManagementListener.handleEvent(ManagementListener.java:119)
>>> at
>>> com.gemstone.gemfire.distributed.internal.InternalDistributedSystem.notifyResourceEventListeners(InternalDistributedSystem.java:2085)
>>> at
>>> com.gemstone.gemfire.distributed.internal.InternalDistributedSystem.handleResourceEvent(InternalDistributedSystem.java:478)
>>> at
>>> com.gemstone.gemfire.internal.cache.GemFireCacheImpl.initialize(GemFireCacheImpl.java:1054)
>>> at
>>> com.gemstone.gemfire.internal.cache.GemFireCacheImpl.basicCreate(GemFireCacheImpl.java:707)
>>> at
>>> com.gemstone.gemfire.internal.cache.GemFireCacheImpl.create(GemFireCacheImpl.java:695)
>>> at
>>> com.gemstone.gemfire.cache.CacheFactory.create(CacheFactory.java:181)
>>> at
>>> com.gemstone.gemfire.cache.CacheFactory.create(CacheFactory.java:172)
>>> at
>>> com.gemstone.gemfire.test.dunit.cache.internal.JUnit4CacheTestCase.createCache(JUnit4CacheTestCase.java:120)
>>> at
>>> com.gemstone.gemfire.test.dunit.cache.internal.JUnit4CacheTestCase.getCache(JUnit4CacheTestCase.java:263)
>>> at
>>> com.gemstone.gemfire.test.dunit.cache.internal.JUnit4CacheTestCase.getCache(JUnit4CacheTestCase.java:242)
>>> at
>>> com.gemstone.gemfire.test.dunit.cache.internal.JUnit4CacheTestCase.getCache(JUnit4CacheTestCase.java:234)
>>> at
>>> com.gemstone.gemfire.management.internal.cli.commands.CliCommandTestBase.lambda$setUpJMXManagerOnVM$d0384528$1(CliCommandTestBase.java:154)
>>> at
>>> com.gemstone.gemfire.test.dunit.NamedCallable.call(NamedCallable.java:33)
>>> at sun.reflect.GeneratedMethodAccessor338.invoke(Unknown Source)
>>> at
>>> sun.reflect.DelegatingMethodAccessorImpl.invoke(DelegatingMethodAccessorImpl.java:43)
>>> at java.lang.reflect.Method.invoke(Method.java:498)
>>> at hydra.MethExecutor.executeObject(MethExecutor.java:268)
>>> at
>>> com.gemstone.gemfire.test.dunit.standalone.RemoteDUnitVM.executeMethodOnObject(RemoteDUnitVM.java:82)
>>> at sun.reflect.GeneratedMethodAccessor3.invoke(Unknown Source)
>>> at
>>> sun.reflect.DelegatingMethodAccessorImpl.invoke(DelegatingMethodAccessorImpl.java:43)
>>> at java.lang.reflect.Method.invoke(Method.java:498)
>>> at
>>> sun.rmi.server.UnicastServerRef.dispatch(UnicastServerRef.java:323)
>>> at sun.rmi.transport.Transport$1.run(Transport.java:200)
>>> at sun.rmi.transport.Transport$1.run(Transport.java:197)
>>> at java.security.AccessController.doPrivileged(Native Method)
>>> at sun.rmi.transport.Transport.serviceCall(Transport.java:196)
>>> at
>>> sun.rmi.transport.tcp.TCPTransport.handleMessages(TCPTransport.java:568)
>>> at
>>> sun.rmi.transport.tcp.TCPTransport$ConnectionHandler.run0(TCPTransport.java:826)
>>> at
>>> sun.rmi.transport.tcp.TCPTransport$ConnectionHandler.lambda$run$0(TCPTransport.java:683)
>>> at java.security.AccessController.doPrivileged(Native Method)
>>> at
>>> sun.rmi.transport.tcp.TCPTransport$ConnectionHandler.run(TCPTransport.java:682)
>>> at
>>> java.util.concurrent.ThreadPoolExecutor.runWorker(ThreadPoolExecutor.java:1142)
>>> at
>>> java.util.concurrent.ThreadPoolExecutor$Worker.run(ThreadPoolExecutor.java:617)
>>> at java.lang.Thread.run(Thread.java:745)
>>> Caused by: java.rmi.server.ExportException: Port already in use:
>>> 24744; nested exception is:
>>> java.net.BindException: Failed to create server socket on
>>> asf900.gq1.ygridcore.net/67.195.81.144[24,744]
>>> <http://asf900.gq1.ygridcore.net/67.195.81.144%5B24,744%5D>
>>> at
>>> sun.rmi.transport.tcp.TCPTransport.listen(TCPTransport.java:341)
>>> at
>>> sun.rmi.transport.tcp.TCPTransport.exportObject(TCPTransport.java:249)
>>> at
>>> sun.rmi.transport.tcp.TCPEndpoint.exportObject(TCPEndpoint.java:411)
>>> at sun.rmi.transport.LiveRef.exportObject(LiveRef.java:147)
>>> at
>>> sun.rmi.server.UnicastServerRef.exportObject(UnicastServerRef.java:208)
>>> at sun.rmi.registry.RegistryImpl.setup(RegistryImpl.java:152)
>>> at sun.rmi.registry.RegistryImpl.<init>(RegistryImpl.java:112)
>>> at
>>> java.rmi.registry.LocateRegistry.createRegistry(LocateRegistry.java:239)
>>> at
>>> com.gemstone.gemfire.management.internal.ManagementAgent.configureAndStart(ManagementAgent.java:389)
>>> at
>>> com.gemstone.gemfire.management.internal.ManagementAgent.startAgent(ManagementAgent.java:145)
>>> ... 37 more
>>> Caused by: java.net.BindException: Failed to create server socket
>>> on asf900.gq1.ygridcore.net/67.195.81.144[24,744]
>>> <http://asf900.gq1.ygridcore.net/67.195.81.144%5B24,744%5D>
>>> at
>>> com.gemstone.gemfire.internal.SocketCreator.createServerSocket(SocketCreator.java:814)
>>> at
>>> com.gemstone.gemfire.internal.SocketCreator.createServerSocket(SocketCreator.java:768)
>>> at
>>> com.gemstone.gemfire.management.internal.ManagementAgent$GemFireRMIServerSocketFactory.createServerSocket(ManagementAgent.java:545)
>>> at
>>> sun.rmi.transport.tcp.TCPEndpoint.newServerSocket(TCPEndpoint.java:666)
>>> at
>>> sun.rmi.transport.tcp.TCPTransport.listen(TCPTransport.java:330)
>>> ... 46 more
>>> Caused by: java.net.BindException: Address already in use
>>> at java.net.PlainSocketImpl.socketBind(Native Method)
>>> at java.net
>>> .AbstractPlainSocketImpl.bind(AbstractPlainSocketImpl.java:387)
>>> at java.net.ServerSocket.bind(ServerSocket.java:375)
>>> at
>>> com.gemstone.gemfire.internal.SocketCreator.createServerSocket(SocketCreator.java:811)
>>> ... 50 more
>>>
>>>
>>> -----------------------------------------------------------------------
>>> Found suspect string in log4j at line 326
>>>
>>> [error 2016/07/17 21:46:41.938 UTC <RMI TCP
>>> Connection(1)-67.195.81.144> tid=0x1b]
>>> com.gemstone.gemfire.management.ManagementException:
>>> java.rmi.server.ExportException: Port already in use: 24744; nested
>>> exception is:
>>> java.net.BindException: Failed to create server socket on
>>> asf900.gq1.ygridcore.net/67.195.81.144[24,744]
>>> <http://asf900.gq1.ygridcore.net/67.195.81.144%5B24,744%5D>
>>>
>>> 7378 tests completed, 2 failed, 555 skipped
>>> :geode-core:distributedTest FAILED
>>> :geode-core:flakyTest
>>> :geode-core:integrationTest
>>> :geode-cq:assemble
>>> :geode-cq:compileTestJavaNote: Some input files use or override a
>>> deprecated API.
>>> Note: Recompile with -Xlint:deprecation for details.
>>> Note: Some input files use unchecked or unsafe operations.
>>> Note: Recompile with -Xlint:unchecked for details.
>>>
>>> :geode-cq:processTestResources
>>> :geode-cq:testClasses
>>> :geode-cq:checkMissedTests
>>> :geode-cq:test
>>> :geode-cq:check
>>> :geode-cq:build
>>> :geode-cq:distributedTest
>>> :geode-cq:flakyTest
>>> :geode-cq:integrationTest
>>> :geode-json:assemble
>>> :geode-json:compileTestJava UP-TO-DATE
>>> :geode-json:processTestResources UP-TO-DATE
>>> :geode-json:testClasses UP-TO-DATE
>>> :geode-json:checkMissedTests UP-TO-DATE
>>> :geode-json:test UP-TO-DATE
>>> :geode-json:check
>>> :geode-json:build
>>> :geode-json:distributedTest UP-TO-DATE
>>> :geode-json:flakyTest UP-TO-DATE
>>> :geode-json:integrationTest UP-TO-DATE
>>> :geode-junit:javadoc
>>> :geode-junit:javadocJar
>>> :geode-junit:sourcesJar
>>> :geode-junit:signArchives SKIPPED
>>> :geode-junit:assemble
>>> :geode-junit:compileTestJava
>>> :geode-junit:processTestResources UP-TO-DATE
>>> :geode-junit:testClasses
>>> :geode-junit:checkMissedTests
>>> :geode-junit:test
>>> :geode-junit:check
>>> :geode-junit:build
>>> :geode-junit:distributedTest
>>> :geode-junit:flakyTest
>>> :geode-junit:integrationTest
>>> :geode-lucene:assemble
>>> :geode-lucene:compileTestJavaNote: Some input files use or override a
>>> deprecated API.
>>> Note: Recompile with -Xlint:deprecation for details.
>>> Note: Some input files use unchecked or unsafe operations.
>>> Note: Recompile with -Xlint:unchecked for details.
>>>
>>> :geode-lucene:processTestResources
>>> :geode-lucene:testClasses
>>> :geode-lucene:checkMissedTests
>>> :geode-lucene:test
>>> :geode-lucene:check
>>> :geode-lucene:build
>>> :geode-lucene:distributedTest
>>> :geode-lucene:flakyTest
>>> :geode-lucene:integrationTest
>>> :geode-pulse:assemble
>>> :geode-pulse:compileTestJavaNote: <
>>> https://builds.apache.org/job/Geode-release/ws/geode-pulse/src/test/java/com/vmware/gemfire/tools/pulse/tests/PulseAbstractTest.java>
>>> uses or overrides a deprecated API.
>>> Note: Recompile with -Xlint:deprecation for details.
>>> Note: Some input files use unchecked or unsafe operations.
>>> Note: Recompile with -Xlint:unchecked for details.
>>>
>>> :geode-pulse:processTestResources
>>> :geode-pulse:testClasses
>>> :geode-pulse:checkMissedTests
>>> :geode-pulse:test
>>> :geode-pulse:check
>>> :geode-pulse:build
>>> :geode-pulse:distributedTest
>>> :geode-pulse:flakyTest
>>> :geode-pulse:integrationTest
>>> :geode-rebalancer:jar
>>> :geode-rebalancer:javadoc
>>> :geode-rebalancer:javadocJar
>>> :geode-rebalancer:sourcesJar
>>> :geode-rebalancer:signArchives SKIPPED
>>> :geode-rebalancer:assemble
>>> :geode-rebalancer:compileTestJava
>>> :geode-rebalancer:processTestResources UP-TO-DATE
>>> :geode-rebalancer:testClasses
>>> :geode-rebalancer:checkMissedTests
>>> :geode-rebalancer:test
>>> :geode-rebalancer:check
>>> :geode-rebalancer:build
>>> :geode-rebalancer:distributedTest
>>> :geode-rebalancer:flakyTest
>>> :geode-rebalancer:integrationTest
>>> :geode-wan:assemble
>>> :geode-wan:compileTestJavaNote: Some input files use or override a
>>> deprecated API.
>>> Note: Recompile with -Xlint:deprecation for details.
>>> Note: Some input files use unchecked or unsafe operations.
>>> Note: Recompile with -Xlint:unchecked for details.
>>>
>>> :geode-wan:processTestResources
>>> :geode-wan:testClasses
>>> :geode-wan:checkMissedTests
>>> :geode-wan:test
>>> :geode-wan:check
>>> :geode-wan:build
>>> :geode-wan:distributedTest
>>> :geode-wan:flakyTest
>>> :geode-wan:integrationTest
>>> :geode-web:assemble
>>> :geode-web:compileTestJavaNote: <
>>> https://builds.apache.org/job/Geode-release/ws/geode-web/src/test/java/com/gemstone/gemfire/management/internal/cli/commands/DataCommandsOverHttpDistributedTest.java>
>>> uses or overrides a deprecated API.
>>> Note: Recompile with -Xlint:deprecation for details.
>>> Note: Some input files use unchecked or unsafe operations.
>>> Note: Recompile with -Xlint:unchecked for details.
>>>
>>> :geode-web:processTestResources UP-TO-DATE
>>> :geode-web:testClasses
>>> :geode-web:checkMissedTests
>>> :geode-web:test
>>> :geode-web:check
>>> :geode-web:build
>>> :geode-web:distributedTest
>>> :geode-web:flakyTest
>>> :geode-web:integrationTest
>>> :geode-web-api:assemble
>>> :geode-web-api:compileTestJava UP-TO-DATE
>>> :geode-web-api:processTestResources UP-TO-DATE
>>> :geode-web-api:testClasses UP-TO-DATE
>>> :geode-web-api:checkMissedTests UP-TO-DATE
>>> :geode-web-api:test UP-TO-DATE
>>> :geode-web-api:check
>>> :geode-web-api:build
>>> :geode-web-api:distributedTest UP-TO-DATE
>>> :geode-web-api:flakyTest UP-TO-DATE
>>> :geode-web-api:integrationTest UP-TO-DATE
>>> :combineReports
>>> All test reports at <
>>> https://builds.apache.org/job/Geode-release/ws/build/reports/combined>
>>> :extensions/geode-modules:precheckin
>>> :extensions/geode-modules-assembly:precheckin
>>> :extensions/geode-modules-hibernate:precheckin
>>> :extensions/geode-modules-session:precheckin
>>> :extensions/geode-modules-session-internal:precheckin
>>> :extensions/geode-modules-tomcat7:precheckin
>>> :geode-assembly:precheckin
>>> :geode-common:precheckin
>>> :geode-cq:precheckin
>>> :geode-json:precheckin
>>> :geode-junit:precheckin
>>> :geode-lucene:precheckin
>>> :geode-pulse:precheckin
>>> :geode-rebalancer:precheckin
>>> :geode-wan:precheckin
>>> :geode-web:precheckin
>>> :geode-web-api:precheckin
>>>
>>> FAILURE: Build failed with an exception.
>>>
>>> * What went wrong:
>>> Execution failed for task ':geode-core:distributedTest'.
>>>
>>>> There were failing tests. See the report at: file://<
>>>> https://builds.apache.org/job/Geode-release/ws/geode-core/build/reports/distributedTest/index.html
>>>> >
>>>>
>>> * Try:
>>> Run with --stacktrace option to get the stack trace. Run with --info or
>>> --debug option to get more log output.
>>>
>>> BUILD FAILED
>>>
>>> Total time: 11 hrs 26 mins 8.356 secs
>>> Build step 'Invoke Gradle script' changed build result to FAILURE
>>> Build step 'Invoke Gradle script' marked build as failure
>>> Archiving artifacts
>>> Compressed 250.96 MB of artifacts by 13.1% relative to #7
>>> Recording test results
>>>
>>
>>
>
Re: Build failed in Jenkins: Geode-release #14
Posted by Kirk Lund <kl...@pivotal.io>.
1) GemfireDataCommandsDUnitTest failed because a TCP port that was
determined to be available was no longer available when the code finally
attempted to use it, resulting in a "java.net.BindException: Address
already in use"
Every test that uses getRandomAvailableTCPPorts is prone to hit this
occasionally. We would have to either:
a) categorize all such tests as Flaky or
b) change the Geode APIs (gemfire.properties) to use "0" to mean that the
product will let the system pick up an ephemeral port during bind instead
of interpreting it as disabling the service that "0" is being specified for
(this would break backwards compatibility for any User using "0" to disable
anything)
final int[] ports = AvailablePortHelper.getRandomAvailableTCPPorts(2);
jmxPort = ports[0];
httpPort = ports[1];
localProps.setProperty(JMX_MANAGER, "true");
localProps.setProperty(JMX_MANAGER_START, "true");
localProps.setProperty(JMX_MANAGER_BIND_ADDRESS,
String.valueOf(jmxHost));
localProps.setProperty(JMX_MANAGER_PORT, String.valueOf(jmxPort));
localProps.setProperty(HTTP_SERVICE_PORT, String.valueOf(httpPort));
getSystem(localProps);
verifyManagementServiceStarted(getCache());
2) ConsoleDistributionManagerDUnitTest failed because the
InternalDistributedSystem connection shut down for an unknown reason during
the test (just as Bruce already mentioned)
ConsoleDistributionManagerDUnitTest is testing the old deprecated Admin
API. We could create a new category such as "DeprecatedTest" to temporarily
exclude such tests from the standard test targets. Ultimately this test and
the Admin API should be removed which requires some investment of time.
Unfortunately, the team currently working on GEODE-17 Integrated Security
doesn't have any time (yet) to dedicate to removal the Admin API and its
tests.
I don't think release/1.0.0-incubating.M3 is any less stable than develop.
I believe these tests could potentially hit the same failures on develop,
though I really don't know what's happening in
ConsoleDistributionManagerDUnitTest.
Is the system that's running the build for release/1.0.0-incubating.M3
different in any way from the infrastructure running the nightly build for
Geode?
-Kirk
On Tue, Jul 19, 2016 at 10:49 AM, Bruce Schuchardt <bs...@pivotal.io>
wrote:
> The ConsoleDistributionManagerDUnitTest failure isn't a PDX problem. The
> admin distributed system is being shut down for some reason before the test
> attempts to send an admin request message. Build-artifacts don't have any
> useful information on why that is happening.
>
> Unfortunately the test passes repeatedly when run on its own.
>
>
>
> Le 7/17/2016 à 8:56 PM, Apache Jenkins Server a écrit :
>
>> See <https://builds.apache.org/job/Geode-release/14/>
>>
>> ------------------------------------------
>> [...truncated 697 lines...]
>> java.lang.AssertionError: Suspicious strings were written to the log
>> during this run.
>> Fix the strings or use IgnoredException.addIgnoredException to
>> ignore.
>>
>> -----------------------------------------------------------------------
>> Found suspect string in log4j at line 257
>>
>> [error 2016/07/17 21:46:41.931 UTC <RMI TCP
>> Connection(1)-67.195.81.144> tid=0x1b] Jmx manager could not be started
>> because java.rmi.server.ExportException: Port already in use: 24744; nested
>> exception is:
>> java.net.BindException: Failed to create server socket on
>> asf900.gq1.ygridcore.net/67.195.81.144[24,744]
>> <http://asf900.gq1.ygridcore.net/67.195.81.144%5B24,744%5D>
>> com.gemstone.gemfire.management.ManagementException:
>> java.rmi.server.ExportException: Port already in use: 24744; nested
>> exception is:
>> java.net.BindException: Failed to create server socket on
>> asf900.gq1.ygridcore.net/67.195.81.144[24,744]
>> <http://asf900.gq1.ygridcore.net/67.195.81.144%5B24,744%5D>
>> at
>> com.gemstone.gemfire.management.internal.ManagementAgent.startAgent(ManagementAgent.java:147)
>> at
>> com.gemstone.gemfire.management.internal.SystemManagementService.startManager(SystemManagementService.java:479)
>> at
>> com.gemstone.gemfire.management.internal.beans.ManagementAdapter.handleCacheCreation(ManagementAdapter.java:197)
>> at
>> com.gemstone.gemfire.management.internal.beans.ManagementListener.handleEvent(ManagementListener.java:119)
>> at
>> com.gemstone.gemfire.distributed.internal.InternalDistributedSystem.notifyResourceEventListeners(InternalDistributedSystem.java:2085)
>> at
>> com.gemstone.gemfire.distributed.internal.InternalDistributedSystem.handleResourceEvent(InternalDistributedSystem.java:478)
>> at
>> com.gemstone.gemfire.internal.cache.GemFireCacheImpl.initialize(GemFireCacheImpl.java:1054)
>> at
>> com.gemstone.gemfire.internal.cache.GemFireCacheImpl.basicCreate(GemFireCacheImpl.java:707)
>> at
>> com.gemstone.gemfire.internal.cache.GemFireCacheImpl.create(GemFireCacheImpl.java:695)
>> at
>> com.gemstone.gemfire.cache.CacheFactory.create(CacheFactory.java:181)
>> at
>> com.gemstone.gemfire.cache.CacheFactory.create(CacheFactory.java:172)
>> at
>> com.gemstone.gemfire.test.dunit.cache.internal.JUnit4CacheTestCase.createCache(JUnit4CacheTestCase.java:120)
>> at
>> com.gemstone.gemfire.test.dunit.cache.internal.JUnit4CacheTestCase.getCache(JUnit4CacheTestCase.java:263)
>> at
>> com.gemstone.gemfire.test.dunit.cache.internal.JUnit4CacheTestCase.getCache(JUnit4CacheTestCase.java:242)
>> at
>> com.gemstone.gemfire.test.dunit.cache.internal.JUnit4CacheTestCase.getCache(JUnit4CacheTestCase.java:234)
>> at
>> com.gemstone.gemfire.management.internal.cli.commands.CliCommandTestBase.lambda$setUpJMXManagerOnVM$d0384528$1(CliCommandTestBase.java:154)
>> at
>> com.gemstone.gemfire.test.dunit.NamedCallable.call(NamedCallable.java:33)
>> at sun.reflect.GeneratedMethodAccessor338.invoke(Unknown Source)
>> at
>> sun.reflect.DelegatingMethodAccessorImpl.invoke(DelegatingMethodAccessorImpl.java:43)
>> at java.lang.reflect.Method.invoke(Method.java:498)
>> at hydra.MethExecutor.executeObject(MethExecutor.java:268)
>> at
>> com.gemstone.gemfire.test.dunit.standalone.RemoteDUnitVM.executeMethodOnObject(RemoteDUnitVM.java:82)
>> at sun.reflect.GeneratedMethodAccessor3.invoke(Unknown Source)
>> at
>> sun.reflect.DelegatingMethodAccessorImpl.invoke(DelegatingMethodAccessorImpl.java:43)
>> at java.lang.reflect.Method.invoke(Method.java:498)
>> at
>> sun.rmi.server.UnicastServerRef.dispatch(UnicastServerRef.java:323)
>> at sun.rmi.transport.Transport$1.run(Transport.java:200)
>> at sun.rmi.transport.Transport$1.run(Transport.java:197)
>> at java.security.AccessController.doPrivileged(Native Method)
>> at sun.rmi.transport.Transport.serviceCall(Transport.java:196)
>> at
>> sun.rmi.transport.tcp.TCPTransport.handleMessages(TCPTransport.java:568)
>> at
>> sun.rmi.transport.tcp.TCPTransport$ConnectionHandler.run0(TCPTransport.java:826)
>> at
>> sun.rmi.transport.tcp.TCPTransport$ConnectionHandler.lambda$run$0(TCPTransport.java:683)
>> at java.security.AccessController.doPrivileged(Native Method)
>> at
>> sun.rmi.transport.tcp.TCPTransport$ConnectionHandler.run(TCPTransport.java:682)
>> at
>> java.util.concurrent.ThreadPoolExecutor.runWorker(ThreadPoolExecutor.java:1142)
>> at
>> java.util.concurrent.ThreadPoolExecutor$Worker.run(ThreadPoolExecutor.java:617)
>> at java.lang.Thread.run(Thread.java:745)
>> Caused by: java.rmi.server.ExportException: Port already in use:
>> 24744; nested exception is:
>> java.net.BindException: Failed to create server socket on
>> asf900.gq1.ygridcore.net/67.195.81.144[24,744]
>> <http://asf900.gq1.ygridcore.net/67.195.81.144%5B24,744%5D>
>> at
>> sun.rmi.transport.tcp.TCPTransport.listen(TCPTransport.java:341)
>> at
>> sun.rmi.transport.tcp.TCPTransport.exportObject(TCPTransport.java:249)
>> at
>> sun.rmi.transport.tcp.TCPEndpoint.exportObject(TCPEndpoint.java:411)
>> at sun.rmi.transport.LiveRef.exportObject(LiveRef.java:147)
>> at
>> sun.rmi.server.UnicastServerRef.exportObject(UnicastServerRef.java:208)
>> at sun.rmi.registry.RegistryImpl.setup(RegistryImpl.java:152)
>> at sun.rmi.registry.RegistryImpl.<init>(RegistryImpl.java:112)
>> at
>> java.rmi.registry.LocateRegistry.createRegistry(LocateRegistry.java:239)
>> at
>> com.gemstone.gemfire.management.internal.ManagementAgent.configureAndStart(ManagementAgent.java:389)
>> at
>> com.gemstone.gemfire.management.internal.ManagementAgent.startAgent(ManagementAgent.java:145)
>> ... 37 more
>> Caused by: java.net.BindException: Failed to create server socket
>> on asf900.gq1.ygridcore.net/67.195.81.144[24,744]
>> <http://asf900.gq1.ygridcore.net/67.195.81.144%5B24,744%5D>
>> at
>> com.gemstone.gemfire.internal.SocketCreator.createServerSocket(SocketCreator.java:814)
>> at
>> com.gemstone.gemfire.internal.SocketCreator.createServerSocket(SocketCreator.java:768)
>> at
>> com.gemstone.gemfire.management.internal.ManagementAgent$GemFireRMIServerSocketFactory.createServerSocket(ManagementAgent.java:545)
>> at
>> sun.rmi.transport.tcp.TCPEndpoint.newServerSocket(TCPEndpoint.java:666)
>> at
>> sun.rmi.transport.tcp.TCPTransport.listen(TCPTransport.java:330)
>> ... 46 more
>> Caused by: java.net.BindException: Address already in use
>> at java.net.PlainSocketImpl.socketBind(Native Method)
>> at java.net
>> .AbstractPlainSocketImpl.bind(AbstractPlainSocketImpl.java:387)
>> at java.net.ServerSocket.bind(ServerSocket.java:375)
>> at
>> com.gemstone.gemfire.internal.SocketCreator.createServerSocket(SocketCreator.java:811)
>> ... 50 more
>>
>>
>> -----------------------------------------------------------------------
>> Found suspect string in log4j at line 326
>>
>> [error 2016/07/17 21:46:41.938 UTC <RMI TCP
>> Connection(1)-67.195.81.144> tid=0x1b]
>> com.gemstone.gemfire.management.ManagementException:
>> java.rmi.server.ExportException: Port already in use: 24744; nested
>> exception is:
>> java.net.BindException: Failed to create server socket on
>> asf900.gq1.ygridcore.net/67.195.81.144[24,744]
>> <http://asf900.gq1.ygridcore.net/67.195.81.144%5B24,744%5D>
>>
>> 7378 tests completed, 2 failed, 555 skipped
>> :geode-core:distributedTest FAILED
>> :geode-core:flakyTest
>> :geode-core:integrationTest
>> :geode-cq:assemble
>> :geode-cq:compileTestJavaNote: Some input files use or override a
>> deprecated API.
>> Note: Recompile with -Xlint:deprecation for details.
>> Note: Some input files use unchecked or unsafe operations.
>> Note: Recompile with -Xlint:unchecked for details.
>>
>> :geode-cq:processTestResources
>> :geode-cq:testClasses
>> :geode-cq:checkMissedTests
>> :geode-cq:test
>> :geode-cq:check
>> :geode-cq:build
>> :geode-cq:distributedTest
>> :geode-cq:flakyTest
>> :geode-cq:integrationTest
>> :geode-json:assemble
>> :geode-json:compileTestJava UP-TO-DATE
>> :geode-json:processTestResources UP-TO-DATE
>> :geode-json:testClasses UP-TO-DATE
>> :geode-json:checkMissedTests UP-TO-DATE
>> :geode-json:test UP-TO-DATE
>> :geode-json:check
>> :geode-json:build
>> :geode-json:distributedTest UP-TO-DATE
>> :geode-json:flakyTest UP-TO-DATE
>> :geode-json:integrationTest UP-TO-DATE
>> :geode-junit:javadoc
>> :geode-junit:javadocJar
>> :geode-junit:sourcesJar
>> :geode-junit:signArchives SKIPPED
>> :geode-junit:assemble
>> :geode-junit:compileTestJava
>> :geode-junit:processTestResources UP-TO-DATE
>> :geode-junit:testClasses
>> :geode-junit:checkMissedTests
>> :geode-junit:test
>> :geode-junit:check
>> :geode-junit:build
>> :geode-junit:distributedTest
>> :geode-junit:flakyTest
>> :geode-junit:integrationTest
>> :geode-lucene:assemble
>> :geode-lucene:compileTestJavaNote: Some input files use or override a
>> deprecated API.
>> Note: Recompile with -Xlint:deprecation for details.
>> Note: Some input files use unchecked or unsafe operations.
>> Note: Recompile with -Xlint:unchecked for details.
>>
>> :geode-lucene:processTestResources
>> :geode-lucene:testClasses
>> :geode-lucene:checkMissedTests
>> :geode-lucene:test
>> :geode-lucene:check
>> :geode-lucene:build
>> :geode-lucene:distributedTest
>> :geode-lucene:flakyTest
>> :geode-lucene:integrationTest
>> :geode-pulse:assemble
>> :geode-pulse:compileTestJavaNote: <
>> https://builds.apache.org/job/Geode-release/ws/geode-pulse/src/test/java/com/vmware/gemfire/tools/pulse/tests/PulseAbstractTest.java>
>> uses or overrides a deprecated API.
>> Note: Recompile with -Xlint:deprecation for details.
>> Note: Some input files use unchecked or unsafe operations.
>> Note: Recompile with -Xlint:unchecked for details.
>>
>> :geode-pulse:processTestResources
>> :geode-pulse:testClasses
>> :geode-pulse:checkMissedTests
>> :geode-pulse:test
>> :geode-pulse:check
>> :geode-pulse:build
>> :geode-pulse:distributedTest
>> :geode-pulse:flakyTest
>> :geode-pulse:integrationTest
>> :geode-rebalancer:jar
>> :geode-rebalancer:javadoc
>> :geode-rebalancer:javadocJar
>> :geode-rebalancer:sourcesJar
>> :geode-rebalancer:signArchives SKIPPED
>> :geode-rebalancer:assemble
>> :geode-rebalancer:compileTestJava
>> :geode-rebalancer:processTestResources UP-TO-DATE
>> :geode-rebalancer:testClasses
>> :geode-rebalancer:checkMissedTests
>> :geode-rebalancer:test
>> :geode-rebalancer:check
>> :geode-rebalancer:build
>> :geode-rebalancer:distributedTest
>> :geode-rebalancer:flakyTest
>> :geode-rebalancer:integrationTest
>> :geode-wan:assemble
>> :geode-wan:compileTestJavaNote: Some input files use or override a
>> deprecated API.
>> Note: Recompile with -Xlint:deprecation for details.
>> Note: Some input files use unchecked or unsafe operations.
>> Note: Recompile with -Xlint:unchecked for details.
>>
>> :geode-wan:processTestResources
>> :geode-wan:testClasses
>> :geode-wan:checkMissedTests
>> :geode-wan:test
>> :geode-wan:check
>> :geode-wan:build
>> :geode-wan:distributedTest
>> :geode-wan:flakyTest
>> :geode-wan:integrationTest
>> :geode-web:assemble
>> :geode-web:compileTestJavaNote: <
>> https://builds.apache.org/job/Geode-release/ws/geode-web/src/test/java/com/gemstone/gemfire/management/internal/cli/commands/DataCommandsOverHttpDistributedTest.java>
>> uses or overrides a deprecated API.
>> Note: Recompile with -Xlint:deprecation for details.
>> Note: Some input files use unchecked or unsafe operations.
>> Note: Recompile with -Xlint:unchecked for details.
>>
>> :geode-web:processTestResources UP-TO-DATE
>> :geode-web:testClasses
>> :geode-web:checkMissedTests
>> :geode-web:test
>> :geode-web:check
>> :geode-web:build
>> :geode-web:distributedTest
>> :geode-web:flakyTest
>> :geode-web:integrationTest
>> :geode-web-api:assemble
>> :geode-web-api:compileTestJava UP-TO-DATE
>> :geode-web-api:processTestResources UP-TO-DATE
>> :geode-web-api:testClasses UP-TO-DATE
>> :geode-web-api:checkMissedTests UP-TO-DATE
>> :geode-web-api:test UP-TO-DATE
>> :geode-web-api:check
>> :geode-web-api:build
>> :geode-web-api:distributedTest UP-TO-DATE
>> :geode-web-api:flakyTest UP-TO-DATE
>> :geode-web-api:integrationTest UP-TO-DATE
>> :combineReports
>> All test reports at <
>> https://builds.apache.org/job/Geode-release/ws/build/reports/combined>
>> :extensions/geode-modules:precheckin
>> :extensions/geode-modules-assembly:precheckin
>> :extensions/geode-modules-hibernate:precheckin
>> :extensions/geode-modules-session:precheckin
>> :extensions/geode-modules-session-internal:precheckin
>> :extensions/geode-modules-tomcat7:precheckin
>> :geode-assembly:precheckin
>> :geode-common:precheckin
>> :geode-cq:precheckin
>> :geode-json:precheckin
>> :geode-junit:precheckin
>> :geode-lucene:precheckin
>> :geode-pulse:precheckin
>> :geode-rebalancer:precheckin
>> :geode-wan:precheckin
>> :geode-web:precheckin
>> :geode-web-api:precheckin
>>
>> FAILURE: Build failed with an exception.
>>
>> * What went wrong:
>> Execution failed for task ':geode-core:distributedTest'.
>>
>>> There were failing tests. See the report at: file://<
>>> https://builds.apache.org/job/Geode-release/ws/geode-core/build/reports/distributedTest/index.html
>>> >
>>>
>> * Try:
>> Run with --stacktrace option to get the stack trace. Run with --info or
>> --debug option to get more log output.
>>
>> BUILD FAILED
>>
>> Total time: 11 hrs 26 mins 8.356 secs
>> Build step 'Invoke Gradle script' changed build result to FAILURE
>> Build step 'Invoke Gradle script' marked build as failure
>> Archiving artifacts
>> Compressed 250.96 MB of artifacts by 13.1% relative to #7
>> Recording test results
>>
>
>
Re: Build failed in Jenkins: Geode-release #14
Posted by Bruce Schuchardt <bs...@pivotal.io>.
The ConsoleDistributionManagerDUnitTest failure isn't a PDX problem.
The admin distributed system is being shut down for some reason before
the test attempts to send an admin request message. Build-artifacts
don't have any useful information on why that is happening.
Unfortunately the test passes repeatedly when run on its own.
Le 7/17/2016 � 8:56 PM, Apache Jenkins Server a �crit :
> See <https://builds.apache.org/job/Geode-release/14/>
>
> ------------------------------------------
> [...truncated 697 lines...]
> java.lang.AssertionError: Suspicious strings were written to the log during this run.
> Fix the strings or use IgnoredException.addIgnoredException to ignore.
> -----------------------------------------------------------------------
> Found suspect string in log4j at line 257
>
> [error 2016/07/17 21:46:41.931 UTC <RMI TCP Connection(1)-67.195.81.144> tid=0x1b] Jmx manager could not be started because java.rmi.server.ExportException: Port already in use: 24744; nested exception is:
> java.net.BindException: Failed to create server socket on asf900.gq1.ygridcore.net/67.195.81.144[24,744]
> com.gemstone.gemfire.management.ManagementException: java.rmi.server.ExportException: Port already in use: 24744; nested exception is:
> java.net.BindException: Failed to create server socket on asf900.gq1.ygridcore.net/67.195.81.144[24,744]
> at com.gemstone.gemfire.management.internal.ManagementAgent.startAgent(ManagementAgent.java:147)
> at com.gemstone.gemfire.management.internal.SystemManagementService.startManager(SystemManagementService.java:479)
> at com.gemstone.gemfire.management.internal.beans.ManagementAdapter.handleCacheCreation(ManagementAdapter.java:197)
> at com.gemstone.gemfire.management.internal.beans.ManagementListener.handleEvent(ManagementListener.java:119)
> at com.gemstone.gemfire.distributed.internal.InternalDistributedSystem.notifyResourceEventListeners(InternalDistributedSystem.java:2085)
> at com.gemstone.gemfire.distributed.internal.InternalDistributedSystem.handleResourceEvent(InternalDistributedSystem.java:478)
> at com.gemstone.gemfire.internal.cache.GemFireCacheImpl.initialize(GemFireCacheImpl.java:1054)
> at com.gemstone.gemfire.internal.cache.GemFireCacheImpl.basicCreate(GemFireCacheImpl.java:707)
> at com.gemstone.gemfire.internal.cache.GemFireCacheImpl.create(GemFireCacheImpl.java:695)
> at com.gemstone.gemfire.cache.CacheFactory.create(CacheFactory.java:181)
> at com.gemstone.gemfire.cache.CacheFactory.create(CacheFactory.java:172)
> at com.gemstone.gemfire.test.dunit.cache.internal.JUnit4CacheTestCase.createCache(JUnit4CacheTestCase.java:120)
> at com.gemstone.gemfire.test.dunit.cache.internal.JUnit4CacheTestCase.getCache(JUnit4CacheTestCase.java:263)
> at com.gemstone.gemfire.test.dunit.cache.internal.JUnit4CacheTestCase.getCache(JUnit4CacheTestCase.java:242)
> at com.gemstone.gemfire.test.dunit.cache.internal.JUnit4CacheTestCase.getCache(JUnit4CacheTestCase.java:234)
> at com.gemstone.gemfire.management.internal.cli.commands.CliCommandTestBase.lambda$setUpJMXManagerOnVM$d0384528$1(CliCommandTestBase.java:154)
> at com.gemstone.gemfire.test.dunit.NamedCallable.call(NamedCallable.java:33)
> at sun.reflect.GeneratedMethodAccessor338.invoke(Unknown Source)
> at sun.reflect.DelegatingMethodAccessorImpl.invoke(DelegatingMethodAccessorImpl.java:43)
> at java.lang.reflect.Method.invoke(Method.java:498)
> at hydra.MethExecutor.executeObject(MethExecutor.java:268)
> at com.gemstone.gemfire.test.dunit.standalone.RemoteDUnitVM.executeMethodOnObject(RemoteDUnitVM.java:82)
> at sun.reflect.GeneratedMethodAccessor3.invoke(Unknown Source)
> at sun.reflect.DelegatingMethodAccessorImpl.invoke(DelegatingMethodAccessorImpl.java:43)
> at java.lang.reflect.Method.invoke(Method.java:498)
> at sun.rmi.server.UnicastServerRef.dispatch(UnicastServerRef.java:323)
> at sun.rmi.transport.Transport$1.run(Transport.java:200)
> at sun.rmi.transport.Transport$1.run(Transport.java:197)
> at java.security.AccessController.doPrivileged(Native Method)
> at sun.rmi.transport.Transport.serviceCall(Transport.java:196)
> at sun.rmi.transport.tcp.TCPTransport.handleMessages(TCPTransport.java:568)
> at sun.rmi.transport.tcp.TCPTransport$ConnectionHandler.run0(TCPTransport.java:826)
> at sun.rmi.transport.tcp.TCPTransport$ConnectionHandler.lambda$run$0(TCPTransport.java:683)
> at java.security.AccessController.doPrivileged(Native Method)
> at sun.rmi.transport.tcp.TCPTransport$ConnectionHandler.run(TCPTransport.java:682)
> at java.util.concurrent.ThreadPoolExecutor.runWorker(ThreadPoolExecutor.java:1142)
> at java.util.concurrent.ThreadPoolExecutor$Worker.run(ThreadPoolExecutor.java:617)
> at java.lang.Thread.run(Thread.java:745)
> Caused by: java.rmi.server.ExportException: Port already in use: 24744; nested exception is:
> java.net.BindException: Failed to create server socket on asf900.gq1.ygridcore.net/67.195.81.144[24,744]
> at sun.rmi.transport.tcp.TCPTransport.listen(TCPTransport.java:341)
> at sun.rmi.transport.tcp.TCPTransport.exportObject(TCPTransport.java:249)
> at sun.rmi.transport.tcp.TCPEndpoint.exportObject(TCPEndpoint.java:411)
> at sun.rmi.transport.LiveRef.exportObject(LiveRef.java:147)
> at sun.rmi.server.UnicastServerRef.exportObject(UnicastServerRef.java:208)
> at sun.rmi.registry.RegistryImpl.setup(RegistryImpl.java:152)
> at sun.rmi.registry.RegistryImpl.<init>(RegistryImpl.java:112)
> at java.rmi.registry.LocateRegistry.createRegistry(LocateRegistry.java:239)
> at com.gemstone.gemfire.management.internal.ManagementAgent.configureAndStart(ManagementAgent.java:389)
> at com.gemstone.gemfire.management.internal.ManagementAgent.startAgent(ManagementAgent.java:145)
> ... 37 more
> Caused by: java.net.BindException: Failed to create server socket on asf900.gq1.ygridcore.net/67.195.81.144[24,744]
> at com.gemstone.gemfire.internal.SocketCreator.createServerSocket(SocketCreator.java:814)
> at com.gemstone.gemfire.internal.SocketCreator.createServerSocket(SocketCreator.java:768)
> at com.gemstone.gemfire.management.internal.ManagementAgent$GemFireRMIServerSocketFactory.createServerSocket(ManagementAgent.java:545)
> at sun.rmi.transport.tcp.TCPEndpoint.newServerSocket(TCPEndpoint.java:666)
> at sun.rmi.transport.tcp.TCPTransport.listen(TCPTransport.java:330)
> ... 46 more
> Caused by: java.net.BindException: Address already in use
> at java.net.PlainSocketImpl.socketBind(Native Method)
> at java.net.AbstractPlainSocketImpl.bind(AbstractPlainSocketImpl.java:387)
> at java.net.ServerSocket.bind(ServerSocket.java:375)
> at com.gemstone.gemfire.internal.SocketCreator.createServerSocket(SocketCreator.java:811)
> ... 50 more
>
> -----------------------------------------------------------------------
> Found suspect string in log4j at line 326
>
> [error 2016/07/17 21:46:41.938 UTC <RMI TCP Connection(1)-67.195.81.144> tid=0x1b] com.gemstone.gemfire.management.ManagementException: java.rmi.server.ExportException: Port already in use: 24744; nested exception is:
> java.net.BindException: Failed to create server socket on asf900.gq1.ygridcore.net/67.195.81.144[24,744]
>
> 7378 tests completed, 2 failed, 555 skipped
> :geode-core:distributedTest FAILED
> :geode-core:flakyTest
> :geode-core:integrationTest
> :geode-cq:assemble
> :geode-cq:compileTestJavaNote: Some input files use or override a deprecated API.
> Note: Recompile with -Xlint:deprecation for details.
> Note: Some input files use unchecked or unsafe operations.
> Note: Recompile with -Xlint:unchecked for details.
>
> :geode-cq:processTestResources
> :geode-cq:testClasses
> :geode-cq:checkMissedTests
> :geode-cq:test
> :geode-cq:check
> :geode-cq:build
> :geode-cq:distributedTest
> :geode-cq:flakyTest
> :geode-cq:integrationTest
> :geode-json:assemble
> :geode-json:compileTestJava UP-TO-DATE
> :geode-json:processTestResources UP-TO-DATE
> :geode-json:testClasses UP-TO-DATE
> :geode-json:checkMissedTests UP-TO-DATE
> :geode-json:test UP-TO-DATE
> :geode-json:check
> :geode-json:build
> :geode-json:distributedTest UP-TO-DATE
> :geode-json:flakyTest UP-TO-DATE
> :geode-json:integrationTest UP-TO-DATE
> :geode-junit:javadoc
> :geode-junit:javadocJar
> :geode-junit:sourcesJar
> :geode-junit:signArchives SKIPPED
> :geode-junit:assemble
> :geode-junit:compileTestJava
> :geode-junit:processTestResources UP-TO-DATE
> :geode-junit:testClasses
> :geode-junit:checkMissedTests
> :geode-junit:test
> :geode-junit:check
> :geode-junit:build
> :geode-junit:distributedTest
> :geode-junit:flakyTest
> :geode-junit:integrationTest
> :geode-lucene:assemble
> :geode-lucene:compileTestJavaNote: Some input files use or override a deprecated API.
> Note: Recompile with -Xlint:deprecation for details.
> Note: Some input files use unchecked or unsafe operations.
> Note: Recompile with -Xlint:unchecked for details.
>
> :geode-lucene:processTestResources
> :geode-lucene:testClasses
> :geode-lucene:checkMissedTests
> :geode-lucene:test
> :geode-lucene:check
> :geode-lucene:build
> :geode-lucene:distributedTest
> :geode-lucene:flakyTest
> :geode-lucene:integrationTest
> :geode-pulse:assemble
> :geode-pulse:compileTestJavaNote: <https://builds.apache.org/job/Geode-release/ws/geode-pulse/src/test/java/com/vmware/gemfire/tools/pulse/tests/PulseAbstractTest.java> uses or overrides a deprecated API.
> Note: Recompile with -Xlint:deprecation for details.
> Note: Some input files use unchecked or unsafe operations.
> Note: Recompile with -Xlint:unchecked for details.
>
> :geode-pulse:processTestResources
> :geode-pulse:testClasses
> :geode-pulse:checkMissedTests
> :geode-pulse:test
> :geode-pulse:check
> :geode-pulse:build
> :geode-pulse:distributedTest
> :geode-pulse:flakyTest
> :geode-pulse:integrationTest
> :geode-rebalancer:jar
> :geode-rebalancer:javadoc
> :geode-rebalancer:javadocJar
> :geode-rebalancer:sourcesJar
> :geode-rebalancer:signArchives SKIPPED
> :geode-rebalancer:assemble
> :geode-rebalancer:compileTestJava
> :geode-rebalancer:processTestResources UP-TO-DATE
> :geode-rebalancer:testClasses
> :geode-rebalancer:checkMissedTests
> :geode-rebalancer:test
> :geode-rebalancer:check
> :geode-rebalancer:build
> :geode-rebalancer:distributedTest
> :geode-rebalancer:flakyTest
> :geode-rebalancer:integrationTest
> :geode-wan:assemble
> :geode-wan:compileTestJavaNote: Some input files use or override a deprecated API.
> Note: Recompile with -Xlint:deprecation for details.
> Note: Some input files use unchecked or unsafe operations.
> Note: Recompile with -Xlint:unchecked for details.
>
> :geode-wan:processTestResources
> :geode-wan:testClasses
> :geode-wan:checkMissedTests
> :geode-wan:test
> :geode-wan:check
> :geode-wan:build
> :geode-wan:distributedTest
> :geode-wan:flakyTest
> :geode-wan:integrationTest
> :geode-web:assemble
> :geode-web:compileTestJavaNote: <https://builds.apache.org/job/Geode-release/ws/geode-web/src/test/java/com/gemstone/gemfire/management/internal/cli/commands/DataCommandsOverHttpDistributedTest.java> uses or overrides a deprecated API.
> Note: Recompile with -Xlint:deprecation for details.
> Note: Some input files use unchecked or unsafe operations.
> Note: Recompile with -Xlint:unchecked for details.
>
> :geode-web:processTestResources UP-TO-DATE
> :geode-web:testClasses
> :geode-web:checkMissedTests
> :geode-web:test
> :geode-web:check
> :geode-web:build
> :geode-web:distributedTest
> :geode-web:flakyTest
> :geode-web:integrationTest
> :geode-web-api:assemble
> :geode-web-api:compileTestJava UP-TO-DATE
> :geode-web-api:processTestResources UP-TO-DATE
> :geode-web-api:testClasses UP-TO-DATE
> :geode-web-api:checkMissedTests UP-TO-DATE
> :geode-web-api:test UP-TO-DATE
> :geode-web-api:check
> :geode-web-api:build
> :geode-web-api:distributedTest UP-TO-DATE
> :geode-web-api:flakyTest UP-TO-DATE
> :geode-web-api:integrationTest UP-TO-DATE
> :combineReports
> All test reports at <https://builds.apache.org/job/Geode-release/ws/build/reports/combined>
> :extensions/geode-modules:precheckin
> :extensions/geode-modules-assembly:precheckin
> :extensions/geode-modules-hibernate:precheckin
> :extensions/geode-modules-session:precheckin
> :extensions/geode-modules-session-internal:precheckin
> :extensions/geode-modules-tomcat7:precheckin
> :geode-assembly:precheckin
> :geode-common:precheckin
> :geode-cq:precheckin
> :geode-json:precheckin
> :geode-junit:precheckin
> :geode-lucene:precheckin
> :geode-pulse:precheckin
> :geode-rebalancer:precheckin
> :geode-wan:precheckin
> :geode-web:precheckin
> :geode-web-api:precheckin
>
> FAILURE: Build failed with an exception.
>
> * What went wrong:
> Execution failed for task ':geode-core:distributedTest'.
>> There were failing tests. See the report at: file://<https://builds.apache.org/job/Geode-release/ws/geode-core/build/reports/distributedTest/index.html>
> * Try:
> Run with --stacktrace option to get the stack trace. Run with --info or --debug option to get more log output.
>
> BUILD FAILED
>
> Total time: 11 hrs 26 mins 8.356 secs
> Build step 'Invoke Gradle script' changed build result to FAILURE
> Build step 'Invoke Gradle script' marked build as failure
> Archiving artifacts
> Compressed 250.96 MB of artifacts by 13.1% relative to #7
> Recording test results
Build failed in Jenkins: Geode-release #14
Posted by Apache Jenkins Server <je...@builds.apache.org>.
See <https://builds.apache.org/job/Geode-release/14/>
------------------------------------------
[...truncated 697 lines...]
java.lang.AssertionError: Suspicious strings were written to the log during this run.
Fix the strings or use IgnoredException.addIgnoredException to ignore.
-----------------------------------------------------------------------
Found suspect string in log4j at line 257
[error 2016/07/17 21:46:41.931 UTC <RMI TCP Connection(1)-67.195.81.144> tid=0x1b] Jmx manager could not be started because java.rmi.server.ExportException: Port already in use: 24744; nested exception is:
java.net.BindException: Failed to create server socket on asf900.gq1.ygridcore.net/67.195.81.144[24,744]
com.gemstone.gemfire.management.ManagementException: java.rmi.server.ExportException: Port already in use: 24744; nested exception is:
java.net.BindException: Failed to create server socket on asf900.gq1.ygridcore.net/67.195.81.144[24,744]
at com.gemstone.gemfire.management.internal.ManagementAgent.startAgent(ManagementAgent.java:147)
at com.gemstone.gemfire.management.internal.SystemManagementService.startManager(SystemManagementService.java:479)
at com.gemstone.gemfire.management.internal.beans.ManagementAdapter.handleCacheCreation(ManagementAdapter.java:197)
at com.gemstone.gemfire.management.internal.beans.ManagementListener.handleEvent(ManagementListener.java:119)
at com.gemstone.gemfire.distributed.internal.InternalDistributedSystem.notifyResourceEventListeners(InternalDistributedSystem.java:2085)
at com.gemstone.gemfire.distributed.internal.InternalDistributedSystem.handleResourceEvent(InternalDistributedSystem.java:478)
at com.gemstone.gemfire.internal.cache.GemFireCacheImpl.initialize(GemFireCacheImpl.java:1054)
at com.gemstone.gemfire.internal.cache.GemFireCacheImpl.basicCreate(GemFireCacheImpl.java:707)
at com.gemstone.gemfire.internal.cache.GemFireCacheImpl.create(GemFireCacheImpl.java:695)
at com.gemstone.gemfire.cache.CacheFactory.create(CacheFactory.java:181)
at com.gemstone.gemfire.cache.CacheFactory.create(CacheFactory.java:172)
at com.gemstone.gemfire.test.dunit.cache.internal.JUnit4CacheTestCase.createCache(JUnit4CacheTestCase.java:120)
at com.gemstone.gemfire.test.dunit.cache.internal.JUnit4CacheTestCase.getCache(JUnit4CacheTestCase.java:263)
at com.gemstone.gemfire.test.dunit.cache.internal.JUnit4CacheTestCase.getCache(JUnit4CacheTestCase.java:242)
at com.gemstone.gemfire.test.dunit.cache.internal.JUnit4CacheTestCase.getCache(JUnit4CacheTestCase.java:234)
at com.gemstone.gemfire.management.internal.cli.commands.CliCommandTestBase.lambda$setUpJMXManagerOnVM$d0384528$1(CliCommandTestBase.java:154)
at com.gemstone.gemfire.test.dunit.NamedCallable.call(NamedCallable.java:33)
at sun.reflect.GeneratedMethodAccessor338.invoke(Unknown Source)
at sun.reflect.DelegatingMethodAccessorImpl.invoke(DelegatingMethodAccessorImpl.java:43)
at java.lang.reflect.Method.invoke(Method.java:498)
at hydra.MethExecutor.executeObject(MethExecutor.java:268)
at com.gemstone.gemfire.test.dunit.standalone.RemoteDUnitVM.executeMethodOnObject(RemoteDUnitVM.java:82)
at sun.reflect.GeneratedMethodAccessor3.invoke(Unknown Source)
at sun.reflect.DelegatingMethodAccessorImpl.invoke(DelegatingMethodAccessorImpl.java:43)
at java.lang.reflect.Method.invoke(Method.java:498)
at sun.rmi.server.UnicastServerRef.dispatch(UnicastServerRef.java:323)
at sun.rmi.transport.Transport$1.run(Transport.java:200)
at sun.rmi.transport.Transport$1.run(Transport.java:197)
at java.security.AccessController.doPrivileged(Native Method)
at sun.rmi.transport.Transport.serviceCall(Transport.java:196)
at sun.rmi.transport.tcp.TCPTransport.handleMessages(TCPTransport.java:568)
at sun.rmi.transport.tcp.TCPTransport$ConnectionHandler.run0(TCPTransport.java:826)
at sun.rmi.transport.tcp.TCPTransport$ConnectionHandler.lambda$run$0(TCPTransport.java:683)
at java.security.AccessController.doPrivileged(Native Method)
at sun.rmi.transport.tcp.TCPTransport$ConnectionHandler.run(TCPTransport.java:682)
at java.util.concurrent.ThreadPoolExecutor.runWorker(ThreadPoolExecutor.java:1142)
at java.util.concurrent.ThreadPoolExecutor$Worker.run(ThreadPoolExecutor.java:617)
at java.lang.Thread.run(Thread.java:745)
Caused by: java.rmi.server.ExportException: Port already in use: 24744; nested exception is:
java.net.BindException: Failed to create server socket on asf900.gq1.ygridcore.net/67.195.81.144[24,744]
at sun.rmi.transport.tcp.TCPTransport.listen(TCPTransport.java:341)
at sun.rmi.transport.tcp.TCPTransport.exportObject(TCPTransport.java:249)
at sun.rmi.transport.tcp.TCPEndpoint.exportObject(TCPEndpoint.java:411)
at sun.rmi.transport.LiveRef.exportObject(LiveRef.java:147)
at sun.rmi.server.UnicastServerRef.exportObject(UnicastServerRef.java:208)
at sun.rmi.registry.RegistryImpl.setup(RegistryImpl.java:152)
at sun.rmi.registry.RegistryImpl.<init>(RegistryImpl.java:112)
at java.rmi.registry.LocateRegistry.createRegistry(LocateRegistry.java:239)
at com.gemstone.gemfire.management.internal.ManagementAgent.configureAndStart(ManagementAgent.java:389)
at com.gemstone.gemfire.management.internal.ManagementAgent.startAgent(ManagementAgent.java:145)
... 37 more
Caused by: java.net.BindException: Failed to create server socket on asf900.gq1.ygridcore.net/67.195.81.144[24,744]
at com.gemstone.gemfire.internal.SocketCreator.createServerSocket(SocketCreator.java:814)
at com.gemstone.gemfire.internal.SocketCreator.createServerSocket(SocketCreator.java:768)
at com.gemstone.gemfire.management.internal.ManagementAgent$GemFireRMIServerSocketFactory.createServerSocket(ManagementAgent.java:545)
at sun.rmi.transport.tcp.TCPEndpoint.newServerSocket(TCPEndpoint.java:666)
at sun.rmi.transport.tcp.TCPTransport.listen(TCPTransport.java:330)
... 46 more
Caused by: java.net.BindException: Address already in use
at java.net.PlainSocketImpl.socketBind(Native Method)
at java.net.AbstractPlainSocketImpl.bind(AbstractPlainSocketImpl.java:387)
at java.net.ServerSocket.bind(ServerSocket.java:375)
at com.gemstone.gemfire.internal.SocketCreator.createServerSocket(SocketCreator.java:811)
... 50 more
-----------------------------------------------------------------------
Found suspect string in log4j at line 326
[error 2016/07/17 21:46:41.938 UTC <RMI TCP Connection(1)-67.195.81.144> tid=0x1b] com.gemstone.gemfire.management.ManagementException: java.rmi.server.ExportException: Port already in use: 24744; nested exception is:
java.net.BindException: Failed to create server socket on asf900.gq1.ygridcore.net/67.195.81.144[24,744]
7378 tests completed, 2 failed, 555 skipped
:geode-core:distributedTest FAILED
:geode-core:flakyTest
:geode-core:integrationTest
:geode-cq:assemble
:geode-cq:compileTestJavaNote: Some input files use or override a deprecated API.
Note: Recompile with -Xlint:deprecation for details.
Note: Some input files use unchecked or unsafe operations.
Note: Recompile with -Xlint:unchecked for details.
:geode-cq:processTestResources
:geode-cq:testClasses
:geode-cq:checkMissedTests
:geode-cq:test
:geode-cq:check
:geode-cq:build
:geode-cq:distributedTest
:geode-cq:flakyTest
:geode-cq:integrationTest
:geode-json:assemble
:geode-json:compileTestJava UP-TO-DATE
:geode-json:processTestResources UP-TO-DATE
:geode-json:testClasses UP-TO-DATE
:geode-json:checkMissedTests UP-TO-DATE
:geode-json:test UP-TO-DATE
:geode-json:check
:geode-json:build
:geode-json:distributedTest UP-TO-DATE
:geode-json:flakyTest UP-TO-DATE
:geode-json:integrationTest UP-TO-DATE
:geode-junit:javadoc
:geode-junit:javadocJar
:geode-junit:sourcesJar
:geode-junit:signArchives SKIPPED
:geode-junit:assemble
:geode-junit:compileTestJava
:geode-junit:processTestResources UP-TO-DATE
:geode-junit:testClasses
:geode-junit:checkMissedTests
:geode-junit:test
:geode-junit:check
:geode-junit:build
:geode-junit:distributedTest
:geode-junit:flakyTest
:geode-junit:integrationTest
:geode-lucene:assemble
:geode-lucene:compileTestJavaNote: Some input files use or override a deprecated API.
Note: Recompile with -Xlint:deprecation for details.
Note: Some input files use unchecked or unsafe operations.
Note: Recompile with -Xlint:unchecked for details.
:geode-lucene:processTestResources
:geode-lucene:testClasses
:geode-lucene:checkMissedTests
:geode-lucene:test
:geode-lucene:check
:geode-lucene:build
:geode-lucene:distributedTest
:geode-lucene:flakyTest
:geode-lucene:integrationTest
:geode-pulse:assemble
:geode-pulse:compileTestJavaNote: <https://builds.apache.org/job/Geode-release/ws/geode-pulse/src/test/java/com/vmware/gemfire/tools/pulse/tests/PulseAbstractTest.java> uses or overrides a deprecated API.
Note: Recompile with -Xlint:deprecation for details.
Note: Some input files use unchecked or unsafe operations.
Note: Recompile with -Xlint:unchecked for details.
:geode-pulse:processTestResources
:geode-pulse:testClasses
:geode-pulse:checkMissedTests
:geode-pulse:test
:geode-pulse:check
:geode-pulse:build
:geode-pulse:distributedTest
:geode-pulse:flakyTest
:geode-pulse:integrationTest
:geode-rebalancer:jar
:geode-rebalancer:javadoc
:geode-rebalancer:javadocJar
:geode-rebalancer:sourcesJar
:geode-rebalancer:signArchives SKIPPED
:geode-rebalancer:assemble
:geode-rebalancer:compileTestJava
:geode-rebalancer:processTestResources UP-TO-DATE
:geode-rebalancer:testClasses
:geode-rebalancer:checkMissedTests
:geode-rebalancer:test
:geode-rebalancer:check
:geode-rebalancer:build
:geode-rebalancer:distributedTest
:geode-rebalancer:flakyTest
:geode-rebalancer:integrationTest
:geode-wan:assemble
:geode-wan:compileTestJavaNote: Some input files use or override a deprecated API.
Note: Recompile with -Xlint:deprecation for details.
Note: Some input files use unchecked or unsafe operations.
Note: Recompile with -Xlint:unchecked for details.
:geode-wan:processTestResources
:geode-wan:testClasses
:geode-wan:checkMissedTests
:geode-wan:test
:geode-wan:check
:geode-wan:build
:geode-wan:distributedTest
:geode-wan:flakyTest
:geode-wan:integrationTest
:geode-web:assemble
:geode-web:compileTestJavaNote: <https://builds.apache.org/job/Geode-release/ws/geode-web/src/test/java/com/gemstone/gemfire/management/internal/cli/commands/DataCommandsOverHttpDistributedTest.java> uses or overrides a deprecated API.
Note: Recompile with -Xlint:deprecation for details.
Note: Some input files use unchecked or unsafe operations.
Note: Recompile with -Xlint:unchecked for details.
:geode-web:processTestResources UP-TO-DATE
:geode-web:testClasses
:geode-web:checkMissedTests
:geode-web:test
:geode-web:check
:geode-web:build
:geode-web:distributedTest
:geode-web:flakyTest
:geode-web:integrationTest
:geode-web-api:assemble
:geode-web-api:compileTestJava UP-TO-DATE
:geode-web-api:processTestResources UP-TO-DATE
:geode-web-api:testClasses UP-TO-DATE
:geode-web-api:checkMissedTests UP-TO-DATE
:geode-web-api:test UP-TO-DATE
:geode-web-api:check
:geode-web-api:build
:geode-web-api:distributedTest UP-TO-DATE
:geode-web-api:flakyTest UP-TO-DATE
:geode-web-api:integrationTest UP-TO-DATE
:combineReports
All test reports at <https://builds.apache.org/job/Geode-release/ws/build/reports/combined>
:extensions/geode-modules:precheckin
:extensions/geode-modules-assembly:precheckin
:extensions/geode-modules-hibernate:precheckin
:extensions/geode-modules-session:precheckin
:extensions/geode-modules-session-internal:precheckin
:extensions/geode-modules-tomcat7:precheckin
:geode-assembly:precheckin
:geode-common:precheckin
:geode-cq:precheckin
:geode-json:precheckin
:geode-junit:precheckin
:geode-lucene:precheckin
:geode-pulse:precheckin
:geode-rebalancer:precheckin
:geode-wan:precheckin
:geode-web:precheckin
:geode-web-api:precheckin
FAILURE: Build failed with an exception.
* What went wrong:
Execution failed for task ':geode-core:distributedTest'.
> There were failing tests. See the report at: file://<https://builds.apache.org/job/Geode-release/ws/geode-core/build/reports/distributedTest/index.html>
* Try:
Run with --stacktrace option to get the stack trace. Run with --info or --debug option to get more log output.
BUILD FAILED
Total time: 11 hrs 26 mins 8.356 secs
Build step 'Invoke Gradle script' changed build result to FAILURE
Build step 'Invoke Gradle script' marked build as failure
Archiving artifacts
Compressed 250.96 MB of artifacts by 13.1% relative to #7
Recording test results
Build failed in Jenkins: Geode-release #13
Posted by Apache Jenkins Server <je...@builds.apache.org>.
See <https://builds.apache.org/job/Geode-release/13/>
------------------------------------------
[...truncated 593 lines...]
:geode-wan:javadocJar
:geode-wan:sourcesJar
:geode-wan:signArchives SKIPPED
:geode-web:javadoc UP-TO-DATE
:geode-web:javadocJar
:geode-web:sourcesJar
:geode-web:war
:geode-web:signArchives SKIPPED
:geode-web-api:jar
:geode-web-api:javadoc
:geode-web-api:javadocJar
:geode-web-api:sourcesJar
:geode-web-api:war
:geode-web-api:signArchives SKIPPED
:geode-assembly:distTar
:geode-assembly:distZip
:geode-assembly:writeBuildInfo
:geode-assembly:srcDistTar
:geode-assembly:srcDistZip
:geode-assembly:signArchives SKIPPED
:geode-assembly:assemble
:geode-assembly:compileTestJavaNote: Some input files use or override a deprecated API.
Note: Recompile with -Xlint:deprecation for details.
Note: Some input files use unchecked or unsafe operations.
Note: Recompile with -Xlint:unchecked for details.
:geode-assembly:processTestResources
:geode-assembly:testClasses
:geode-assembly:checkMissedTests
:geode-assembly:installDist
:geode-assembly:test
:geode-assembly:check
:geode-assembly:build
:geode-assembly:distributedTest
:geode-assembly:flakyTest
:geode-assembly:integrationTest
:geode-common:assemble
:geode-common:compileTestJava
:geode-common:processTestResources UP-TO-DATE
:geode-common:testClasses
:geode-common:checkMissedTests
:geode-common:test
:geode-common:check
:geode-common:build
:geode-common:distributedTest
:geode-common:flakyTest
:geode-common:integrationTest
:geode-core:assemble
:geode-core:checkMissedTests
:geode-core:test
:geode-core:check
:geode-core:build
:geode-core:distributedTest
com.gemstone.gemfire.distributed.internal.ConsoleDistributionManagerDUnitTest > testApplications FAILED
com.gemstone.gemfire.cache.CacheClosedException: Could not PDX serialize because the cache was closed
at com.gemstone.gemfire.pdx.internal.TypeRegistry.getPdxSerializer(TypeRegistry.java:325)
at com.gemstone.gemfire.internal.InternalDataSerializer.writeUserObject(InternalDataSerializer.java:1482)
at com.gemstone.gemfire.internal.InternalDataSerializer.writeWellKnownObject(InternalDataSerializer.java:1380)
at com.gemstone.gemfire.internal.InternalDataSerializer.basicWriteObject(InternalDataSerializer.java:2136)
at com.gemstone.gemfire.DataSerializer.writeObject(DataSerializer.java:3240)
at com.gemstone.gemfire.internal.admin.remote.DestroyRegionMessage.toData(DestroyRegionMessage.java:82)
at com.gemstone.gemfire.internal.InternalDataSerializer.invokeToData(InternalDataSerializer.java:2349)
at com.gemstone.gemfire.internal.InternalDataSerializer.writeDSFID(InternalDataSerializer.java:1342)
at com.gemstone.gemfire.internal.tcp.MsgStreamer.writeMessage(MsgStreamer.java:243)
at com.gemstone.gemfire.distributed.internal.direct.DirectChannel.sendToMany(DirectChannel.java:389)
at com.gemstone.gemfire.distributed.internal.direct.DirectChannel.sendToOne(DirectChannel.java:241)
at com.gemstone.gemfire.distributed.internal.direct.DirectChannel.send(DirectChannel.java:618)
at com.gemstone.gemfire.distributed.internal.membership.gms.mgr.GMSMembershipManager.directChannelSend(GMSMembershipManager.java:1703)
at com.gemstone.gemfire.distributed.internal.membership.gms.mgr.GMSMembershipManager.send(GMSMembershipManager.java:1897)
at com.gemstone.gemfire.distributed.internal.DistributionChannel.send(DistributionChannel.java:88)
at com.gemstone.gemfire.distributed.internal.DistributionManager.sendOutgoing(DistributionManager.java:3427)
at com.gemstone.gemfire.distributed.internal.DistributionManager.sendMessage(DistributionManager.java:3468)
at com.gemstone.gemfire.distributed.internal.DistributionManager.putOutgoing(DistributionManager.java:1828)
at com.gemstone.gemfire.internal.admin.remote.RemoteGfManagerAgent.sendAsync(RemoteGfManagerAgent.java:551)
at com.gemstone.gemfire.internal.admin.remote.RemoteGemFireVM.sendAsync(RemoteGemFireVM.java:950)
at com.gemstone.gemfire.internal.admin.remote.AdminRegion.sendAsync(AdminRegion.java:451)
at com.gemstone.gemfire.internal.admin.remote.AdminRegion.destroyRegion(AdminRegion.java:128)
at com.gemstone.gemfire.distributed.internal.ConsoleDistributionManagerDUnitTest.testApplications(ConsoleDistributionManagerDUnitTest.java:308)
7378 tests completed, 1 failed, 555 skipped
:geode-core:distributedTest FAILED
:geode-core:flakyTest
:geode-core:integrationTest
:geode-cq:assemble
:geode-cq:compileTestJavaNote: Some input files use or override a deprecated API.
Note: Recompile with -Xlint:deprecation for details.
Note: Some input files use unchecked or unsafe operations.
Note: Recompile with -Xlint:unchecked for details.
:geode-cq:processTestResources
:geode-cq:testClasses
:geode-cq:checkMissedTests
:geode-cq:test
:geode-cq:check
:geode-cq:build
:geode-cq:distributedTest
:geode-cq:flakyTest
:geode-cq:integrationTest
:geode-json:assemble
:geode-json:compileTestJava UP-TO-DATE
:geode-json:processTestResources UP-TO-DATE
:geode-json:testClasses UP-TO-DATE
:geode-json:checkMissedTests UP-TO-DATE
:geode-json:test UP-TO-DATE
:geode-json:check
:geode-json:build
:geode-json:distributedTest UP-TO-DATE
:geode-json:flakyTest UP-TO-DATE
:geode-json:integrationTest UP-TO-DATE
:geode-junit:javadoc
:geode-junit:javadocJar
:geode-junit:sourcesJar
:geode-junit:signArchives SKIPPED
:geode-junit:assemble
:geode-junit:compileTestJava
:geode-junit:processTestResources UP-TO-DATE
:geode-junit:testClasses
:geode-junit:checkMissedTests
:geode-junit:test
:geode-junit:check
:geode-junit:build
:geode-junit:distributedTest
:geode-junit:flakyTest
:geode-junit:integrationTest
:geode-lucene:assemble
:geode-lucene:compileTestJavaNote: Some input files use or override a deprecated API.
Note: Recompile with -Xlint:deprecation for details.
Note: Some input files use unchecked or unsafe operations.
Note: Recompile with -Xlint:unchecked for details.
:geode-lucene:processTestResources
:geode-lucene:testClasses
:geode-lucene:checkMissedTests
:geode-lucene:test
:geode-lucene:check
:geode-lucene:build
:geode-lucene:distributedTest
:geode-lucene:flakyTest
:geode-lucene:integrationTest
:geode-pulse:assemble
:geode-pulse:compileTestJavaNote: <https://builds.apache.org/job/Geode-release/ws/geode-pulse/src/test/java/com/vmware/gemfire/tools/pulse/tests/PulseAbstractTest.java> uses or overrides a deprecated API.
Note: Recompile with -Xlint:deprecation for details.
Note: Some input files use unchecked or unsafe operations.
Note: Recompile with -Xlint:unchecked for details.
:geode-pulse:processTestResources
:geode-pulse:testClasses
:geode-pulse:checkMissedTests
:geode-pulse:test
:geode-pulse:check
:geode-pulse:build
:geode-pulse:distributedTest
:geode-pulse:flakyTest
:geode-pulse:integrationTest
:geode-rebalancer:jar
:geode-rebalancer:javadoc
:geode-rebalancer:javadocJar
:geode-rebalancer:sourcesJar
:geode-rebalancer:signArchives SKIPPED
:geode-rebalancer:assemble
:geode-rebalancer:compileTestJava
:geode-rebalancer:processTestResources UP-TO-DATE
:geode-rebalancer:testClasses
:geode-rebalancer:checkMissedTests
:geode-rebalancer:test
:geode-rebalancer:check
:geode-rebalancer:build
:geode-rebalancer:distributedTest
:geode-rebalancer:flakyTest
:geode-rebalancer:integrationTest
:geode-wan:assemble
:geode-wan:compileTestJavaNote: Some input files use or override a deprecated API.
Note: Recompile with -Xlint:deprecation for details.
Note: Some input files use unchecked or unsafe operations.
Note: Recompile with -Xlint:unchecked for details.
:geode-wan:processTestResources
:geode-wan:testClasses
:geode-wan:checkMissedTests
:geode-wan:test
:geode-wan:check
:geode-wan:build
:geode-wan:distributedTest
:geode-wan:flakyTest
:geode-wan:integrationTest
:geode-web:assemble
:geode-web:compileTestJavaNote: <https://builds.apache.org/job/Geode-release/ws/geode-web/src/test/java/com/gemstone/gemfire/management/internal/cli/commands/DataCommandsOverHttpDistributedTest.java> uses or overrides a deprecated API.
Note: Recompile with -Xlint:deprecation for details.
Note: Some input files use unchecked or unsafe operations.
Note: Recompile with -Xlint:unchecked for details.
:geode-web:processTestResources UP-TO-DATE
:geode-web:testClasses
:geode-web:checkMissedTests
:geode-web:test
:geode-web:check
:geode-web:build
:geode-web:distributedTest
:geode-web:flakyTest
:geode-web:integrationTest
:geode-web-api:assemble
:geode-web-api:compileTestJava UP-TO-DATE
:geode-web-api:processTestResources UP-TO-DATE
:geode-web-api:testClasses UP-TO-DATE
:geode-web-api:checkMissedTests UP-TO-DATE
:geode-web-api:test UP-TO-DATE
:geode-web-api:check
:geode-web-api:build
:geode-web-api:distributedTest UP-TO-DATE
:geode-web-api:flakyTest UP-TO-DATE
:geode-web-api:integrationTest UP-TO-DATE
:combineReports
All test reports at <https://builds.apache.org/job/Geode-release/ws/build/reports/combined>
:extensions/geode-modules:precheckin
:extensions/geode-modules-assembly:precheckin
:extensions/geode-modules-hibernate:precheckin
:extensions/geode-modules-session:precheckin
:extensions/geode-modules-session-internal:precheckin
:extensions/geode-modules-tomcat7:precheckin
:geode-assembly:precheckin
:geode-common:precheckin
:geode-cq:precheckin
:geode-json:precheckin
:geode-junit:precheckin
:geode-lucene:precheckin
:geode-pulse:precheckin
:geode-rebalancer:precheckin
:geode-wan:precheckin
:geode-web:precheckin
:geode-web-api:precheckin
FAILURE: Build failed with an exception.
* What went wrong:
Execution failed for task ':geode-core:distributedTest'.
> There were failing tests. See the report at: file://<https://builds.apache.org/job/Geode-release/ws/geode-core/build/reports/distributedTest/index.html>
* Try:
Run with --stacktrace option to get the stack trace. Run with --info or --debug option to get more log output.
BUILD FAILED
Total time: 11 hrs 21 mins 13.486 secs
Build step 'Invoke Gradle script' changed build result to FAILURE
Build step 'Invoke Gradle script' marked build as failure
Archiving artifacts
Compressed 250.96 MB of artifacts by 13.1% relative to #7
Recording test results
Build failed in Jenkins: Geode-release #12
Posted by Apache Jenkins Server <je...@builds.apache.org>.
See <https://builds.apache.org/job/Geode-release/12/changes>
Changes:
[abaker] GEODE-1668: Revert change to not exclude gradle-wrapper.properties
------------------------------------------
[...truncated 593 lines...]
:geode-wan:javadocJar
:geode-wan:sourcesJar
:geode-wan:signArchives SKIPPED
:geode-web:javadoc UP-TO-DATE
:geode-web:javadocJar
:geode-web:sourcesJar
:geode-web:war
:geode-web:signArchives SKIPPED
:geode-web-api:jar
:geode-web-api:javadoc
:geode-web-api:javadocJar
:geode-web-api:sourcesJar
:geode-web-api:war
:geode-web-api:signArchives SKIPPED
:geode-assembly:distTar
:geode-assembly:distZip
:geode-assembly:writeBuildInfo
:geode-assembly:srcDistTar
:geode-assembly:srcDistZip
:geode-assembly:signArchives SKIPPED
:geode-assembly:assemble
:geode-assembly:compileTestJavaNote: Some input files use or override a deprecated API.
Note: Recompile with -Xlint:deprecation for details.
Note: Some input files use unchecked or unsafe operations.
Note: Recompile with -Xlint:unchecked for details.
:geode-assembly:processTestResources
:geode-assembly:testClasses
:geode-assembly:checkMissedTests
:geode-assembly:installDist
:geode-assembly:test
:geode-assembly:check
:geode-assembly:build
:geode-assembly:distributedTest
:geode-assembly:flakyTest
:geode-assembly:integrationTest
:geode-common:assemble
:geode-common:compileTestJava
:geode-common:processTestResources UP-TO-DATE
:geode-common:testClasses
:geode-common:checkMissedTests
:geode-common:test
:geode-common:check
:geode-common:build
:geode-common:distributedTest
:geode-common:flakyTest
:geode-common:integrationTest
:geode-core:assemble
:geode-core:checkMissedTests
:geode-core:test
:geode-core:check
:geode-core:build
:geode-core:distributedTest
com.gemstone.gemfire.distributed.internal.ConsoleDistributionManagerDUnitTest > testApplications FAILED
com.gemstone.gemfire.cache.CacheClosedException: Could not PDX serialize because the cache was closed
at com.gemstone.gemfire.pdx.internal.TypeRegistry.getPdxSerializer(TypeRegistry.java:325)
at com.gemstone.gemfire.internal.InternalDataSerializer.writeUserObject(InternalDataSerializer.java:1482)
at com.gemstone.gemfire.internal.InternalDataSerializer.writeWellKnownObject(InternalDataSerializer.java:1380)
at com.gemstone.gemfire.internal.InternalDataSerializer.basicWriteObject(InternalDataSerializer.java:2136)
at com.gemstone.gemfire.DataSerializer.writeObject(DataSerializer.java:3240)
at com.gemstone.gemfire.internal.admin.remote.DestroyRegionMessage.toData(DestroyRegionMessage.java:82)
at com.gemstone.gemfire.internal.InternalDataSerializer.invokeToData(InternalDataSerializer.java:2349)
at com.gemstone.gemfire.internal.InternalDataSerializer.writeDSFID(InternalDataSerializer.java:1342)
at com.gemstone.gemfire.internal.tcp.MsgStreamer.writeMessage(MsgStreamer.java:243)
at com.gemstone.gemfire.distributed.internal.direct.DirectChannel.sendToMany(DirectChannel.java:389)
at com.gemstone.gemfire.distributed.internal.direct.DirectChannel.sendToOne(DirectChannel.java:241)
at com.gemstone.gemfire.distributed.internal.direct.DirectChannel.send(DirectChannel.java:618)
at com.gemstone.gemfire.distributed.internal.membership.gms.mgr.GMSMembershipManager.directChannelSend(GMSMembershipManager.java:1703)
at com.gemstone.gemfire.distributed.internal.membership.gms.mgr.GMSMembershipManager.send(GMSMembershipManager.java:1897)
at com.gemstone.gemfire.distributed.internal.DistributionChannel.send(DistributionChannel.java:88)
at com.gemstone.gemfire.distributed.internal.DistributionManager.sendOutgoing(DistributionManager.java:3427)
at com.gemstone.gemfire.distributed.internal.DistributionManager.sendMessage(DistributionManager.java:3468)
at com.gemstone.gemfire.distributed.internal.DistributionManager.putOutgoing(DistributionManager.java:1828)
at com.gemstone.gemfire.internal.admin.remote.RemoteGfManagerAgent.sendAsync(RemoteGfManagerAgent.java:551)
at com.gemstone.gemfire.internal.admin.remote.RemoteGemFireVM.sendAsync(RemoteGemFireVM.java:950)
at com.gemstone.gemfire.internal.admin.remote.AdminRegion.sendAsync(AdminRegion.java:451)
at com.gemstone.gemfire.internal.admin.remote.AdminRegion.destroyRegion(AdminRegion.java:128)
at com.gemstone.gemfire.distributed.internal.ConsoleDistributionManagerDUnitTest.testApplications(ConsoleDistributionManagerDUnitTest.java:308)
7378 tests completed, 1 failed, 555 skipped
:geode-core:distributedTest FAILED
:geode-core:flakyTest
:geode-core:integrationTest
:geode-cq:assemble
:geode-cq:compileTestJavaNote: Some input files use or override a deprecated API.
Note: Recompile with -Xlint:deprecation for details.
Note: Some input files use unchecked or unsafe operations.
Note: Recompile with -Xlint:unchecked for details.
:geode-cq:processTestResources
:geode-cq:testClasses
:geode-cq:checkMissedTests
:geode-cq:test
:geode-cq:check
:geode-cq:build
:geode-cq:distributedTest
:geode-cq:flakyTest
:geode-cq:integrationTest
:geode-json:assemble
:geode-json:compileTestJava UP-TO-DATE
:geode-json:processTestResources UP-TO-DATE
:geode-json:testClasses UP-TO-DATE
:geode-json:checkMissedTests UP-TO-DATE
:geode-json:test UP-TO-DATE
:geode-json:check
:geode-json:build
:geode-json:distributedTest UP-TO-DATE
:geode-json:flakyTest UP-TO-DATE
:geode-json:integrationTest UP-TO-DATE
:geode-junit:javadoc
:geode-junit:javadocJar
:geode-junit:sourcesJar
:geode-junit:signArchives SKIPPED
:geode-junit:assemble
:geode-junit:compileTestJava
:geode-junit:processTestResources UP-TO-DATE
:geode-junit:testClasses
:geode-junit:checkMissedTests
:geode-junit:test
:geode-junit:check
:geode-junit:build
:geode-junit:distributedTest
:geode-junit:flakyTest
:geode-junit:integrationTest
:geode-lucene:assemble
:geode-lucene:compileTestJavaNote: Some input files use or override a deprecated API.
Note: Recompile with -Xlint:deprecation for details.
Note: Some input files use unchecked or unsafe operations.
Note: Recompile with -Xlint:unchecked for details.
:geode-lucene:processTestResources
:geode-lucene:testClasses
:geode-lucene:checkMissedTests
:geode-lucene:test
:geode-lucene:check
:geode-lucene:build
:geode-lucene:distributedTest
:geode-lucene:flakyTest
:geode-lucene:integrationTest
:geode-pulse:assemble
:geode-pulse:compileTestJavaNote: <https://builds.apache.org/job/Geode-release/ws/geode-pulse/src/test/java/com/vmware/gemfire/tools/pulse/tests/PulseAbstractTest.java> uses or overrides a deprecated API.
Note: Recompile with -Xlint:deprecation for details.
Note: Some input files use unchecked or unsafe operations.
Note: Recompile with -Xlint:unchecked for details.
:geode-pulse:processTestResources
:geode-pulse:testClasses
:geode-pulse:checkMissedTests
:geode-pulse:test
:geode-pulse:check
:geode-pulse:build
:geode-pulse:distributedTest
:geode-pulse:flakyTest
:geode-pulse:integrationTest
:geode-rebalancer:jar
:geode-rebalancer:javadoc
:geode-rebalancer:javadocJar
:geode-rebalancer:sourcesJar
:geode-rebalancer:signArchives SKIPPED
:geode-rebalancer:assemble
:geode-rebalancer:compileTestJava
:geode-rebalancer:processTestResources UP-TO-DATE
:geode-rebalancer:testClasses
:geode-rebalancer:checkMissedTests
:geode-rebalancer:test
:geode-rebalancer:check
:geode-rebalancer:build
:geode-rebalancer:distributedTest
:geode-rebalancer:flakyTest
:geode-rebalancer:integrationTest
:geode-wan:assemble
:geode-wan:compileTestJavaNote: Some input files use or override a deprecated API.
Note: Recompile with -Xlint:deprecation for details.
Note: Some input files use unchecked or unsafe operations.
Note: Recompile with -Xlint:unchecked for details.
:geode-wan:processTestResources
:geode-wan:testClasses
:geode-wan:checkMissedTests
:geode-wan:test
:geode-wan:check
:geode-wan:build
:geode-wan:distributedTest
:geode-wan:flakyTest
:geode-wan:integrationTest
:geode-web:assemble
:geode-web:compileTestJavaNote: <https://builds.apache.org/job/Geode-release/ws/geode-web/src/test/java/com/gemstone/gemfire/management/internal/cli/commands/DataCommandsOverHttpDistributedTest.java> uses or overrides a deprecated API.
Note: Recompile with -Xlint:deprecation for details.
Note: Some input files use unchecked or unsafe operations.
Note: Recompile with -Xlint:unchecked for details.
:geode-web:processTestResources UP-TO-DATE
:geode-web:testClasses
:geode-web:checkMissedTests
:geode-web:test
:geode-web:check
:geode-web:build
:geode-web:distributedTest
:geode-web:flakyTest
:geode-web:integrationTest
:geode-web-api:assemble
:geode-web-api:compileTestJava UP-TO-DATE
:geode-web-api:processTestResources UP-TO-DATE
:geode-web-api:testClasses UP-TO-DATE
:geode-web-api:checkMissedTests UP-TO-DATE
:geode-web-api:test UP-TO-DATE
:geode-web-api:check
:geode-web-api:build
:geode-web-api:distributedTest UP-TO-DATE
:geode-web-api:flakyTest UP-TO-DATE
:geode-web-api:integrationTest UP-TO-DATE
:combineReports
All test reports at <https://builds.apache.org/job/Geode-release/ws/build/reports/combined>
:extensions/geode-modules:precheckin
:extensions/geode-modules-assembly:precheckin
:extensions/geode-modules-hibernate:precheckin
:extensions/geode-modules-session:precheckin
:extensions/geode-modules-session-internal:precheckin
:extensions/geode-modules-tomcat7:precheckin
:geode-assembly:precheckin
:geode-common:precheckin
:geode-cq:precheckin
:geode-json:precheckin
:geode-junit:precheckin
:geode-lucene:precheckin
:geode-pulse:precheckin
:geode-rebalancer:precheckin
:geode-wan:precheckin
:geode-web:precheckin
:geode-web-api:precheckin
FAILURE: Build failed with an exception.
* What went wrong:
Execution failed for task ':geode-core:distributedTest'.
> There were failing tests. See the report at: file://<https://builds.apache.org/job/Geode-release/ws/geode-core/build/reports/distributedTest/index.html>
* Try:
Run with --stacktrace option to get the stack trace. Run with --info or --debug option to get more log output.
BUILD FAILED
Total time: 11 hrs 27 mins 22.356 secs
Build step 'Invoke Gradle script' changed build result to FAILURE
Build step 'Invoke Gradle script' marked build as failure
Archiving artifacts
Compressed 250.96 MB of artifacts by 13.1% relative to #7
Recording test results
Build failed in Jenkins: Geode-release #11
Posted by Apache Jenkins Server <je...@builds.apache.org>.
See <https://builds.apache.org/job/Geode-release/11/>
------------------------------------------
[...truncated 655 lines...]
at com.gemstone.gemfire.internal.InternalDataSerializer.writeDSFID(InternalDataSerializer.java:1342)
at com.gemstone.gemfire.internal.tcp.MsgStreamer.writeMessage(MsgStreamer.java:243)
at com.gemstone.gemfire.distributed.internal.direct.DirectChannel.sendToMany(DirectChannel.java:389)
at com.gemstone.gemfire.distributed.internal.direct.DirectChannel.sendToOne(DirectChannel.java:241)
at com.gemstone.gemfire.distributed.internal.direct.DirectChannel.send(DirectChannel.java:618)
at com.gemstone.gemfire.distributed.internal.membership.gms.mgr.GMSMembershipManager.directChannelSend(GMSMembershipManager.java:1703)
at com.gemstone.gemfire.distributed.internal.membership.gms.mgr.GMSMembershipManager.send(GMSMembershipManager.java:1897)
at com.gemstone.gemfire.distributed.internal.DistributionChannel.send(DistributionChannel.java:88)
at com.gemstone.gemfire.distributed.internal.DistributionManager.sendOutgoing(DistributionManager.java:3427)
at com.gemstone.gemfire.distributed.internal.DistributionManager.sendMessage(DistributionManager.java:3468)
at com.gemstone.gemfire.distributed.internal.DistributionManager.putOutgoing(DistributionManager.java:1828)
at com.gemstone.gemfire.internal.admin.remote.RemoteGfManagerAgent.sendAsync(RemoteGfManagerAgent.java:551)
at com.gemstone.gemfire.internal.admin.remote.RemoteGemFireVM.sendAsync(RemoteGemFireVM.java:950)
at com.gemstone.gemfire.internal.admin.remote.AdminRegion.sendAsync(AdminRegion.java:451)
at com.gemstone.gemfire.internal.admin.remote.AdminRegion.destroyRegion(AdminRegion.java:128)
at com.gemstone.gemfire.distributed.internal.ConsoleDistributionManagerDUnitTest.testApplications(ConsoleDistributionManagerDUnitTest.java:308)
7378 tests completed, 1 failed, 555 skipped
:geode-core:distributedTest FAILED
:geode-core:flakyTest
:geode-core:integrationTest
:geode-cq:assemble
:geode-cq:compileTestJavaNote: Some input files use or override a deprecated API.
Note: Recompile with -Xlint:deprecation for details.
Note: Some input files use unchecked or unsafe operations.
Note: Recompile with -Xlint:unchecked for details.
:geode-cq:processTestResources
:geode-cq:testClasses
:geode-cq:checkMissedTests
:geode-cq:test
:geode-cq:check
:geode-cq:build
:geode-cq:distributedTest
:geode-cq:flakyTest
:geode-cq:integrationTest
:geode-json:assemble
:geode-json:compileTestJava UP-TO-DATE
:geode-json:processTestResources UP-TO-DATE
:geode-json:testClasses UP-TO-DATE
:geode-json:checkMissedTests UP-TO-DATE
:geode-json:test UP-TO-DATE
:geode-json:check
:geode-json:build
:geode-json:distributedTest UP-TO-DATE
:geode-json:flakyTest UP-TO-DATE
:geode-json:integrationTest UP-TO-DATE
:geode-junit:javadoc
:geode-junit:javadocJar
:geode-junit:sourcesJar
:geode-junit:signArchives SKIPPED
:geode-junit:assemble
:geode-junit:compileTestJava
:geode-junit:processTestResources UP-TO-DATE
:geode-junit:testClasses
:geode-junit:checkMissedTests
:geode-junit:test
:geode-junit:check
:geode-junit:build
:geode-junit:distributedTest
:geode-junit:flakyTest
:geode-junit:integrationTest
:geode-lucene:assemble
:geode-lucene:compileTestJavaNote: Some input files use or override a deprecated API.
Note: Recompile with -Xlint:deprecation for details.
Note: Some input files use unchecked or unsafe operations.
Note: Recompile with -Xlint:unchecked for details.
:geode-lucene:processTestResources
:geode-lucene:testClasses
:geode-lucene:checkMissedTests
:geode-lucene:test
:geode-lucene:check
:geode-lucene:build
:geode-lucene:distributedTest
:geode-lucene:flakyTest
:geode-lucene:integrationTest
:geode-pulse:assemble
:geode-pulse:compileTestJavaNote: <https://builds.apache.org/job/Geode-release/ws/geode-pulse/src/test/java/com/vmware/gemfire/tools/pulse/tests/PulseAbstractTest.java> uses or overrides a deprecated API.
Note: Recompile with -Xlint:deprecation for details.
Note: Some input files use unchecked or unsafe operations.
Note: Recompile with -Xlint:unchecked for details.
:geode-pulse:processTestResources
:geode-pulse:testClasses
:geode-pulse:checkMissedTests
:geode-pulse:test
:geode-pulse:check
:geode-pulse:build
:geode-pulse:distributedTest
:geode-pulse:flakyTest
:geode-pulse:integrationTest
:geode-rebalancer:jar
:geode-rebalancer:javadoc
:geode-rebalancer:javadocJar
:geode-rebalancer:sourcesJar
:geode-rebalancer:signArchives SKIPPED
:geode-rebalancer:assemble
:geode-rebalancer:compileTestJava
:geode-rebalancer:processTestResources UP-TO-DATE
:geode-rebalancer:testClasses
:geode-rebalancer:checkMissedTests
:geode-rebalancer:test
:geode-rebalancer:check
:geode-rebalancer:build
:geode-rebalancer:distributedTest
:geode-rebalancer:flakyTest
:geode-rebalancer:integrationTest
:geode-wan:assemble
:geode-wan:compileTestJavaNote: Some input files use or override a deprecated API.
Note: Recompile with -Xlint:deprecation for details.
Note: Some input files use unchecked or unsafe operations.
Note: Recompile with -Xlint:unchecked for details.
:geode-wan:processTestResources
:geode-wan:testClasses
:geode-wan:checkMissedTests
:geode-wan:test
:geode-wan:check
:geode-wan:build
:geode-wan:distributedTest
com.gemstone.gemfire.internal.cache.wan.serial.SerialWANPropogationDUnitTest > testReplicatedSerialPropagationWithRemoteRegionDestroy2 FAILED
java.lang.AssertionError: Suspicious strings were written to the log during this run.
Fix the strings or use IgnoredException.addIgnoredException to ignore.
-----------------------------------------------------------------------
Found suspect string in log4j at line 19728
[error 2016/07/16 05:12:46.907 UTC <P2P message reader for asf900(19153)<ec><v1>:1029 shared ordered uid=420 port=41508> tid=0x1ade] Exception occurred in CacheListener
java.util.concurrent.RejectedExecutionException: Task com.gemstone.gemfire.internal.cache.wan.serial.SerialGatewaySenderEventProcessor$2@7ba5283d rejected from java.util.concurrent.ThreadPoolExecutor@879ab85[Terminated, pool size = 0, active threads = 0, queued tasks = 0, completed tasks = 3070]
at java.util.concurrent.ThreadPoolExecutor$AbortPolicy.rejectedExecution(ThreadPoolExecutor.java:2047)
at java.util.concurrent.ThreadPoolExecutor.reject(ThreadPoolExecutor.java:823)
at java.util.concurrent.ThreadPoolExecutor.execute(ThreadPoolExecutor.java:1369)
at com.gemstone.gemfire.internal.cache.wan.serial.SerialGatewaySenderEventProcessor.handlePrimaryDestroy(SerialGatewaySenderEventProcessor.java:587)
at com.gemstone.gemfire.internal.cache.wan.serial.SerialSecondaryGatewayListener.afterDestroy(SerialSecondaryGatewayListener.java:92)
at com.gemstone.gemfire.internal.cache.EnumListenerEvent$AFTER_DESTROY.dispatchEvent(EnumListenerEvent.java:162)
at com.gemstone.gemfire.internal.cache.LocalRegion.dispatchEvent(LocalRegion.java:8935)
at com.gemstone.gemfire.internal.cache.LocalRegion.dispatchListenerEvent(LocalRegion.java:7392)
at com.gemstone.gemfire.internal.cache.LocalRegion.invokeDestroyCallbacks(LocalRegion.java:7184)
at com.gemstone.gemfire.internal.cache.EntryEventImpl.invokeCallbacks(EntryEventImpl.java:2294)
at com.gemstone.gemfire.internal.cache.AbstractRegionEntry.dispatchListenerEvents(AbstractRegionEntry.java:144)
at com.gemstone.gemfire.internal.cache.LocalRegion.basicDestroyPart2(LocalRegion.java:7120)
at com.gemstone.gemfire.internal.cache.AbstractRegionMap.destroy(AbstractRegionMap.java:1355)
at com.gemstone.gemfire.internal.cache.LocalRegion.mapDestroy(LocalRegion.java:6907)
at com.gemstone.gemfire.internal.cache.LocalRegion.mapDestroy(LocalRegion.java:6879)
at com.gemstone.gemfire.internal.cache.LocalRegionDataView.destroyExistingEntry(LocalRegionDataView.java:55)
at com.gemstone.gemfire.internal.cache.LocalRegion.basicDestroy(LocalRegion.java:6844)
at com.gemstone.gemfire.internal.cache.DistributedRegion.basicDestroy(DistributedRegion.java:1737)
at com.gemstone.gemfire.internal.cache.wan.serial.SerialGatewaySenderQueue$SerialGatewaySenderQueueMetaRegion.basicDestroy(SerialGatewaySenderQueue.java:1257)
at com.gemstone.gemfire.internal.cache.LocalRegion.localDestroy(LocalRegion.java:2189)
at com.gemstone.gemfire.internal.cache.DistributedRegion.localDestroy(DistributedRegion.java:1054)
at com.gemstone.gemfire.internal.cache.wan.serial.BatchDestroyOperation$DestroyMessage.operateOnRegion(BatchDestroyOperation.java:132)
at com.gemstone.gemfire.internal.cache.DistributedCacheOperation$CacheOperationMessage.basicProcess(DistributedCacheOperation.java:1191)
at com.gemstone.gemfire.internal.cache.DistributedCacheOperation$CacheOperationMessage.process(DistributedCacheOperation.java:1092)
at com.gemstone.gemfire.distributed.internal.DistributionMessage.scheduleAction(DistributionMessage.java:379)
at com.gemstone.gemfire.distributed.internal.DistributionMessage.schedule(DistributionMessage.java:442)
at com.gemstone.gemfire.distributed.internal.DistributionManager.scheduleIncomingMessage(DistributionManager.java:3519)
at com.gemstone.gemfire.distributed.internal.DistributionManager.handleIncomingDMsg(DistributionManager.java:3142)
at com.gemstone.gemfire.distributed.internal.DistributionManager$MyListener.messageReceived(DistributionManager.java:4341)
at com.gemstone.gemfire.distributed.internal.membership.gms.mgr.GMSMembershipManager.dispatchMessage(GMSMembershipManager.java:1100)
at com.gemstone.gemfire.distributed.internal.membership.gms.mgr.GMSMembershipManager.handleOrDeferMessage(GMSMembershipManager.java:1028)
at com.gemstone.gemfire.distributed.internal.membership.gms.mgr.GMSMembershipManager$MyDCReceiver.messageReceived(GMSMembershipManager.java:382)
at com.gemstone.gemfire.distributed.internal.direct.DirectChannel.receive(DirectChannel.java:726)
at com.gemstone.gemfire.internal.tcp.TCPConduit.messageReceived(TCPConduit.java:815)
at com.gemstone.gemfire.internal.tcp.Connection.dispatchMessage(Connection.java:3961)
at com.gemstone.gemfire.internal.tcp.Connection.processNIOBuffer(Connection.java:3545)
at com.gemstone.gemfire.internal.tcp.Connection.runNioReader(Connection.java:1837)
at com.gemstone.gemfire.internal.tcp.Connection.run(Connection.java:1706)
at java.lang.Thread.run(Thread.java:745)
515 tests completed, 1 failed, 25 skipped
:geode-wan:distributedTest FAILED
:geode-wan:flakyTest
:geode-wan:integrationTest
:geode-web:assemble
:geode-web:compileTestJavaNote: <https://builds.apache.org/job/Geode-release/ws/geode-web/src/test/java/com/gemstone/gemfire/management/internal/cli/commands/DataCommandsOverHttpDistributedTest.java> uses or overrides a deprecated API.
Note: Recompile with -Xlint:deprecation for details.
Note: Some input files use unchecked or unsafe operations.
Note: Recompile with -Xlint:unchecked for details.
:geode-web:processTestResources UP-TO-DATE
:geode-web:testClasses
:geode-web:checkMissedTests
:geode-web:test
:geode-web:check
:geode-web:build
:geode-web:distributedTest
:geode-web:flakyTest
:geode-web:integrationTest
:geode-web-api:assemble
:geode-web-api:compileTestJava UP-TO-DATE
:geode-web-api:processTestResources UP-TO-DATE
:geode-web-api:testClasses UP-TO-DATE
:geode-web-api:checkMissedTests UP-TO-DATE
:geode-web-api:test UP-TO-DATE
:geode-web-api:check
:geode-web-api:build
:geode-web-api:distributedTest UP-TO-DATE
:geode-web-api:flakyTest UP-TO-DATE
:geode-web-api:integrationTest UP-TO-DATE
:combineReports
All test reports at <https://builds.apache.org/job/Geode-release/ws/build/reports/combined>
:extensions/geode-modules:precheckin
:extensions/geode-modules-assembly:precheckin
:extensions/geode-modules-hibernate:precheckin
:extensions/geode-modules-session:precheckin
:extensions/geode-modules-session-internal:precheckin
:extensions/geode-modules-tomcat7:precheckin
:geode-assembly:precheckin
:geode-common:precheckin
:geode-cq:precheckin
:geode-json:precheckin
:geode-junit:precheckin
:geode-lucene:precheckin
:geode-pulse:precheckin
:geode-rebalancer:precheckin
:geode-web:precheckin
:geode-web-api:precheckin
FAILURE: Build completed with 2 failures.
1: Task failed with an exception.
-----------
* What went wrong:
Execution failed for task ':geode-core:distributedTest'.
> There were failing tests. See the report at: file://<https://builds.apache.org/job/Geode-release/ws/geode-core/build/reports/distributedTest/index.html>
* Try:
Run with --stacktrace option to get the stack trace. Run with --info or --debug option to get more log output.
==============================================================================
2: Task failed with an exception.
-----------
* What went wrong:
Execution failed for task ':geode-wan:distributedTest'.
> There were failing tests. See the report at: file://<https://builds.apache.org/job/Geode-release/ws/geode-wan/build/reports/distributedTest/index.html>
* Try:
Run with --stacktrace option to get the stack trace. Run with --info or --debug option to get more log output.
==============================================================================
BUILD FAILED
Total time: 11 hrs 39 mins 5.993 secs
Build step 'Invoke Gradle script' changed build result to FAILURE
Build step 'Invoke Gradle script' marked build as failure
Archiving artifacts
Compressed 250.96 MB of artifacts by 13.1% relative to #7
Recording test results
Build failed in Jenkins: Geode-release #10
Posted by Apache Jenkins Server <je...@builds.apache.org>.
See <https://builds.apache.org/job/Geode-release/10/changes>
Changes:
[abaker] GEODE-1664: Update SLF4J version in LICENSE
[abaker] GEODE-1664: Add AOP Alliance to LICENSE
[abaker] GEODE-1664: Remove jopt-simple from src LICENSE
[abaker] GEODE-1665: Remove bundled jar from source distribution
------------------------------------------
[...truncated 592 lines...]
:geode-wan:javadocJar
:geode-wan:sourcesJar
:geode-wan:signArchives SKIPPED
:geode-web:javadoc UP-TO-DATE
:geode-web:javadocJar
:geode-web:sourcesJar
:geode-web:war
:geode-web:signArchives SKIPPED
:geode-web-api:jar
:geode-web-api:javadoc
:geode-web-api:javadocJar
:geode-web-api:sourcesJar
:geode-web-api:war
:geode-web-api:signArchives SKIPPED
:geode-assembly:distTar
:geode-assembly:distZip
:geode-assembly:writeBuildInfo
:geode-assembly:srcDistTar
:geode-assembly:srcDistZip
:geode-assembly:signArchives SKIPPED
:geode-assembly:assemble
:geode-assembly:compileTestJavaNote: Some input files use or override a deprecated API.
Note: Recompile with -Xlint:deprecation for details.
Note: Some input files use unchecked or unsafe operations.
Note: Recompile with -Xlint:unchecked for details.
:geode-assembly:processTestResources
:geode-assembly:testClasses
:geode-assembly:checkMissedTests
:geode-assembly:installDist
:geode-assembly:test
:geode-assembly:check
:geode-assembly:build
:geode-assembly:distributedTest
:geode-assembly:flakyTest
:geode-assembly:integrationTest
:geode-common:assemble
:geode-common:compileTestJava
:geode-common:processTestResources UP-TO-DATE
:geode-common:testClasses
:geode-common:checkMissedTests
:geode-common:test
:geode-common:check
:geode-common:build
:geode-common:distributedTest
:geode-common:flakyTest
:geode-common:integrationTest
:geode-core:assemble
:geode-core:checkMissedTests
:geode-core:test
:geode-core:check
:geode-core:build
:geode-core:distributedTest
com.gemstone.gemfire.distributed.internal.ConsoleDistributionManagerDUnitTest > testApplications FAILED
com.gemstone.gemfire.cache.CacheClosedException: Could not PDX serialize because the cache was closed
at com.gemstone.gemfire.pdx.internal.TypeRegistry.getPdxSerializer(TypeRegistry.java:325)
at com.gemstone.gemfire.internal.InternalDataSerializer.writeUserObject(InternalDataSerializer.java:1482)
at com.gemstone.gemfire.internal.InternalDataSerializer.writeWellKnownObject(InternalDataSerializer.java:1380)
at com.gemstone.gemfire.internal.InternalDataSerializer.basicWriteObject(InternalDataSerializer.java:2136)
at com.gemstone.gemfire.DataSerializer.writeObject(DataSerializer.java:3240)
at com.gemstone.gemfire.internal.admin.remote.DestroyRegionMessage.toData(DestroyRegionMessage.java:82)
at com.gemstone.gemfire.internal.InternalDataSerializer.invokeToData(InternalDataSerializer.java:2349)
at com.gemstone.gemfire.internal.InternalDataSerializer.writeDSFID(InternalDataSerializer.java:1342)
at com.gemstone.gemfire.internal.tcp.MsgStreamer.writeMessage(MsgStreamer.java:243)
at com.gemstone.gemfire.distributed.internal.direct.DirectChannel.sendToMany(DirectChannel.java:389)
at com.gemstone.gemfire.distributed.internal.direct.DirectChannel.sendToOne(DirectChannel.java:241)
at com.gemstone.gemfire.distributed.internal.direct.DirectChannel.send(DirectChannel.java:618)
at com.gemstone.gemfire.distributed.internal.membership.gms.mgr.GMSMembershipManager.directChannelSend(GMSMembershipManager.java:1703)
at com.gemstone.gemfire.distributed.internal.membership.gms.mgr.GMSMembershipManager.send(GMSMembershipManager.java:1897)
at com.gemstone.gemfire.distributed.internal.DistributionChannel.send(DistributionChannel.java:88)
at com.gemstone.gemfire.distributed.internal.DistributionManager.sendOutgoing(DistributionManager.java:3427)
at com.gemstone.gemfire.distributed.internal.DistributionManager.sendMessage(DistributionManager.java:3468)
at com.gemstone.gemfire.distributed.internal.DistributionManager.putOutgoing(DistributionManager.java:1828)
at com.gemstone.gemfire.internal.admin.remote.RemoteGfManagerAgent.sendAsync(RemoteGfManagerAgent.java:551)
at com.gemstone.gemfire.internal.admin.remote.RemoteGemFireVM.sendAsync(RemoteGemFireVM.java:950)
at com.gemstone.gemfire.internal.admin.remote.AdminRegion.sendAsync(AdminRegion.java:451)
at com.gemstone.gemfire.internal.admin.remote.AdminRegion.destroyRegion(AdminRegion.java:128)
at com.gemstone.gemfire.distributed.internal.ConsoleDistributionManagerDUnitTest.testApplications(ConsoleDistributionManagerDUnitTest.java:308)
7378 tests completed, 1 failed, 555 skipped
:geode-core:distributedTest FAILED
:geode-core:flakyTest
:geode-core:integrationTest
:geode-cq:assemble
:geode-cq:compileTestJavaNote: Some input files use or override a deprecated API.
Note: Recompile with -Xlint:deprecation for details.
Note: Some input files use unchecked or unsafe operations.
Note: Recompile with -Xlint:unchecked for details.
:geode-cq:processTestResources
:geode-cq:testClasses
:geode-cq:checkMissedTests
:geode-cq:test
:geode-cq:check
:geode-cq:build
:geode-cq:distributedTest
:geode-cq:flakyTest
:geode-cq:integrationTest
:geode-json:assemble
:geode-json:compileTestJava UP-TO-DATE
:geode-json:processTestResources UP-TO-DATE
:geode-json:testClasses UP-TO-DATE
:geode-json:checkMissedTests UP-TO-DATE
:geode-json:test UP-TO-DATE
:geode-json:check
:geode-json:build
:geode-json:distributedTest UP-TO-DATE
:geode-json:flakyTest UP-TO-DATE
:geode-json:integrationTest UP-TO-DATE
:geode-junit:javadoc
:geode-junit:javadocJar
:geode-junit:sourcesJar
:geode-junit:signArchives SKIPPED
:geode-junit:assemble
:geode-junit:compileTestJava
:geode-junit:processTestResources UP-TO-DATE
:geode-junit:testClasses
:geode-junit:checkMissedTests
:geode-junit:test
:geode-junit:check
:geode-junit:build
:geode-junit:distributedTest
:geode-junit:flakyTest
:geode-junit:integrationTest
:geode-lucene:assemble
:geode-lucene:compileTestJavaNote: Some input files use or override a deprecated API.
Note: Recompile with -Xlint:deprecation for details.
Note: Some input files use unchecked or unsafe operations.
Note: Recompile with -Xlint:unchecked for details.
:geode-lucene:processTestResources
:geode-lucene:testClasses
:geode-lucene:checkMissedTests
:geode-lucene:test
:geode-lucene:check
:geode-lucene:build
:geode-lucene:distributedTest
:geode-lucene:flakyTest
:geode-lucene:integrationTest
:geode-pulse:assemble
:geode-pulse:compileTestJavaNote: <https://builds.apache.org/job/Geode-release/ws/geode-pulse/src/test/java/com/vmware/gemfire/tools/pulse/tests/PulseAbstractTest.java> uses or overrides a deprecated API.
Note: Recompile with -Xlint:deprecation for details.
Note: Some input files use unchecked or unsafe operations.
Note: Recompile with -Xlint:unchecked for details.
:geode-pulse:processTestResources
:geode-pulse:testClasses
:geode-pulse:checkMissedTests
:geode-pulse:test
:geode-pulse:check
:geode-pulse:build
:geode-pulse:distributedTest
:geode-pulse:flakyTest
:geode-pulse:integrationTest
:geode-rebalancer:jar
:geode-rebalancer:javadoc
:geode-rebalancer:javadocJar
:geode-rebalancer:sourcesJar
:geode-rebalancer:signArchives SKIPPED
:geode-rebalancer:assemble
:geode-rebalancer:compileTestJava
:geode-rebalancer:processTestResources UP-TO-DATE
:geode-rebalancer:testClasses
:geode-rebalancer:checkMissedTests
:geode-rebalancer:test
:geode-rebalancer:check
:geode-rebalancer:build
:geode-rebalancer:distributedTest
:geode-rebalancer:flakyTest
:geode-rebalancer:integrationTest
:geode-wan:assemble
:geode-wan:compileTestJavaNote: Some input files use or override a deprecated API.
Note: Recompile with -Xlint:deprecation for details.
Note: Some input files use unchecked or unsafe operations.
Note: Recompile with -Xlint:unchecked for details.
:geode-wan:processTestResources
:geode-wan:testClasses
:geode-wan:checkMissedTests
:geode-wan:test
:geode-wan:check
:geode-wan:build
:geode-wan:distributedTest
:geode-wan:flakyTest
:geode-wan:integrationTest
:geode-web:assemble
:geode-web:compileTestJavaNote: <https://builds.apache.org/job/Geode-release/ws/geode-web/src/test/java/com/gemstone/gemfire/management/internal/cli/commands/DataCommandsOverHttpDistributedTest.java> uses or overrides a deprecated API.
Note: Recompile with -Xlint:deprecation for details.
Note: Some input files use unchecked or unsafe operations.
Note: Recompile with -Xlint:unchecked for details.
:geode-web:processTestResources UP-TO-DATE
:geode-web:testClasses
:geode-web:checkMissedTests
:geode-web:test
:geode-web:check
:geode-web:build
:geode-web:distributedTest
:geode-web:flakyTest
:geode-web:integrationTest
:geode-web-api:assemble
:geode-web-api:compileTestJava UP-TO-DATE
:geode-web-api:processTestResources UP-TO-DATE
:geode-web-api:testClasses UP-TO-DATE
:geode-web-api:checkMissedTests UP-TO-DATE
:geode-web-api:test UP-TO-DATE
:geode-web-api:check
:geode-web-api:build
:geode-web-api:distributedTest UP-TO-DATE
:geode-web-api:flakyTest UP-TO-DATE
:geode-web-api:integrationTest UP-TO-DATE
:combineReports
All test reports at <https://builds.apache.org/job/Geode-release/ws/build/reports/combined>
:extensions/geode-modules:precheckin
:extensions/geode-modules-assembly:precheckin
:extensions/geode-modules-hibernate:precheckin
:extensions/geode-modules-session:precheckin
:extensions/geode-modules-session-internal:precheckin
:extensions/geode-modules-tomcat7:precheckin
:geode-assembly:precheckin
:geode-common:precheckin
:geode-cq:precheckin
:geode-json:precheckin
:geode-junit:precheckin
:geode-lucene:precheckin
:geode-pulse:precheckin
:geode-rebalancer:precheckin
:geode-wan:precheckin
:geode-web:precheckin
:geode-web-api:precheckin
FAILURE: Build failed with an exception.
* What went wrong:
Execution failed for task ':geode-core:distributedTest'.
> There were failing tests. See the report at: file://<https://builds.apache.org/job/Geode-release/ws/geode-core/build/reports/distributedTest/index.html>
* Try:
Run with --stacktrace option to get the stack trace. Run with --info or --debug option to get more log output.
BUILD FAILED
Total time: 11 hrs 38 mins 6.689 secs
Build step 'Invoke Gradle script' changed build result to FAILURE
Build step 'Invoke Gradle script' marked build as failure
Archiving artifacts
Compressed 250.96 MB of artifacts by 13.1% relative to #7
Recording test results
Build failed in Jenkins: Geode-release #9
Posted by Apache Jenkins Server <je...@builds.apache.org>.
See <https://builds.apache.org/job/Geode-release/9/changes>
Changes:
[wmarkito] Updating KEYS file
------------------------------------------
[...truncated 910 lines...]
Note: Recompile with -Xlint:unchecked for details.
:geode-assembly:processTestResources
:geode-assembly:testClasses
:geode-assembly:checkMissedTests
:geode-assembly:installDist
:geode-assembly:test
:geode-assembly:check
:geode-assembly:build
:geode-assembly:distributedTest
:geode-assembly:flakyTest
:geode-assembly:integrationTest
:geode-common:assemble
:geode-common:compileTestJava
:geode-common:processTestResources UP-TO-DATE
:geode-common:testClasses
:geode-common:checkMissedTests
:geode-common:test
:geode-common:check
:geode-common:build
:geode-common:distributedTest
:geode-common:flakyTest
:geode-common:integrationTest
:geode-core:assemble
:geode-core:checkMissedTests
Download https://repo1.maven.org/maven2/org/apache/derby/derby/10.2.2.0/derby-10.2.2.0.pom
Download https://repo1.maven.org/maven2/org/apache/derby/derby/10.2.2.0/derby-10.2.2.0.jar
:geode-core:test
:geode-core:check
:geode-core:build
:geode-core:distributedTest
com.gemstone.gemfire.distributed.internal.ConsoleDistributionManagerDUnitTest > testApplications FAILED
com.gemstone.gemfire.cache.CacheClosedException: Could not PDX serialize because the cache was closed
at com.gemstone.gemfire.pdx.internal.TypeRegistry.getPdxSerializer(TypeRegistry.java:325)
at com.gemstone.gemfire.internal.InternalDataSerializer.writeUserObject(InternalDataSerializer.java:1482)
at com.gemstone.gemfire.internal.InternalDataSerializer.writeWellKnownObject(InternalDataSerializer.java:1380)
at com.gemstone.gemfire.internal.InternalDataSerializer.basicWriteObject(InternalDataSerializer.java:2136)
at com.gemstone.gemfire.DataSerializer.writeObject(DataSerializer.java:3240)
at com.gemstone.gemfire.internal.admin.remote.DestroyRegionMessage.toData(DestroyRegionMessage.java:82)
at com.gemstone.gemfire.internal.InternalDataSerializer.invokeToData(InternalDataSerializer.java:2349)
at com.gemstone.gemfire.internal.InternalDataSerializer.writeDSFID(InternalDataSerializer.java:1342)
at com.gemstone.gemfire.internal.tcp.MsgStreamer.writeMessage(MsgStreamer.java:243)
at com.gemstone.gemfire.distributed.internal.direct.DirectChannel.sendToMany(DirectChannel.java:389)
at com.gemstone.gemfire.distributed.internal.direct.DirectChannel.sendToOne(DirectChannel.java:241)
at com.gemstone.gemfire.distributed.internal.direct.DirectChannel.send(DirectChannel.java:618)
at com.gemstone.gemfire.distributed.internal.membership.gms.mgr.GMSMembershipManager.directChannelSend(GMSMembershipManager.java:1703)
at com.gemstone.gemfire.distributed.internal.membership.gms.mgr.GMSMembershipManager.send(GMSMembershipManager.java:1897)
at com.gemstone.gemfire.distributed.internal.DistributionChannel.send(DistributionChannel.java:88)
at com.gemstone.gemfire.distributed.internal.DistributionManager.sendOutgoing(DistributionManager.java:3427)
at com.gemstone.gemfire.distributed.internal.DistributionManager.sendMessage(DistributionManager.java:3468)
at com.gemstone.gemfire.distributed.internal.DistributionManager.putOutgoing(DistributionManager.java:1828)
at com.gemstone.gemfire.internal.admin.remote.RemoteGfManagerAgent.sendAsync(RemoteGfManagerAgent.java:551)
at com.gemstone.gemfire.internal.admin.remote.RemoteGemFireVM.sendAsync(RemoteGemFireVM.java:950)
at com.gemstone.gemfire.internal.admin.remote.AdminRegion.sendAsync(AdminRegion.java:451)
at com.gemstone.gemfire.internal.admin.remote.AdminRegion.destroyRegion(AdminRegion.java:128)
at com.gemstone.gemfire.distributed.internal.ConsoleDistributionManagerDUnitTest.testApplications(ConsoleDistributionManagerDUnitTest.java:308)
7378 tests completed, 1 failed, 555 skipped
:geode-core:distributedTest FAILED
:geode-core:flakyTest
:geode-core:integrationTest
:geode-cq:assemble
:geode-cq:compileTestJavaNote: Some input files use or override a deprecated API.
Note: Recompile with -Xlint:deprecation for details.
Note: Some input files use unchecked or unsafe operations.
Note: Recompile with -Xlint:unchecked for details.
:geode-cq:processTestResources
:geode-cq:testClasses
:geode-cq:checkMissedTests
:geode-cq:test
:geode-cq:check
:geode-cq:build
:geode-cq:distributedTest
:geode-cq:flakyTest
:geode-cq:integrationTest
:geode-json:assemble
:geode-json:compileTestJava UP-TO-DATE
:geode-json:processTestResources UP-TO-DATE
:geode-json:testClasses UP-TO-DATE
:geode-json:checkMissedTests UP-TO-DATE
:geode-json:test UP-TO-DATE
:geode-json:check
:geode-json:build
:geode-json:distributedTest UP-TO-DATE
:geode-json:flakyTest UP-TO-DATE
:geode-json:integrationTest UP-TO-DATE
:geode-junit:javadoc
:geode-junit:javadocJar
:geode-junit:sourcesJar
:geode-junit:signArchives SKIPPED
:geode-junit:assemble
:geode-junit:compileTestJava
:geode-junit:processTestResources UP-TO-DATE
:geode-junit:testClasses
:geode-junit:checkMissedTests
:geode-junit:test
:geode-junit:check
:geode-junit:build
:geode-junit:distributedTest
:geode-junit:flakyTest
:geode-junit:integrationTest
:geode-lucene:assemble
:geode-lucene:compileTestJava
Download https://repo1.maven.org/maven2/org/apache/lucene/lucene-test-framework/6.0.0/lucene-test-framework-6.0.0.pom
Download https://repo1.maven.org/maven2/org/apache/lucene/lucene-codecs/6.0.0/lucene-codecs-6.0.0.pom
Download https://repo1.maven.org/maven2/com/carrotsearch/randomizedtesting/randomizedtesting-runner/2.3.2/randomizedtesting-runner-2.3.2.pom
Download https://repo1.maven.org/maven2/com/carrotsearch/randomizedtesting/randomizedtesting-parent/2.3.2/randomizedtesting-parent-2.3.2.pom
Download https://repo1.maven.org/maven2/org/apache/lucene/lucene-test-framework/6.0.0/lucene-test-framework-6.0.0.jar
Download https://repo1.maven.org/maven2/org/apache/lucene/lucene-codecs/6.0.0/lucene-codecs-6.0.0.jar
Download https://repo1.maven.org/maven2/com/carrotsearch/randomizedtesting/randomizedtesting-runner/2.3.2/randomizedtesting-runner-2.3.2.jar
Note: Some input files use or override a deprecated API.
Note: Recompile with -Xlint:deprecation for details.
Note: Some input files use unchecked or unsafe operations.
Note: Recompile with -Xlint:unchecked for details.
:geode-lucene:processTestResources
:geode-lucene:testClasses
:geode-lucene:checkMissedTests
:geode-lucene:test
:geode-lucene:check
:geode-lucene:build
:geode-lucene:distributedTest
:geode-lucene:flakyTest
:geode-lucene:integrationTest
:geode-pulse:assemble
:geode-pulse:compileTestJava
Download https://repo1.maven.org/maven2/org/seleniumhq/selenium/selenium-firefox-driver/2.53.0/selenium-firefox-driver-2.53.0.pom
Download https://repo1.maven.org/maven2/org/seleniumhq/selenium/selenium-parent/2.53.0/selenium-parent-2.53.0.pom
Download https://repo1.maven.org/maven2/org/seleniumhq/selenium/selenium-api/2.53.0/selenium-api-2.53.0.pom
Download https://repo1.maven.org/maven2/org/seleniumhq/selenium/selenium-remote-driver/2.53.0/selenium-remote-driver-2.53.0.pom
Download https://repo1.maven.org/maven2/org/seleniumhq/selenium/selenium-support/2.53.0/selenium-support-2.53.0.pom
Download https://repo1.maven.org/maven2/org/springframework/spring-test/4.2.4.RELEASE/spring-test-4.2.4.RELEASE.pom
Download https://repo1.maven.org/maven2/org/seleniumhq/selenium/selenium-firefox-driver/2.53.0/selenium-firefox-driver-2.53.0.jar
Download https://repo1.maven.org/maven2/org/seleniumhq/selenium/selenium-api/2.53.0/selenium-api-2.53.0.jar
Download https://repo1.maven.org/maven2/org/seleniumhq/selenium/selenium-remote-driver/2.53.0/selenium-remote-driver-2.53.0.jar
Download https://repo1.maven.org/maven2/org/seleniumhq/selenium/selenium-support/2.53.0/selenium-support-2.53.0.jar
Download https://repo1.maven.org/maven2/org/springframework/spring-test/4.2.4.RELEASE/spring-test-4.2.4.RELEASE.jar
Note: <https://builds.apache.org/job/Geode-release/ws/geode-pulse/src/test/java/com/vmware/gemfire/tools/pulse/tests/PulseAbstractTest.java> uses or overrides a deprecated API.
Note: Recompile with -Xlint:deprecation for details.
Note: Some input files use unchecked or unsafe operations.
Note: Recompile with -Xlint:unchecked for details.
:geode-pulse:processTestResources
:geode-pulse:testClasses
:geode-pulse:checkMissedTests
Download https://repo1.maven.org/maven2/com/jayway/jsonpath/json-path/1.2.0/json-path-1.2.0.pom
Download https://repo1.maven.org/maven2/net/minidev/json-smart/2.1.0/json-smart-2.1.0.pom
Download https://repo1.maven.org/maven2/com/jayway/jsonpath/json-path/1.2.0/json-path-1.2.0.jar
Download https://repo1.maven.org/maven2/net/minidev/json-smart/2.1.0/json-smart-2.1.0.jar
:geode-pulse:test
:geode-pulse:check
:geode-pulse:build
:geode-pulse:distributedTest
:geode-pulse:flakyTest
:geode-pulse:integrationTest
:geode-rebalancer:jar
:geode-rebalancer:javadoc
:geode-rebalancer:javadocJar
:geode-rebalancer:sourcesJar
:geode-rebalancer:signArchives SKIPPED
:geode-rebalancer:assemble
:geode-rebalancer:compileTestJava
:geode-rebalancer:processTestResources UP-TO-DATE
:geode-rebalancer:testClasses
:geode-rebalancer:checkMissedTests
:geode-rebalancer:test
:geode-rebalancer:check
:geode-rebalancer:build
:geode-rebalancer:distributedTest
:geode-rebalancer:flakyTest
:geode-rebalancer:integrationTest
:geode-wan:assemble
:geode-wan:compileTestJavaNote: Some input files use or override a deprecated API.
Note: Recompile with -Xlint:deprecation for details.
Note: Some input files use unchecked or unsafe operations.
Note: Recompile with -Xlint:unchecked for details.
:geode-wan:processTestResources
:geode-wan:testClasses
:geode-wan:checkMissedTests
:geode-wan:test
:geode-wan:check
:geode-wan:build
:geode-wan:distributedTest
:geode-wan:flakyTest
:geode-wan:integrationTest
:geode-web:assemble
:geode-web:compileTestJavaNote: <https://builds.apache.org/job/Geode-release/ws/geode-web/src/test/java/com/gemstone/gemfire/management/internal/cli/commands/DataCommandsOverHttpDistributedTest.java> uses or overrides a deprecated API.
Note: Recompile with -Xlint:deprecation for details.
Note: Some input files use unchecked or unsafe operations.
Note: Recompile with -Xlint:unchecked for details.
:geode-web:processTestResources UP-TO-DATE
:geode-web:testClasses
:geode-web:checkMissedTests
:geode-web:test
:geode-web:check
:geode-web:build
:geode-web:distributedTest
:geode-web:flakyTest
:geode-web:integrationTest
:geode-web-api:assemble
:geode-web-api:compileTestJava UP-TO-DATE
:geode-web-api:processTestResources UP-TO-DATE
:geode-web-api:testClasses UP-TO-DATE
:geode-web-api:checkMissedTests UP-TO-DATE
:geode-web-api:test UP-TO-DATE
:geode-web-api:check
:geode-web-api:build
:geode-web-api:distributedTest UP-TO-DATE
:geode-web-api:flakyTest UP-TO-DATE
:geode-web-api:integrationTest UP-TO-DATE
:combineReports
All test reports at <https://builds.apache.org/job/Geode-release/ws/build/reports/combined>
:extensions/geode-modules:precheckin
:extensions/geode-modules-assembly:precheckin
:extensions/geode-modules-hibernate:precheckin
:extensions/geode-modules-session:precheckin
:extensions/geode-modules-session-internal:precheckin
:extensions/geode-modules-tomcat7:precheckin
:geode-assembly:precheckin
:geode-common:precheckin
:geode-cq:precheckin
:geode-json:precheckin
:geode-junit:precheckin
:geode-lucene:precheckin
:geode-pulse:precheckin
:geode-rebalancer:precheckin
:geode-wan:precheckin
:geode-web:precheckin
:geode-web-api:precheckin
FAILURE: Build failed with an exception.
* What went wrong:
Execution failed for task ':geode-core:distributedTest'.
> There were failing tests. See the report at: file://<https://builds.apache.org/job/Geode-release/ws/geode-core/build/reports/distributedTest/index.html>
* Try:
Run with --stacktrace option to get the stack trace. Run with --info or --debug option to get more log output.
BUILD FAILED
Total time: 11 hrs 35 mins 54.888 secs
Build step 'Invoke Gradle script' changed build result to FAILURE
Build step 'Invoke Gradle script' marked build as failure
Archiving artifacts
Compressed 251.10 MB of artifacts by 14.4% relative to #7
Recording test results