You are viewing a plain text version of this content. The canonical link for it is here.
Posted to commits@rave.apache.org by Apache Jenkins Server <je...@builds.apache.org> on 2012/02/17 00:07:28 UTC

Build failed in Jenkins: rave-project-trunk #418

See <https://builds.apache.org/job/rave-project-trunk/418/>

------------------------------------------
Started by an SCM change
Building remotely on ubuntu3 in workspace <https://builds.apache.org/job/rave-project-trunk/ws/>
Updating http://svn.apache.org/repos/asf/incubator/rave/trunk
U         rave-components/rave-web/src/test/java/org/apache/rave/portal/web/controller/ProfileControllerTest.java
U         rave-components/rave-web/src/main/java/org/apache/rave/portal/web/controller/ProfileController.java
U         rave-components/rave-web/src/main/java/org/apache/rave/portal/web/util/ViewNames.java
U         rave-portal-resources/src/main/resources/messages.properties
U         rave-portal-resources/src/main/resources/messages_nl.properties
A         rave-portal-resources/src/main/webapp/WEB-INF/jsp/views/personProfile.jsp
U         rave-portal-resources/src/main/webapp/WEB-INF/jsp/templates/base_layout.jsp
At revision 1245242
hudson.util.IOException2: revision check failed on http://svn.apache.org/repos/asf/incubator/rave/trunk
	at hudson.scm.SubversionChangeLogBuilder.buildModule(SubversionChangeLogBuilder.java:170)
	at hudson.scm.SubversionChangeLogBuilder.run(SubversionChangeLogBuilder.java:112)
	at hudson.scm.SubversionSCM.calcChangeLog(SubversionSCM.java:562)
	at hudson.scm.SubversionSCM.checkout(SubversionSCM.java:709)
	at hudson.model.AbstractProject.checkout(AbstractProject.java:1195)
	at hudson.model.AbstractBuild$AbstractRunner.checkout(AbstractBuild.java:576)
	at hudson.model.AbstractBuild$AbstractRunner.run(AbstractBuild.java:465)
	at hudson.model.Run.run(Run.java:1409)
	at hudson.maven.MavenModuleSetBuild.run(MavenModuleSetBuild.java:481)
	at hudson.model.ResourceController.execute(ResourceController.java:88)
	at hudson.model.Executor.run(Executor.java:238)
Caused by: org.tmatesoft.svn.core.SVNException: svn: OPTIONS /repos/asf/incubator/rave/trunk failed
	at org.tmatesoft.svn.core.internal.io.dav.http.HTTPConnection.request(HTTPConnection.java:298)
	at org.tmatesoft.svn.core.internal.io.dav.http.HTTPConnection.request(HTTPConnection.java:283)
	at org.tmatesoft.svn.core.internal.io.dav.http.HTTPConnection.request(HTTPConnection.java:271)
	at org.tmatesoft.svn.core.internal.io.dav.DAVConnection.exchangeCapabilities(DAVConnection.java:533)
	at org.tmatesoft.svn.core.internal.io.dav.DAVConnection.open(DAVConnection.java:98)
	at org.tmatesoft.svn.core.internal.io.dav.DAVRepository.openConnection(DAVRepository.java:1011)
	at org.tmatesoft.svn.core.internal.io.dav.DAVRepository.getLatestRevision(DAVRepository.java:180)
	at org.tmatesoft.svn.core.wc.SVNBasicClient.getRevisionNumber(SVNBasicClient.java:482)
	at org.tmatesoft.svn.core.wc.SVNBasicClient.getLocations(SVNBasicClient.java:876)
	at org.tmatesoft.svn.core.wc.SVNBasicClient.createRepository(SVNBasicClient.java:534)
	at org.tmatesoft.svn.core.wc.SVNLogClient.doLog(SVNLogClient.java:1020)
	at org.tmatesoft.svn.core.wc.SVNLogClient.doLog(SVNLogClient.java:895)
	at org.tmatesoft.svn.core.wc.SVNLogClient.doLog(SVNLogClient.java:827)
	at hudson.scm.SubversionChangeLogBuilder.buildModule(SubversionChangeLogBuilder.java:158)
	... 10 more
Caused by: org.tmatesoft.svn.core.SVNErrorMessage: svn: OPTIONS /repos/asf/incubator/rave/trunk failed
	at org.tmatesoft.svn.core.SVNErrorMessage.create(SVNErrorMessage.java:200)
	at org.tmatesoft.svn.core.SVNErrorMessage.create(SVNErrorMessage.java:146)
	at org.tmatesoft.svn.core.SVNErrorMessage.create(SVNErrorMessage.java:89)
	... 24 more
Caused by: org.tmatesoft.svn.core.SVNException: svn: OPTIONS request failed on '/repos/asf/incubator/rave/trunk'
svn: unknown host
	at org.tmatesoft.svn.core.internal.wc.SVNErrorManager.error(SVNErrorManager.java:64)
	at org.tmatesoft.svn.core.internal.wc.SVNErrorManager.error(SVNErrorManager.java:51)
	at org.tmatesoft.svn.core.internal.io.dav.http.HTTPConnection._request(HTTPConnection.java:662)
	at org.tmatesoft.svn.core.internal.io.dav.http.HTTPConnection.request(HTTPConnection.java:292)
	... 23 more
Caused by: org.tmatesoft.svn.core.SVNErrorMessage: svn: OPTIONS request failed on '/repos/asf/incubator/rave/trunk'
	at org.tmatesoft.svn.core.SVNErrorMessage.create(SVNErrorMessage.java:200)
	at org.tmatesoft.svn.core.internal.io.dav.http.HTTPConnection._request(HTTPConnection.java:660)
	... 24 more
Caused by: org.tmatesoft.svn.core.SVNErrorMessage: svn: unknown host
	at org.tmatesoft.svn.core.SVNErrorMessage.create(SVNErrorMessage.java:200)
	at org.tmatesoft.svn.core.internal.io.dav.http.HTTPConnection._request(HTTPConnection.java:415)
	... 24 more
Caused by: java.net.UnknownHostException: svn.apache.org
	at java.net.InetAddress.getAllByName0(InetAddress.java:1215)
	at java.net.InetAddress.getAllByName(InetAddress.java:1127)
	at java.net.InetAddress.getAllByName(InetAddress.java:1063)
	at java.net.InetAddress.getByName(InetAddress.java:1013)
	at org.tmatesoft.svn.core.internal.util.SVNSocketFactory.createAddres(SVNSocketFactory.java:141)
	at org.tmatesoft.svn.core.internal.util.SVNSocketFactory.createPlainSocket(SVNSocketFactory.java:55)
	at org.tmatesoft.svn.core.internal.io.dav.http.HTTPConnection.connect(HTTPConnection.java:189)
	at org.tmatesoft.svn.core.internal.io.dav.http.HTTPConnection._request(HTTPConnection.java:354)
	... 24 more
Skipping Cobertura coverage report as build was not UNSTABLE or better ...


Jenkins build is back to normal : rave-project-trunk #419

Posted by Apache Jenkins Server <je...@builds.apache.org>.
See <https://builds.apache.org/job/rave-project-trunk/419/changes>



Re: Build failed in Jenkins: rave-project-trunk #418

Posted by "Franklin, Matthew B." <mf...@mitre.org>.
This looks like an issue with the CI infrastructure.

On 2/16/12 6:07 PM, "Apache Jenkins Server" <je...@builds.apache.org>
wrote:

>See <https://builds.apache.org/job/rave-project-trunk/418/>
>
>------------------------------------------
>Started by an SCM change
>Building remotely on ubuntu3 in workspace
><https://builds.apache.org/job/rave-project-trunk/ws/>
>Updating http://svn.apache.org/repos/asf/incubator/rave/trunk
>U         
>rave-components/rave-web/src/test/java/org/apache/rave/portal/web/controll
>er/ProfileControllerTest.java
>U         
>rave-components/rave-web/src/main/java/org/apache/rave/portal/web/controll
>er/ProfileController.java
>U         
>rave-components/rave-web/src/main/java/org/apache/rave/portal/web/util/Vie
>wNames.java
>U         rave-portal-resources/src/main/resources/messages.properties
>U         rave-portal-resources/src/main/resources/messages_nl.properties
>A         
>rave-portal-resources/src/main/webapp/WEB-INF/jsp/views/personProfile.jsp
>U         
>rave-portal-resources/src/main/webapp/WEB-INF/jsp/templates/base_layout.js
>p
>At revision 1245242
>hudson.util.IOException2: revision check failed on
>http://svn.apache.org/repos/asf/incubator/rave/trunk
>	at 
>hudson.scm.SubversionChangeLogBuilder.buildModule(SubversionChangeLogBuild
>er.java:170)
>	at 
>hudson.scm.SubversionChangeLogBuilder.run(SubversionChangeLogBuilder.java:
>112)
>	at hudson.scm.SubversionSCM.calcChangeLog(SubversionSCM.java:562)
>	at hudson.scm.SubversionSCM.checkout(SubversionSCM.java:709)
>	at hudson.model.AbstractProject.checkout(AbstractProject.java:1195)
>	at 
>hudson.model.AbstractBuild$AbstractRunner.checkout(AbstractBuild.java:576)
>	at hudson.model.AbstractBuild$AbstractRunner.run(AbstractBuild.java:465)
>	at hudson.model.Run.run(Run.java:1409)
>	at hudson.maven.MavenModuleSetBuild.run(MavenModuleSetBuild.java:481)
>	at hudson.model.ResourceController.execute(ResourceController.java:88)
>	at hudson.model.Executor.run(Executor.java:238)
>Caused by: org.tmatesoft.svn.core.SVNException: svn: OPTIONS
>/repos/asf/incubator/rave/trunk failed
>	at 
>org.tmatesoft.svn.core.internal.io.dav.http.HTTPConnection.request(HTTPCon
>nection.java:298)
>	at 
>org.tmatesoft.svn.core.internal.io.dav.http.HTTPConnection.request(HTTPCon
>nection.java:283)
>	at 
>org.tmatesoft.svn.core.internal.io.dav.http.HTTPConnection.request(HTTPCon
>nection.java:271)
>	at 
>org.tmatesoft.svn.core.internal.io.dav.DAVConnection.exchangeCapabilities(
>DAVConnection.java:533)
>	at 
>org.tmatesoft.svn.core.internal.io.dav.DAVConnection.open(DAVConnection.ja
>va:98)
>	at 
>org.tmatesoft.svn.core.internal.io.dav.DAVRepository.openConnection(DAVRep
>ository.java:1011)
>	at 
>org.tmatesoft.svn.core.internal.io.dav.DAVRepository.getLatestRevision(DAV
>Repository.java:180)
>	at 
>org.tmatesoft.svn.core.wc.SVNBasicClient.getRevisionNumber(SVNBasicClient.
>java:482)
>	at 
>org.tmatesoft.svn.core.wc.SVNBasicClient.getLocations(SVNBasicClient.java:
>876)
>	at 
>org.tmatesoft.svn.core.wc.SVNBasicClient.createRepository(SVNBasicClient.j
>ava:534)
>	at org.tmatesoft.svn.core.wc.SVNLogClient.doLog(SVNLogClient.java:1020)
>	at org.tmatesoft.svn.core.wc.SVNLogClient.doLog(SVNLogClient.java:895)
>	at org.tmatesoft.svn.core.wc.SVNLogClient.doLog(SVNLogClient.java:827)
>	at 
>hudson.scm.SubversionChangeLogBuilder.buildModule(SubversionChangeLogBuild
>er.java:158)
>	... 10 more
>Caused by: org.tmatesoft.svn.core.SVNErrorMessage: svn: OPTIONS
>/repos/asf/incubator/rave/trunk failed
>	at 
>org.tmatesoft.svn.core.SVNErrorMessage.create(SVNErrorMessage.java:200)
>	at 
>org.tmatesoft.svn.core.SVNErrorMessage.create(SVNErrorMessage.java:146)
>	at org.tmatesoft.svn.core.SVNErrorMessage.create(SVNErrorMessage.java:89)
>	... 24 more
>Caused by: org.tmatesoft.svn.core.SVNException: svn: OPTIONS request
>failed on '/repos/asf/incubator/rave/trunk'
>svn: unknown host
>	at 
>org.tmatesoft.svn.core.internal.wc.SVNErrorManager.error(SVNErrorManager.j
>ava:64)
>	at 
>org.tmatesoft.svn.core.internal.wc.SVNErrorManager.error(SVNErrorManager.j
>ava:51)
>	at 
>org.tmatesoft.svn.core.internal.io.dav.http.HTTPConnection._request(HTTPCo
>nnection.java:662)
>	at 
>org.tmatesoft.svn.core.internal.io.dav.http.HTTPConnection.request(HTTPCon
>nection.java:292)
>	... 23 more
>Caused by: org.tmatesoft.svn.core.SVNErrorMessage: svn: OPTIONS request
>failed on '/repos/asf/incubator/rave/trunk'
>	at 
>org.tmatesoft.svn.core.SVNErrorMessage.create(SVNErrorMessage.java:200)
>	at 
>org.tmatesoft.svn.core.internal.io.dav.http.HTTPConnection._request(HTTPCo
>nnection.java:660)
>	... 24 more
>Caused by: org.tmatesoft.svn.core.SVNErrorMessage: svn: unknown host
>	at 
>org.tmatesoft.svn.core.SVNErrorMessage.create(SVNErrorMessage.java:200)
>	at 
>org.tmatesoft.svn.core.internal.io.dav.http.HTTPConnection._request(HTTPCo
>nnection.java:415)
>	... 24 more
>Caused by: java.net.UnknownHostException: svn.apache.org
>	at java.net.InetAddress.getAllByName0(InetAddress.java:1215)
>	at java.net.InetAddress.getAllByName(InetAddress.java:1127)
>	at java.net.InetAddress.getAllByName(InetAddress.java:1063)
>	at java.net.InetAddress.getByName(InetAddress.java:1013)
>	at 
>org.tmatesoft.svn.core.internal.util.SVNSocketFactory.createAddres(SVNSock
>etFactory.java:141)
>	at 
>org.tmatesoft.svn.core.internal.util.SVNSocketFactory.createPlainSocket(SV
>NSocketFactory.java:55)
>	at 
>org.tmatesoft.svn.core.internal.io.dav.http.HTTPConnection.connect(HTTPCon
>nection.java:189)
>	at 
>org.tmatesoft.svn.core.internal.io.dav.http.HTTPConnection._request(HTTPCo
>nnection.java:354)
>	... 24 more
>Skipping Cobertura coverage report as build was not UNSTABLE or better ...
>