You are viewing a plain text version of this content. The canonical link for it is here.
Posted to dev@kafka.apache.org by Apache Jenkins Server <je...@builds.apache.org> on 2017/03/13 22:30:35 UTC

Build failed in Jenkins: kafka-trunk-jdk8 #1347

See <https://builds.apache.org/job/kafka-trunk-jdk8/1347/display/redirect?page=changes>

Changes:

[wangguoz] KAFKA-4769: Add Float serializer, deserializer, serde

[wangguoz] KAFKA-4657: Improve test coverage of CompositeReadOnlyWindowStore

[becket.qin] KAFKA-4891; kafka.request.logger TRACE regression

------------------------------------------
[...truncated 325.59 KB...]

kafka.producer.ProducerTest > testSendNullMessage PASSED

kafka.producer.ProducerTest > testUpdateBrokerPartitionInfo STARTED

kafka.producer.ProducerTest > testUpdateBrokerPartitionInfo PASSED

kafka.producer.ProducerTest > testSendWithDeadBroker STARTED

kafka.producer.ProducerTest > testSendWithDeadBroker PASSED

kafka.tools.MirrorMakerIntegrationTest > testCommaSeparatedRegex STARTED

kafka.tools.MirrorMakerIntegrationTest > testCommaSeparatedRegex PASSED

kafka.tools.ReplicaVerificationToolTest > testReplicaBufferVerifyChecksum STARTED

kafka.tools.ReplicaVerificationToolTest > testReplicaBufferVerifyChecksum PASSED

kafka.tools.ConsoleConsumerTest > shouldLimitReadsToMaxMessageLimit STARTED

kafka.tools.ConsoleConsumerTest > shouldLimitReadsToMaxMessageLimit PASSED

kafka.tools.ConsoleConsumerTest > shouldParseValidNewConsumerValidConfig STARTED

kafka.tools.ConsoleConsumerTest > shouldParseValidNewConsumerValidConfig PASSED

kafka.tools.ConsoleConsumerTest > shouldStopWhenOutputCheckErrorFails STARTED

kafka.tools.ConsoleConsumerTest > shouldStopWhenOutputCheckErrorFails PASSED

kafka.tools.ConsoleConsumerTest > shouldParseValidNewSimpleConsumerValidConfigWithStringOffset STARTED

kafka.tools.ConsoleConsumerTest > shouldParseValidNewSimpleConsumerValidConfigWithStringOffset PASSED

kafka.tools.ConsoleConsumerTest > shouldParseConfigsFromFile STARTED

kafka.tools.ConsoleConsumerTest > shouldParseConfigsFromFile PASSED

kafka.tools.ConsoleConsumerTest > shouldParseValidNewSimpleConsumerValidConfigWithNumericOffset STARTED

kafka.tools.ConsoleConsumerTest > shouldParseValidNewSimpleConsumerValidConfigWithNumericOffset PASSED

kafka.tools.ConsoleConsumerTest > testDefaultConsumer STARTED

kafka.tools.ConsoleConsumerTest > testDefaultConsumer PASSED

kafka.tools.ConsoleConsumerTest > shouldParseValidOldConsumerValidConfig STARTED

kafka.tools.ConsoleConsumerTest > shouldParseValidOldConsumerValidConfig PASSED

kafka.tools.ConsoleProducerTest > testParseKeyProp STARTED

kafka.tools.ConsoleProducerTest > testParseKeyProp PASSED

kafka.tools.ConsoleProducerTest > testValidConfigsOldProducer STARTED

kafka.tools.ConsoleProducerTest > testValidConfigsOldProducer PASSED

kafka.tools.ConsoleProducerTest > testInvalidConfigs STARTED

kafka.tools.ConsoleProducerTest > testInvalidConfigs PASSED

kafka.tools.ConsoleProducerTest > testValidConfigsNewProducer STARTED

kafka.tools.ConsoleProducerTest > testValidConfigsNewProducer PASSED

kafka.tools.MirrorMakerTest > testDefaultMirrorMakerMessageHandlerWithNoTimestampInSourceMessage STARTED

kafka.tools.MirrorMakerTest > testDefaultMirrorMakerMessageHandlerWithNoTimestampInSourceMessage PASSED

kafka.tools.MirrorMakerTest > testDefaultMirrorMakerMessageHandler STARTED

kafka.tools.MirrorMakerTest > testDefaultMirrorMakerMessageHandler PASSED

kafka.javaapi.message.ByteBufferMessageSetTest > testSizeInBytesWithCompression STARTED

kafka.javaapi.message.ByteBufferMessageSetTest > testSizeInBytesWithCompression PASSED

kafka.javaapi.message.ByteBufferMessageSetTest > testIteratorIsConsistentWithCompression STARTED

kafka.javaapi.message.ByteBufferMessageSetTest > testIteratorIsConsistentWithCompression PASSED

kafka.javaapi.message.ByteBufferMessageSetTest > testIteratorIsConsistent STARTED

kafka.javaapi.message.ByteBufferMessageSetTest > testIteratorIsConsistent PASSED

kafka.javaapi.message.ByteBufferMessageSetTest > testEqualsWithCompression STARTED

kafka.javaapi.message.ByteBufferMessageSetTest > testEqualsWithCompression PASSED

kafka.javaapi.message.ByteBufferMessageSetTest > testWrittenEqualsRead STARTED

kafka.javaapi.message.ByteBufferMessageSetTest > testWrittenEqualsRead PASSED

kafka.javaapi.message.ByteBufferMessageSetTest > testEquals STARTED

kafka.javaapi.message.ByteBufferMessageSetTest > testEquals PASSED

kafka.javaapi.message.ByteBufferMessageSetTest > testSizeInBytes STARTED

kafka.javaapi.message.ByteBufferMessageSetTest > testSizeInBytes PASSED

kafka.javaapi.consumer.ZookeeperConsumerConnectorTest > testBasic STARTED

kafka.javaapi.consumer.ZookeeperConsumerConnectorTest > testBasic PASSED

kafka.common.ConfigTest > testInvalidGroupIds STARTED

kafka.common.ConfigTest > testInvalidGroupIds PASSED

kafka.common.ConfigTest > testInvalidClientIds STARTED

kafka.common.ConfigTest > testInvalidClientIds PASSED

kafka.common.ZkNodeChangeNotificationListenerTest > testProcessNotification STARTED

kafka.common.ZkNodeChangeNotificationListenerTest > testProcessNotification PASSED

kafka.common.TopicTest > testInvalidTopicNames STARTED

kafka.common.TopicTest > testInvalidTopicNames PASSED

kafka.common.TopicTest > testTopicHasCollision STARTED

kafka.common.TopicTest > testTopicHasCollision PASSED

kafka.common.TopicTest > testTopicHasCollisionChars STARTED

kafka.common.TopicTest > testTopicHasCollisionChars PASSED

kafka.security.auth.ResourceTypeTest > testFromString STARTED

kafka.security.auth.ResourceTypeTest > testFromString PASSED

kafka.security.auth.SimpleAclAuthorizerTest > testAllowAllAccess STARTED

kafka.security.auth.SimpleAclAuthorizerTest > testAllowAllAccess PASSED

kafka.security.auth.SimpleAclAuthorizerTest > testLocalConcurrentModificationOfResourceAcls STARTED

kafka.security.auth.SimpleAclAuthorizerTest > testLocalConcurrentModificationOfResourceAcls PASSED

kafka.security.auth.SimpleAclAuthorizerTest > testHighConcurrencyDeletionOfResourceAcls STARTED

kafka.security.auth.SimpleAclAuthorizerTest > testHighConcurrencyDeletionOfResourceAcls PASSED

kafka.security.auth.SimpleAclAuthorizerTest > testNoAclFound STARTED

kafka.security.auth.SimpleAclAuthorizerTest > testNoAclFound PASSED

kafka.security.auth.SimpleAclAuthorizerTest > testDistributedConcurrentModificationOfResourceAcls STARTED

kafka.security.auth.SimpleAclAuthorizerTest > testDistributedConcurrentModificationOfResourceAcls PASSED

kafka.security.auth.SimpleAclAuthorizerTest > testAclManagementAPIs STARTED

kafka.security.auth.SimpleAclAuthorizerTest > testAclManagementAPIs PASSED

kafka.security.auth.SimpleAclAuthorizerTest > testWildCardAcls STARTED

kafka.security.auth.SimpleAclAuthorizerTest > testWildCardAcls PASSED

kafka.security.auth.SimpleAclAuthorizerTest > testTopicAcl STARTED

kafka.security.auth.SimpleAclAuthorizerTest > testTopicAcl PASSED

kafka.security.auth.SimpleAclAuthorizerTest > testSuperUserHasAccess STARTED

kafka.security.auth.SimpleAclAuthorizerTest > testSuperUserHasAccess PASSED

kafka.security.auth.SimpleAclAuthorizerTest > testDenyTakesPrecedence STARTED

kafka.security.auth.SimpleAclAuthorizerTest > testDenyTakesPrecedence PASSED

kafka.security.auth.SimpleAclAuthorizerTest > testNoAclFoundOverride STARTED

kafka.security.auth.SimpleAclAuthorizerTest > testNoAclFoundOverride PASSED

kafka.security.auth.SimpleAclAuthorizerTest > testHighConcurrencyModificationOfResourceAcls STARTED

kafka.security.auth.SimpleAclAuthorizerTest > testHighConcurrencyModificationOfResourceAcls PASSED

kafka.security.auth.SimpleAclAuthorizerTest > testLoadCache STARTED

kafka.security.auth.SimpleAclAuthorizerTest > testLoadCache PASSED

kafka.security.auth.ZkAuthorizationTest > testIsZkSecurityEnabled STARTED

kafka.security.auth.ZkAuthorizationTest > testIsZkSecurityEnabled PASSED

kafka.security.auth.ZkAuthorizationTest > testZkUtils STARTED

kafka.security.auth.ZkAuthorizationTest > testZkUtils PASSED

kafka.security.auth.ZkAuthorizationTest > testZkAntiMigration STARTED

kafka.security.auth.ZkAuthorizationTest > testZkAntiMigration PASSED

kafka.security.auth.ZkAuthorizationTest > testZkMigration STARTED

kafka.security.auth.ZkAuthorizationTest > testZkMigration PASSED

kafka.security.auth.ZkAuthorizationTest > testChroot STARTED

kafka.security.auth.ZkAuthorizationTest > testChroot PASSED

kafka.security.auth.ZkAuthorizationTest > testDelete STARTED

kafka.security.auth.ZkAuthorizationTest > testDelete PASSED

kafka.security.auth.ZkAuthorizationTest > testDeleteRecursive STARTED

kafka.security.auth.ZkAuthorizationTest > testDeleteRecursive PASSED

kafka.security.auth.AclTest > testAclJsonConversion STARTED

kafka.security.auth.AclTest > testAclJsonConversion PASSED

kafka.security.auth.OperationTest > testFromString STARTED

kafka.security.auth.OperationTest > testFromString PASSED

kafka.security.auth.PermissionTypeTest > testFromString STARTED

kafka.security.auth.PermissionTypeTest > testFromString PASSED
:clients:compileJava UP-TO-DATE
:clients:processResources UP-TO-DATE
:clients:classes UP-TO-DATE
:clients:checkstyleMain[ant:checkstyle] [ERROR] <https://builds.apache.org/job/kafka-trunk-jdk8/ws/clients/src/main/java/org/apache/kafka/common/serialization/FloatDeserializer.java>:1: Line does not match expected header line of '/*'. [Header]
[ant:checkstyle] [ERROR] <https://builds.apache.org/job/kafka-trunk-jdk8/ws/clients/src/main/java/org/apache/kafka/common/serialization/FloatSerializer.java>:1: Line does not match expected header line of '/*'. [Header]
 FAILED

FAILURE: Build failed with an exception.

* What went wrong:
Execution failed for task ':clients:checkstyleMain'.
> Checkstyle rule violations were found. See the report at: file://<https://builds.apache.org/job/kafka-trunk-jdk8/ws/clients/build/reports/checkstyle/main.html>

* Try:
Run with --stacktrace option to get the stack trace. Run with --info or --debug option to get more log output.

BUILD FAILED

Total time: 2 hrs 17 mins 18.62 secs
Build step 'Execute shell' marked build as failure
Recording test results
Setting GRADLE_2_4_RC_2_HOME=/home/jenkins/jenkins-slave/tools/hudson.plugins.gradle.GradleInstallation/Gradle_2.4-rc-2
Setting GRADLE_2_4_RC_2_HOME=/home/jenkins/jenkins-slave/tools/hudson.plugins.gradle.GradleInstallation/Gradle_2.4-rc-2

Build failed in Jenkins: kafka-trunk-jdk8 #1349

Posted by Apache Jenkins Server <je...@builds.apache.org>.
See <https://builds.apache.org/job/kafka-trunk-jdk8/1349/display/redirect?page=changes>

Changes:

[wangguoz] KAFKA-4863; Querying window store may return unwanted keys

------------------------------------------
[...truncated 1.59 MB...]
org.apache.kafka.streams.state.internals.RocksDBSessionStoreTest > shouldPutAndFindSessionsInRange PASSED

org.apache.kafka.streams.state.internals.WindowStoreUtilsTest > testSerialization STARTED

org.apache.kafka.streams.state.internals.WindowStoreUtilsTest > testSerialization PASSED

org.apache.kafka.streams.state.StoresTest > shouldCreateInMemoryStoreSupplierWithLoggedConfig STARTED

org.apache.kafka.streams.state.StoresTest > shouldCreateInMemoryStoreSupplierWithLoggedConfig PASSED

org.apache.kafka.streams.state.StoresTest > shouldCreatePersistenStoreSupplierNotLogged STARTED

org.apache.kafka.streams.state.StoresTest > shouldCreatePersistenStoreSupplierNotLogged PASSED

org.apache.kafka.streams.state.StoresTest > shouldCreatePersistenStoreSupplierWithLoggedConfig STARTED

org.apache.kafka.streams.state.StoresTest > shouldCreatePersistenStoreSupplierWithLoggedConfig PASSED

org.apache.kafka.streams.state.StoresTest > shouldCreateInMemoryStoreSupplierNotLogged STARTED

org.apache.kafka.streams.state.StoresTest > shouldCreateInMemoryStoreSupplierNotLogged PASSED

org.apache.kafka.streams.integration.RegexSourceIntegrationTest > testShouldReadFromRegexAndNamedTopics STARTED

org.apache.kafka.streams.integration.RegexSourceIntegrationTest > testShouldReadFromRegexAndNamedTopics PASSED

org.apache.kafka.streams.integration.RegexSourceIntegrationTest > testRegexMatchesTopicsAWhenCreated STARTED

org.apache.kafka.streams.integration.RegexSourceIntegrationTest > testRegexMatchesTopicsAWhenCreated PASSED

org.apache.kafka.streams.integration.RegexSourceIntegrationTest > testMultipleConsumersCanReadFromPartitionedTopic STARTED

org.apache.kafka.streams.integration.RegexSourceIntegrationTest > testMultipleConsumersCanReadFromPartitionedTopic PASSED

org.apache.kafka.streams.integration.RegexSourceIntegrationTest > testRegexMatchesTopicsAWhenDeleted STARTED

org.apache.kafka.streams.integration.RegexSourceIntegrationTest > testRegexMatchesTopicsAWhenDeleted PASSED

org.apache.kafka.streams.integration.RegexSourceIntegrationTest > testNoMessagesSentExceptionFromOverlappingPatterns STARTED

org.apache.kafka.streams.integration.RegexSourceIntegrationTest > testNoMessagesSentExceptionFromOverlappingPatterns PASSED

org.apache.kafka.streams.integration.FanoutIntegrationTest > shouldFanoutTheInput[0] STARTED

org.apache.kafka.streams.integration.FanoutIntegrationTest > shouldFanoutTheInput[0] PASSED

org.apache.kafka.streams.integration.FanoutIntegrationTest > shouldFanoutTheInput[1] STARTED

org.apache.kafka.streams.integration.FanoutIntegrationTest > shouldFanoutTheInput[1] PASSED

org.apache.kafka.streams.integration.ResetIntegrationTest > testReprocessingFromScratchAfterResetWithIntermediateUserTopic STARTED

org.apache.kafka.streams.integration.ResetIntegrationTest > testReprocessingFromScratchAfterResetWithIntermediateUserTopic PASSED

org.apache.kafka.streams.integration.ResetIntegrationTest > testReprocessingFromScratchAfterResetWithoutIntermediateUserTopic STARTED

org.apache.kafka.streams.integration.ResetIntegrationTest > testReprocessingFromScratchAfterResetWithoutIntermediateUserTopic PASSED

org.apache.kafka.streams.integration.KStreamKTableJoinIntegrationTest > shouldCountClicksPerRegion[0] STARTED

org.apache.kafka.streams.integration.KStreamKTableJoinIntegrationTest > shouldCountClicksPerRegion[0] PASSED

org.apache.kafka.streams.integration.KStreamKTableJoinIntegrationTest > shouldCountClicksPerRegion[1] STARTED

org.apache.kafka.streams.integration.KStreamKTableJoinIntegrationTest > shouldCountClicksPerRegion[1] PASSED

org.apache.kafka.streams.integration.GlobalKTableIntegrationTest > shouldKStreamGlobalKTableLeftJoin STARTED

org.apache.kafka.streams.integration.GlobalKTableIntegrationTest > shouldKStreamGlobalKTableLeftJoin PASSED

org.apache.kafka.streams.integration.GlobalKTableIntegrationTest > shouldKStreamGlobalKTableJoin STARTED

org.apache.kafka.streams.integration.GlobalKTableIntegrationTest > shouldKStreamGlobalKTableJoin PASSED

org.apache.kafka.streams.integration.KStreamAggregationIntegrationTest > shouldReduceSessionWindows STARTED

org.apache.kafka.streams.integration.KStreamAggregationIntegrationTest > shouldReduceSessionWindows PASSED

org.apache.kafka.streams.integration.KStreamAggregationIntegrationTest > shouldReduce STARTED

org.apache.kafka.streams.integration.KStreamAggregationIntegrationTest > shouldReduce PASSED

org.apache.kafka.streams.integration.KStreamAggregationIntegrationTest > shouldAggregate STARTED

org.apache.kafka.streams.integration.KStreamAggregationIntegrationTest > shouldAggregate PASSED

org.apache.kafka.streams.integration.KStreamAggregationIntegrationTest > shouldCount STARTED

org.apache.kafka.streams.integration.KStreamAggregationIntegrationTest > shouldCount PASSED

org.apache.kafka.streams.integration.KStreamAggregationIntegrationTest > shouldGroupByKey STARTED

org.apache.kafka.streams.integration.KStreamAggregationIntegrationTest > shouldGroupByKey PASSED

org.apache.kafka.streams.integration.KStreamAggregationIntegrationTest > shouldReduceWindowed STARTED

org.apache.kafka.streams.integration.KStreamAggregationIntegrationTest > shouldReduceWindowed PASSED

org.apache.kafka.streams.integration.KStreamAggregationIntegrationTest > shouldCountSessionWindows STARTED

org.apache.kafka.streams.integration.KStreamAggregationIntegrationTest > shouldCountSessionWindows PASSED

org.apache.kafka.streams.integration.KStreamAggregationIntegrationTest > shouldAggregateWindowed STARTED

org.apache.kafka.streams.integration.KStreamAggregationIntegrationTest > shouldAggregateWindowed PASSED

org.apache.kafka.streams.integration.JoinIntegrationTest > testInnerKTableKTable STARTED

org.apache.kafka.streams.integration.JoinIntegrationTest > testInnerKTableKTable PASSED

org.apache.kafka.streams.integration.JoinIntegrationTest > testLeftKTableKTable STARTED

org.apache.kafka.streams.integration.JoinIntegrationTest > testLeftKTableKTable PASSED

org.apache.kafka.streams.integration.JoinIntegrationTest > testLeftKStreamKStream STARTED

org.apache.kafka.streams.integration.JoinIntegrationTest > testLeftKStreamKStream PASSED

org.apache.kafka.streams.integration.JoinIntegrationTest > testLeftKStreamKTable STARTED

org.apache.kafka.streams.integration.JoinIntegrationTest > testLeftKStreamKTable PASSED

org.apache.kafka.streams.integration.JoinIntegrationTest > testOuterKTableKTable STARTED

org.apache.kafka.streams.integration.JoinIntegrationTest > testOuterKTableKTable PASSED

org.apache.kafka.streams.integration.JoinIntegrationTest > testInnerKStreamKStream STARTED

org.apache.kafka.streams.integration.JoinIntegrationTest > testInnerKStreamKStream PASSED

org.apache.kafka.streams.integration.JoinIntegrationTest > testOuterKStreamKStream STARTED

org.apache.kafka.streams.integration.JoinIntegrationTest > testOuterKStreamKStream PASSED

org.apache.kafka.streams.integration.JoinIntegrationTest > testInnerKStreamKTable STARTED

org.apache.kafka.streams.integration.JoinIntegrationTest > testInnerKStreamKTable PASSED

org.apache.kafka.streams.integration.KTableKTableJoinIntegrationTest > KTableKTableJoin[0] STARTED

org.apache.kafka.streams.integration.KTableKTableJoinIntegrationTest > KTableKTableJoin[0] PASSED

org.apache.kafka.streams.integration.KTableKTableJoinIntegrationTest > KTableKTableJoin[1] STARTED

org.apache.kafka.streams.integration.KTableKTableJoinIntegrationTest > KTableKTableJoin[1] PASSED

org.apache.kafka.streams.integration.KTableKTableJoinIntegrationTest > KTableKTableJoin[2] STARTED

org.apache.kafka.streams.integration.KTableKTableJoinIntegrationTest > KTableKTableJoin[2] PASSED

org.apache.kafka.streams.integration.KTableKTableJoinIntegrationTest > KTableKTableJoin[3] STARTED

org.apache.kafka.streams.integration.KTableKTableJoinIntegrationTest > KTableKTableJoin[3] PASSED

org.apache.kafka.streams.integration.KTableKTableJoinIntegrationTest > KTableKTableJoin[4] STARTED

org.apache.kafka.streams.integration.KTableKTableJoinIntegrationTest > KTableKTableJoin[4] PASSED

org.apache.kafka.streams.integration.KTableKTableJoinIntegrationTest > KTableKTableJoin[5] STARTED

org.apache.kafka.streams.integration.KTableKTableJoinIntegrationTest > KTableKTableJoin[5] PASSED

org.apache.kafka.streams.integration.KTableKTableJoinIntegrationTest > KTableKTableJoin[6] STARTED

org.apache.kafka.streams.integration.KTableKTableJoinIntegrationTest > KTableKTableJoin[6] PASSED

org.apache.kafka.streams.integration.KTableKTableJoinIntegrationTest > KTableKTableJoin[7] STARTED

org.apache.kafka.streams.integration.KTableKTableJoinIntegrationTest > KTableKTableJoin[7] PASSED

org.apache.kafka.streams.integration.KTableKTableJoinIntegrationTest > KTableKTableJoin[8] STARTED

org.apache.kafka.streams.integration.KTableKTableJoinIntegrationTest > KTableKTableJoin[8] PASSED

org.apache.kafka.streams.integration.KStreamRepartitionJoinTest > shouldCorrectlyRepartitionOnJoinOperations[0] STARTED

org.apache.kafka.streams.integration.KStreamRepartitionJoinTest > shouldCorrectlyRepartitionOnJoinOperations[0] PASSED

org.apache.kafka.streams.integration.KStreamRepartitionJoinTest > shouldCorrectlyRepartitionOnJoinOperations[1] STARTED

org.apache.kafka.streams.integration.KStreamRepartitionJoinTest > shouldCorrectlyRepartitionOnJoinOperations[1] PASSED

org.apache.kafka.streams.integration.InternalTopicIntegrationTest > shouldCompactTopicsForStateChangelogs STARTED

org.apache.kafka.streams.integration.InternalTopicIntegrationTest > shouldCompactTopicsForStateChangelogs PASSED

org.apache.kafka.streams.integration.InternalTopicIntegrationTest > shouldUseCompactAndDeleteForWindowStoreChangelogs STARTED
ERROR: Could not install GRADLE_2_4_RC_2_HOME
java.lang.NullPointerException
	at hudson.plugins.toolenv.ToolEnvBuildWrapper$1.buildEnvVars(ToolEnvBuildWrapper.java:46)
	at hudson.model.AbstractBuild.getEnvironment(AbstractBuild.java:931)
	at hudson.plugins.git.GitSCM.getParamExpandedRepos(GitSCM.java:416)
	at hudson.plugins.git.GitSCM.compareRemoteRevisionWithImpl(GitSCM.java:622)
	at hudson.plugins.git.GitSCM.compareRemoteRevisionWith(GitSCM.java:587)
	at hudson.scm.SCM.compareRemoteRevisionWith(SCM.java:391)
	at hudson.scm.SCM.poll(SCM.java:408)
	at hudson.model.AbstractProject._poll(AbstractProject.java:1460)
	at hudson.model.AbstractProject.poll(AbstractProject.java:1363)
	at hudson.triggers.SCMTrigger$Runner.runPolling(SCMTrigger.java:563)
	at hudson.triggers.SCMTrigger$Runner.run(SCMTrigger.java:609)
	at hudson.util.SequentialExecutionQueue$QueueEntry.run(SequentialExecutionQueue.java:119)
	at java.util.concurrent.Executors$RunnableAdapter.call(Executors.java:511)
	at java.util.concurrent.FutureTask.run(FutureTask.java:266)
	at java.util.concurrent.ThreadPoolExecutor.runWorker(ThreadPoolExecutor.java:1142)
	at java.util.concurrent.ThreadPoolExecutor$Worker.run(ThreadPoolExecutor.java:617)
	at java.lang.Thread.run(Thread.java:745)
ERROR: Could not install GRADLE_2_4_RC_2_HOME
java.lang.NullPointerException
	at hudson.plugins.toolenv.ToolEnvBuildWrapper$1.buildEnvVars(ToolEnvBuildWrapper.java:46)
	at hudson.model.AbstractBuild.getEnvironment(AbstractBuild.java:931)
	at hudson.plugins.git.GitSCM.getParamExpandedRepos(GitSCM.java:416)
	at hudson.plugins.git.GitSCM.compareRemoteRevisionWithImpl(GitSCM.java:622)
	at hudson.plugins.git.GitSCM.compareRemoteRevisionWith(GitSCM.java:587)
	at hudson.scm.SCM.compareRemoteRevisionWith(SCM.java:391)
	at hudson.scm.SCM.poll(SCM.java:408)
	at hudson.model.AbstractProject._poll(AbstractProject.java:1460)
	at hudson.model.AbstractProject.poll(AbstractProject.java:1363)
	at hudson.triggers.SCMTrigger$Runner.runPolling(SCMTrigger.java:563)
	at hudson.triggers.SCMTrigger$Runner.run(SCMTrigger.java:609)
	at hudson.util.SequentialExecutionQueue$QueueEntry.run(SequentialExecutionQueue.java:119)
	at java.util.concurrent.Executors$RunnableAdapter.call(Executors.java:511)
	at java.util.concurrent.FutureTask.run(FutureTask.java:266)
	at java.util.concurrent.ThreadPoolExecutor.runWorker(ThreadPoolExecutor.java:1142)
	at java.util.concurrent.ThreadPoolExecutor$Worker.run(ThreadPoolExecutor.java:617)
	at java.lang.Thread.run(Thread.java:745)
ERROR: Could not install GRADLE_2_4_RC_2_HOME
java.lang.NullPointerException
	at hudson.plugins.toolenv.ToolEnvBuildWrapper$1.buildEnvVars(ToolEnvBuildWrapper.java:46)
	at hudson.model.AbstractBuild.getEnvironment(AbstractBuild.java:931)
	at hudson.plugins.git.GitSCM.getParamExpandedRepos(GitSCM.java:416)
	at hudson.plugins.git.GitSCM.compareRemoteRevisionWithImpl(GitSCM.java:622)
	at hudson.plugins.git.GitSCM.compareRemoteRevisionWith(GitSCM.java:587)
	at hudson.scm.SCM.compareRemoteRevisionWith(SCM.java:391)
	at hudson.scm.SCM.poll(SCM.java:408)
	at hudson.model.AbstractProject._poll(AbstractProject.java:1460)
	at hudson.model.AbstractProject.poll(AbstractProject.java:1363)
	at hudson.triggers.SCMTrigger$Runner.runPolling(SCMTrigger.java:563)
	at hudson.triggers.SCMTrigger$Runner.run(SCMTrigger.java:609)
	at hudson.util.SequentialExecutionQueue$QueueEntry.run(SequentialExecutionQueue.java:119)
	at java.util.concurrent.Executors$RunnableAdapter.call(Executors.java:511)
	at java.util.concurrent.FutureTask.run(FutureTask.java:266)
	at java.util.concurrent.ThreadPoolExecutor.runWorker(ThreadPoolExecutor.java:1142)
	at java.util.concurrent.ThreadPoolExecutor$Worker.run(ThreadPoolExecutor.java:617)
	at java.lang.Thread.run(Thread.java:745)
Build timed out (after 360 minutes). Marking the build as failed.
Build was aborted
Recording test results
Setting GRADLE_2_4_RC_2_HOME=/home/jenkins/jenkins-slave/tools/hudson.plugins.gradle.GradleInstallation/Gradle_2.4-rc-2
Setting GRADLE_2_4_RC_2_HOME=/home/jenkins/jenkins-slave/tools/hudson.plugins.gradle.GradleInstallation/Gradle_2.4-rc-2

Build failed in Jenkins: kafka-trunk-jdk8 #1348

Posted by Apache Jenkins Server <je...@builds.apache.org>.
See <https://builds.apache.org/job/kafka-trunk-jdk8/1348/display/redirect?page=changes>

Changes:

[jason] HOTFIX: Fix apache headers in float serde class files

------------------------------------------
[...truncated 21.52 KB...]
kafka.log.BrokerCompressionTest > testBrokerSideCompression[8] PASSED

kafka.log.BrokerCompressionTest > testBrokerSideCompression[9] STARTED

kafka.log.BrokerCompressionTest > testBrokerSideCompression[9] PASSED

kafka.log.BrokerCompressionTest > testBrokerSideCompression[10] STARTED

kafka.log.BrokerCompressionTest > testBrokerSideCompression[10] PASSED

kafka.log.BrokerCompressionTest > testBrokerSideCompression[11] STARTED

kafka.log.BrokerCompressionTest > testBrokerSideCompression[11] PASSED

kafka.log.BrokerCompressionTest > testBrokerSideCompression[12] STARTED

kafka.log.BrokerCompressionTest > testBrokerSideCompression[12] PASSED

kafka.log.BrokerCompressionTest > testBrokerSideCompression[13] STARTED

kafka.log.BrokerCompressionTest > testBrokerSideCompression[13] PASSED

kafka.log.BrokerCompressionTest > testBrokerSideCompression[14] STARTED

kafka.log.BrokerCompressionTest > testBrokerSideCompression[14] PASSED

kafka.log.BrokerCompressionTest > testBrokerSideCompression[15] STARTED

kafka.log.BrokerCompressionTest > testBrokerSideCompression[15] PASSED

kafka.log.BrokerCompressionTest > testBrokerSideCompression[16] STARTED

kafka.log.BrokerCompressionTest > testBrokerSideCompression[16] PASSED

kafka.log.BrokerCompressionTest > testBrokerSideCompression[17] STARTED

kafka.log.BrokerCompressionTest > testBrokerSideCompression[17] PASSED

kafka.log.BrokerCompressionTest > testBrokerSideCompression[18] STARTED

kafka.log.BrokerCompressionTest > testBrokerSideCompression[18] PASSED

kafka.log.BrokerCompressionTest > testBrokerSideCompression[19] STARTED

kafka.log.BrokerCompressionTest > testBrokerSideCompression[19] PASSED

kafka.log.OffsetIndexTest > lookupExtremeCases STARTED

kafka.log.OffsetIndexTest > lookupExtremeCases PASSED

kafka.log.OffsetIndexTest > appendTooMany STARTED

kafka.log.OffsetIndexTest > appendTooMany PASSED

kafka.log.OffsetIndexTest > randomLookupTest STARTED

kafka.log.OffsetIndexTest > randomLookupTest PASSED

kafka.log.OffsetIndexTest > testReopen STARTED

kafka.log.OffsetIndexTest > testReopen PASSED

kafka.log.OffsetIndexTest > appendOutOfOrder STARTED

kafka.log.OffsetIndexTest > appendOutOfOrder PASSED

kafka.log.OffsetIndexTest > truncate STARTED

kafka.log.OffsetIndexTest > truncate PASSED

kafka.log.TimeIndexTest > testTruncate STARTED

kafka.log.TimeIndexTest > testTruncate PASSED

kafka.log.TimeIndexTest > testAppend STARTED

kafka.log.TimeIndexTest > testAppend PASSED

kafka.log.TimeIndexTest > testLookUp STARTED

kafka.log.TimeIndexTest > testLookUp PASSED

kafka.log.OffsetMapTest > testClear STARTED

kafka.log.OffsetMapTest > testClear PASSED

kafka.log.OffsetMapTest > testGetWhenFull STARTED

kafka.log.OffsetMapTest > testGetWhenFull PASSED

kafka.log.OffsetMapTest > testBasicValidation STARTED

kafka.log.OffsetMapTest > testBasicValidation PASSED

kafka.log.LogManagerTest > testCleanupSegmentsToMaintainSize STARTED

kafka.log.LogManagerTest > testCleanupSegmentsToMaintainSize PASSED

kafka.log.LogManagerTest > testRecoveryDirectoryMappingWithRelativeDirectory STARTED

kafka.log.LogManagerTest > testRecoveryDirectoryMappingWithRelativeDirectory PASSED

kafka.log.LogManagerTest > testGetNonExistentLog STARTED

kafka.log.LogManagerTest > testGetNonExistentLog PASSED

kafka.log.LogManagerTest > testTwoLogManagersUsingSameDirFails STARTED

kafka.log.LogManagerTest > testTwoLogManagersUsingSameDirFails PASSED

kafka.log.LogManagerTest > testLeastLoadedAssignment STARTED

kafka.log.LogManagerTest > testLeastLoadedAssignment PASSED

kafka.log.LogManagerTest > testCleanupExpiredSegments STARTED

kafka.log.LogManagerTest > testCleanupExpiredSegments PASSED

kafka.log.LogManagerTest > testCheckpointRecoveryPoints STARTED

kafka.log.LogManagerTest > testCheckpointRecoveryPoints PASSED

kafka.log.LogManagerTest > testTimeBasedFlush STARTED

kafka.log.LogManagerTest > testTimeBasedFlush PASSED

kafka.log.LogManagerTest > testCreateLog STARTED

kafka.log.LogManagerTest > testCreateLog PASSED

kafka.log.LogManagerTest > testRecoveryDirectoryMappingWithTrailingSlash STARTED

kafka.log.LogManagerTest > testRecoveryDirectoryMappingWithTrailingSlash PASSED

kafka.log.LogManagerTest > testDoesntCleanLogsWithCompactDeletePolicy STARTED

kafka.log.LogManagerTest > testDoesntCleanLogsWithCompactDeletePolicy PASSED

kafka.log.LogCleanerTest > testCleanCorruptMessageSet STARTED

kafka.log.LogCleanerTest > testCleanCorruptMessageSet PASSED

kafka.log.LogCleanerTest > testBuildOffsetMap STARTED

kafka.log.LogCleanerTest > testBuildOffsetMap PASSED

kafka.log.LogCleanerTest > testBuildOffsetMapFakeLarge STARTED

kafka.log.LogCleanerTest > testBuildOffsetMapFakeLarge PASSED

kafka.log.LogCleanerTest > testSegmentGrouping STARTED

kafka.log.LogCleanerTest > testSegmentGrouping PASSED

kafka.log.LogCleanerTest > testCleanSegmentsWithAbort STARTED

kafka.log.LogCleanerTest > testCleanSegmentsWithAbort PASSED

kafka.log.LogCleanerTest > testSegmentGroupingWithSparseOffsets STARTED

kafka.log.LogCleanerTest > testSegmentGroupingWithSparseOffsets PASSED

kafka.log.LogCleanerTest > testLargeMessage STARTED

kafka.log.LogCleanerTest > testLargeMessage PASSED

kafka.log.LogCleanerTest > testRecoveryAfterCrash STARTED

kafka.log.LogCleanerTest > testRecoveryAfterCrash PASSED

kafka.log.LogCleanerTest > testCleanTombstone STARTED

kafka.log.LogCleanerTest > testCleanTombstone PASSED

kafka.log.LogCleanerTest > testCleaningWithUncleanableSection STARTED

kafka.log.LogCleanerTest > testCleaningWithUncleanableSection PASSED

kafka.log.LogCleanerTest > testLogToClean STARTED

kafka.log.LogCleanerTest > testLogToClean PASSED

kafka.log.LogCleanerTest > testCleaningWithDeletes STARTED

kafka.log.LogCleanerTest > testCleaningWithDeletes PASSED

kafka.log.LogCleanerTest > testClientHandlingOfCorruptMessageSet STARTED

kafka.log.LogCleanerTest > testClientHandlingOfCorruptMessageSet PASSED

kafka.log.LogCleanerTest > testCleanSegments STARTED

kafka.log.LogCleanerTest > testCleanSegments PASSED

kafka.log.LogCleanerTest > testLogToCleanWithUncleanableSection STARTED

kafka.log.LogCleanerTest > testLogToCleanWithUncleanableSection PASSED

kafka.log.LogCleanerTest > testBuildPartialOffsetMap STARTED

kafka.log.LogCleanerTest > testBuildPartialOffsetMap PASSED

kafka.log.LogCleanerTest > testCleaningWithUnkeyedMessages STARTED

kafka.log.LogCleanerTest > testCleaningWithUnkeyedMessages PASSED

kafka.log.LogCleanerTest > testPartialSegmentClean STARTED

kafka.log.LogCleanerTest > testPartialSegmentClean PASSED

kafka.log.LogCleanerLagIntegrationTest > cleanerTest[0] STARTED

kafka.log.LogCleanerLagIntegrationTest > cleanerTest[0] PASSED

kafka.log.LogCleanerLagIntegrationTest > cleanerTest[1] STARTED

kafka.log.LogCleanerLagIntegrationTest > cleanerTest[1] PASSED

kafka.log.LogCleanerLagIntegrationTest > cleanerTest[2] STARTED

kafka.log.LogCleanerLagIntegrationTest > cleanerTest[2] PASSED

kafka.log.LogCleanerLagIntegrationTest > cleanerTest[3] STARTED
Java HotSpot(TM) 64-Bit Server VM warning: INFO: os::commit_memory(0x00000000f4600000, 195035136, 0) failed; error='Cannot allocate memory' (errno=12)
#
# There is insufficient memory for the Java Runtime Environment to continue.
# Native memory allocation (mmap) failed to map 195035136 bytes for committing reserved memory.
# An error report file with more information is saved as:
# <https://builds.apache.org/job/kafka-trunk-jdk8/ws/core/hs_err_pid29901.log>
:kafka-trunk-jdk8:core:test FAILED
:test_core_2_10 FAILED

FAILURE: Build failed with an exception.

* What went wrong:
Execution failed for task ':core:test'.
> Process 'Gradle Test Executor 2' finished with non-zero exit value 1

* Try:
Run with --stacktrace option to get the stack trace. Run with --info or --debug option to get more log output.

BUILD FAILED

Total time: 6 mins 40.146 secs
Build step 'Execute shell' marked build as failure
Recording test results
Setting GRADLE_2_4_RC_2_HOME=/home/jenkins/jenkins-slave/tools/hudson.plugins.gradle.GradleInstallation/Gradle_2.4-rc-2
ERROR: Step ‘Publish JUnit test result report’ failed: No test report files were found. Configuration error?
Setting GRADLE_2_4_RC_2_HOME=/home/jenkins/jenkins-slave/tools/hudson.plugins.gradle.GradleInstallation/Gradle_2.4-rc-2