You are viewing a plain text version of this content. The canonical link for it is here.
Posted to dev@lucene.apache.org by Policeman Jenkins Server <je...@thetaphi.de> on 2017/02/05 13:46:43 UTC
[JENKINS-EA] Lucene-Solr-master-Linux (64bit/jdk-9-ea+153) - Build
# 18908 - Unstable!
Build: https://jenkins.thetaphi.de/job/Lucene-Solr-master-Linux/18908/
Java: 64bit/jdk-9-ea+153 -XX:+UseCompressedOops -XX:+UseG1GC
2 tests failed.
FAILED: org.apache.solr.handler.admin.TestApiFramework.testFramework
Error Message:
Stack Trace:
java.lang.ExceptionInInitializerError
at __randomizedtesting.SeedInfo.seed([62171CFA4AB6D24C:7561D6DD4C623E71]:0)
at net.sf.cglib.core.KeyFactory$Generator.generateClass(KeyFactory.java:166)
at net.sf.cglib.core.DefaultGeneratorStrategy.generate(DefaultGeneratorStrategy.java:25)
at net.sf.cglib.core.AbstractClassGenerator.create(AbstractClassGenerator.java:216)
at net.sf.cglib.core.KeyFactory$Generator.create(KeyFactory.java:144)
at net.sf.cglib.core.KeyFactory.create(KeyFactory.java:116)
at net.sf.cglib.core.KeyFactory.create(KeyFactory.java:108)
at net.sf.cglib.core.KeyFactory.create(KeyFactory.java:104)
at net.sf.cglib.proxy.Enhancer.<clinit>(Enhancer.java:69)
at org.easymock.internal.ClassProxyFactory.createEnhancer(ClassProxyFactory.java:259)
at org.easymock.internal.ClassProxyFactory.createProxy(ClassProxyFactory.java:174)
at org.easymock.internal.MocksControl.createMock(MocksControl.java:60)
at org.easymock.EasyMock.createMock(EasyMock.java:104)
at org.apache.solr.handler.admin.TestCoreAdminApis.getCoreContainerMock(TestCoreAdminApis.java:76)
at org.apache.solr.handler.admin.TestApiFramework.testFramework(TestApiFramework.java:59)
at java.base/jdk.internal.reflect.NativeMethodAccessorImpl.invoke0(Native Method)
at java.base/jdk.internal.reflect.NativeMethodAccessorImpl.invoke(NativeMethodAccessorImpl.java:62)
at java.base/jdk.internal.reflect.DelegatingMethodAccessorImpl.invoke(DelegatingMethodAccessorImpl.java:43)
at java.base/java.lang.reflect.Method.invoke(Method.java:543)
at com.carrotsearch.randomizedtesting.RandomizedRunner.invoke(RandomizedRunner.java:1713)
at com.carrotsearch.randomizedtesting.RandomizedRunner$8.evaluate(RandomizedRunner.java:907)
at com.carrotsearch.randomizedtesting.RandomizedRunner$9.evaluate(RandomizedRunner.java:943)
at com.carrotsearch.randomizedtesting.RandomizedRunner$10.evaluate(RandomizedRunner.java:957)
at com.carrotsearch.randomizedtesting.rules.SystemPropertiesRestoreRule$1.evaluate(SystemPropertiesRestoreRule.java:57)
at org.apache.lucene.util.TestRuleSetupTeardownChained$1.evaluate(TestRuleSetupTeardownChained.java:49)
at org.apache.lucene.util.AbstractBeforeAfterRule$1.evaluate(AbstractBeforeAfterRule.java:45)
at org.apache.lucene.util.TestRuleThreadAndTestName$1.evaluate(TestRuleThreadAndTestName.java:48)
at org.apache.lucene.util.TestRuleIgnoreAfterMaxFailures$1.evaluate(TestRuleIgnoreAfterMaxFailures.java:64)
at org.apache.lucene.util.TestRuleMarkFailure$1.evaluate(TestRuleMarkFailure.java:47)
at com.carrotsearch.randomizedtesting.rules.StatementAdapter.evaluate(StatementAdapter.java:36)
at com.carrotsearch.randomizedtesting.ThreadLeakControl$StatementRunner.run(ThreadLeakControl.java:368)
at com.carrotsearch.randomizedtesting.ThreadLeakControl.forkTimeoutingTask(ThreadLeakControl.java:817)
at com.carrotsearch.randomizedtesting.ThreadLeakControl$3.evaluate(ThreadLeakControl.java:468)
at com.carrotsearch.randomizedtesting.RandomizedRunner.runSingleTest(RandomizedRunner.java:916)
at com.carrotsearch.randomizedtesting.RandomizedRunner$5.evaluate(RandomizedRunner.java:802)
at com.carrotsearch.randomizedtesting.RandomizedRunner$6.evaluate(RandomizedRunner.java:852)
at com.carrotsearch.randomizedtesting.RandomizedRunner$7.evaluate(RandomizedRunner.java:863)
at com.carrotsearch.randomizedtesting.rules.StatementAdapter.evaluate(StatementAdapter.java:36)
at com.carrotsearch.randomizedtesting.rules.SystemPropertiesRestoreRule$1.evaluate(SystemPropertiesRestoreRule.java:57)
at org.apache.lucene.util.AbstractBeforeAfterRule$1.evaluate(AbstractBeforeAfterRule.java:45)
at com.carrotsearch.randomizedtesting.rules.StatementAdapter.evaluate(StatementAdapter.java:36)
at org.apache.lucene.util.TestRuleStoreClassName$1.evaluate(TestRuleStoreClassName.java:41)
at com.carrotsearch.randomizedtesting.rules.NoShadowingOrOverridesOnMethodsRule$1.evaluate(NoShadowingOrOverridesOnMethodsRule.java:40)
at com.carrotsearch.randomizedtesting.rules.NoShadowingOrOverridesOnMethodsRule$1.evaluate(NoShadowingOrOverridesOnMethodsRule.java:40)
at com.carrotsearch.randomizedtesting.rules.StatementAdapter.evaluate(StatementAdapter.java:36)
at com.carrotsearch.randomizedtesting.rules.StatementAdapter.evaluate(StatementAdapter.java:36)
at org.apache.lucene.util.TestRuleAssertionsRequired$1.evaluate(TestRuleAssertionsRequired.java:53)
at org.apache.lucene.util.TestRuleMarkFailure$1.evaluate(TestRuleMarkFailure.java:47)
at org.apache.lucene.util.TestRuleIgnoreAfterMaxFailures$1.evaluate(TestRuleIgnoreAfterMaxFailures.java:64)
at org.apache.lucene.util.TestRuleIgnoreTestSuites$1.evaluate(TestRuleIgnoreTestSuites.java:54)
at com.carrotsearch.randomizedtesting.rules.StatementAdapter.evaluate(StatementAdapter.java:36)
at com.carrotsearch.randomizedtesting.ThreadLeakControl$StatementRunner.run(ThreadLeakControl.java:368)
at java.base/java.lang.Thread.run(Thread.java:844)
Caused by: java.lang.reflect.InaccessibleObjectException: Unable to make protected final java.lang.Class java.lang.ClassLoader.defineClass(java.lang.String,byte[],int,int,java.security.ProtectionDomain) throws java.lang.ClassFormatError accessible: module java.base does not "opens java.lang" to unnamed module @337ecfa5
at java.base/java.lang.reflect.AccessibleObject.checkCanSetAccessible(AccessibleObject.java:207)
at java.base/java.lang.reflect.Method.checkCanSetAccessible(Method.java:192)
at java.base/java.lang.reflect.Method.setAccessible(Method.java:186)
at net.sf.cglib.core.ReflectUtils$2.run(ReflectUtils.java:56)
at java.base/java.security.AccessController.doPrivileged(Native Method)
at net.sf.cglib.core.ReflectUtils.<clinit>(ReflectUtils.java:46)
... 52 more
FAILED: org.apache.solr.handler.admin.TestCoreAdminApis.testCalls
Error Message:
Stack Trace:
java.lang.ExceptionInInitializerError
at __randomizedtesting.SeedInfo.seed([62171CFA4AB6D24C:50D60391CF3A61EB]:0)
at net.sf.cglib.core.KeyFactory$Generator.generateClass(KeyFactory.java:166)
at net.sf.cglib.core.DefaultGeneratorStrategy.generate(DefaultGeneratorStrategy.java:25)
at net.sf.cglib.core.AbstractClassGenerator.create(AbstractClassGenerator.java:216)
at net.sf.cglib.core.KeyFactory$Generator.create(KeyFactory.java:144)
at net.sf.cglib.core.KeyFactory.create(KeyFactory.java:116)
at net.sf.cglib.core.KeyFactory.create(KeyFactory.java:108)
at net.sf.cglib.core.KeyFactory.create(KeyFactory.java:104)
at net.sf.cglib.proxy.Enhancer.<clinit>(Enhancer.java:69)
at org.easymock.internal.ClassProxyFactory.createEnhancer(ClassProxyFactory.java:259)
at org.easymock.internal.ClassProxyFactory.createProxy(ClassProxyFactory.java:174)
at org.easymock.internal.MocksControl.createMock(MocksControl.java:60)
at org.easymock.EasyMock.createMock(EasyMock.java:104)
at org.apache.solr.handler.admin.TestCoreAdminApis.getCoreContainerMock(TestCoreAdminApis.java:76)
at org.apache.solr.handler.admin.TestCoreAdminApis.testCalls(TestCoreAdminApis.java:43)
at java.base/jdk.internal.reflect.NativeMethodAccessorImpl.invoke0(Native Method)
at java.base/jdk.internal.reflect.NativeMethodAccessorImpl.invoke(NativeMethodAccessorImpl.java:62)
at java.base/jdk.internal.reflect.DelegatingMethodAccessorImpl.invoke(DelegatingMethodAccessorImpl.java:43)
at java.base/java.lang.reflect.Method.invoke(Method.java:543)
at com.carrotsearch.randomizedtesting.RandomizedRunner.invoke(RandomizedRunner.java:1713)
at com.carrotsearch.randomizedtesting.RandomizedRunner$8.evaluate(RandomizedRunner.java:907)
at com.carrotsearch.randomizedtesting.RandomizedRunner$9.evaluate(RandomizedRunner.java:943)
at com.carrotsearch.randomizedtesting.RandomizedRunner$10.evaluate(RandomizedRunner.java:957)
at com.carrotsearch.randomizedtesting.rules.SystemPropertiesRestoreRule$1.evaluate(SystemPropertiesRestoreRule.java:57)
at org.apache.lucene.util.TestRuleSetupTeardownChained$1.evaluate(TestRuleSetupTeardownChained.java:49)
at org.apache.lucene.util.AbstractBeforeAfterRule$1.evaluate(AbstractBeforeAfterRule.java:45)
at org.apache.lucene.util.TestRuleThreadAndTestName$1.evaluate(TestRuleThreadAndTestName.java:48)
at org.apache.lucene.util.TestRuleIgnoreAfterMaxFailures$1.evaluate(TestRuleIgnoreAfterMaxFailures.java:64)
at org.apache.lucene.util.TestRuleMarkFailure$1.evaluate(TestRuleMarkFailure.java:47)
at com.carrotsearch.randomizedtesting.rules.StatementAdapter.evaluate(StatementAdapter.java:36)
at com.carrotsearch.randomizedtesting.ThreadLeakControl$StatementRunner.run(ThreadLeakControl.java:368)
at com.carrotsearch.randomizedtesting.ThreadLeakControl.forkTimeoutingTask(ThreadLeakControl.java:817)
at com.carrotsearch.randomizedtesting.ThreadLeakControl$3.evaluate(ThreadLeakControl.java:468)
at com.carrotsearch.randomizedtesting.RandomizedRunner.runSingleTest(RandomizedRunner.java:916)
at com.carrotsearch.randomizedtesting.RandomizedRunner$5.evaluate(RandomizedRunner.java:802)
at com.carrotsearch.randomizedtesting.RandomizedRunner$6.evaluate(RandomizedRunner.java:852)
at com.carrotsearch.randomizedtesting.RandomizedRunner$7.evaluate(RandomizedRunner.java:863)
at com.carrotsearch.randomizedtesting.rules.StatementAdapter.evaluate(StatementAdapter.java:36)
at com.carrotsearch.randomizedtesting.rules.SystemPropertiesRestoreRule$1.evaluate(SystemPropertiesRestoreRule.java:57)
at org.apache.lucene.util.AbstractBeforeAfterRule$1.evaluate(AbstractBeforeAfterRule.java:45)
at com.carrotsearch.randomizedtesting.rules.StatementAdapter.evaluate(StatementAdapter.java:36)
at org.apache.lucene.util.TestRuleStoreClassName$1.evaluate(TestRuleStoreClassName.java:41)
at com.carrotsearch.randomizedtesting.rules.NoShadowingOrOverridesOnMethodsRule$1.evaluate(NoShadowingOrOverridesOnMethodsRule.java:40)
at com.carrotsearch.randomizedtesting.rules.NoShadowingOrOverridesOnMethodsRule$1.evaluate(NoShadowingOrOverridesOnMethodsRule.java:40)
at com.carrotsearch.randomizedtesting.rules.StatementAdapter.evaluate(StatementAdapter.java:36)
at com.carrotsearch.randomizedtesting.rules.StatementAdapter.evaluate(StatementAdapter.java:36)
at org.apache.lucene.util.TestRuleAssertionsRequired$1.evaluate(TestRuleAssertionsRequired.java:53)
at org.apache.lucene.util.TestRuleMarkFailure$1.evaluate(TestRuleMarkFailure.java:47)
at org.apache.lucene.util.TestRuleIgnoreAfterMaxFailures$1.evaluate(TestRuleIgnoreAfterMaxFailures.java:64)
at org.apache.lucene.util.TestRuleIgnoreTestSuites$1.evaluate(TestRuleIgnoreTestSuites.java:54)
at com.carrotsearch.randomizedtesting.rules.StatementAdapter.evaluate(StatementAdapter.java:36)
at com.carrotsearch.randomizedtesting.ThreadLeakControl$StatementRunner.run(ThreadLeakControl.java:368)
at java.base/java.lang.Thread.run(Thread.java:844)
Caused by: java.lang.reflect.InaccessibleObjectException: Unable to make protected final java.lang.Class java.lang.ClassLoader.defineClass(java.lang.String,byte[],int,int,java.security.ProtectionDomain) throws java.lang.ClassFormatError accessible: module java.base does not "opens java.lang" to unnamed module @1d6664df
at java.base/java.lang.reflect.AccessibleObject.checkCanSetAccessible(AccessibleObject.java:207)
at java.base/java.lang.reflect.Method.checkCanSetAccessible(Method.java:192)
at java.base/java.lang.reflect.Method.setAccessible(Method.java:186)
at net.sf.cglib.core.ReflectUtils$2.run(ReflectUtils.java:56)
at java.base/java.security.AccessController.doPrivileged(Native Method)
at net.sf.cglib.core.ReflectUtils.<clinit>(ReflectUtils.java:46)
... 52 more
Build Log:
[...truncated 11670 lines...]
[junit4] Suite: org.apache.solr.handler.admin.TestApiFramework
[junit4] 2> Creating dataDir: /home/jenkins/workspace/Lucene-Solr-master-Linux/solr/build/solr-core/test/J2/temp/solr.handler.admin.TestApiFramework_62171CFA4AB6D24C-001/init-core-data-001
[junit4] 2> 928149 INFO (SUITE-TestApiFramework-seed#[62171CFA4AB6D24C]-worker) [ ] o.a.s.SolrTestCaseJ4 Using TrieFields
[junit4] 2> 928150 INFO (SUITE-TestApiFramework-seed#[62171CFA4AB6D24C]-worker) [ ] o.a.s.SolrTestCaseJ4 Randomized ssl (true) and clientAuth (true) via: @org.apache.solr.util.RandomizeSSL(reason="", ssl=0.0/0.0, value=0.0/0.0, clientAuth=0.0/0.0)
[junit4] 2> 928153 INFO (TEST-TestApiFramework.testFramework-seed#[62171CFA4AB6D24C]) [ ] o.a.s.SolrTestCaseJ4 ###Starting testFramework
[junit4] 2> 928194 INFO (TEST-TestApiFramework.testFramework-seed#[62171CFA4AB6D24C]) [ ] o.a.s.SolrTestCaseJ4 ###Ending testFramework
[junit4] 2> NOTE: reproduce with: ant test -Dtestcase=TestApiFramework -Dtests.method=testFramework -Dtests.seed=62171CFA4AB6D24C -Dtests.multiplier=3 -Dtests.slow=true -Dtests.locale=vo -Dtests.timezone=Etc/GMT-4 -Dtests.asserts=true -Dtests.file.encoding=UTF-8
[junit4] ERROR 0.04s J2 | TestApiFramework.testFramework <<<
[junit4] > Throwable #1: java.lang.ExceptionInInitializerError
[junit4] > at __randomizedtesting.SeedInfo.seed([62171CFA4AB6D24C:7561D6DD4C623E71]:0)
[junit4] > at net.sf.cglib.core.KeyFactory$Generator.generateClass(KeyFactory.java:166)
[junit4] > at net.sf.cglib.core.DefaultGeneratorStrategy.generate(DefaultGeneratorStrategy.java:25)
[junit4] > at net.sf.cglib.core.AbstractClassGenerator.create(AbstractClassGenerator.java:216)
[junit4] > at net.sf.cglib.core.KeyFactory$Generator.create(KeyFactory.java:144)
[junit4] > at net.sf.cglib.core.KeyFactory.create(KeyFactory.java:116)
[junit4] > at net.sf.cglib.core.KeyFactory.create(KeyFactory.java:108)
[junit4] > at net.sf.cglib.core.KeyFactory.create(KeyFactory.java:104)
[junit4] > at net.sf.cglib.proxy.Enhancer.<clinit>(Enhancer.java:69)
[junit4] > at org.easymock.internal.ClassProxyFactory.createEnhancer(ClassProxyFactory.java:259)
[junit4] > at org.easymock.internal.ClassProxyFactory.createProxy(ClassProxyFactory.java:174)
[junit4] > at org.easymock.internal.MocksControl.createMock(MocksControl.java:60)
[junit4] > at org.easymock.EasyMock.createMock(EasyMock.java:104)
[junit4] > at org.apache.solr.handler.admin.TestCoreAdminApis.getCoreContainerMock(TestCoreAdminApis.java:76)
[junit4] > at org.apache.solr.handler.admin.TestApiFramework.testFramework(TestApiFramework.java:59)
[junit4] > at java.base/jdk.internal.reflect.NativeMethodAccessorImpl.invoke0(Native Method)
[junit4] > at java.base/jdk.internal.reflect.NativeMethodAccessorImpl.invoke(NativeMethodAccessorImpl.java:62)
[junit4] > at java.base/jdk.internal.reflect.DelegatingMethodAccessorImpl.invoke(DelegatingMethodAccessorImpl.java:43)
[junit4] > at java.base/java.lang.reflect.Method.invoke(Method.java:543)
[junit4] > at java.base/java.lang.Thread.run(Thread.java:844)
[junit4] > Caused by: java.lang.reflect.InaccessibleObjectException: Unable to make protected final java.lang.Class java.lang.ClassLoader.defineClass(java.lang.String,byte[],int,int,java.security.ProtectionDomain) throws java.lang.ClassFormatError accessible: module java.base does not "opens java.lang" to unnamed module @337ecfa5
[junit4] > at java.base/java.lang.reflect.AccessibleObject.checkCanSetAccessible(AccessibleObject.java:207)
[junit4] > at java.base/java.lang.reflect.Method.checkCanSetAccessible(Method.java:192)
[junit4] > at java.base/java.lang.reflect.Method.setAccessible(Method.java:186)
[junit4] > at net.sf.cglib.core.ReflectUtils$2.run(ReflectUtils.java:56)
[junit4] > at java.base/java.security.AccessController.doPrivileged(Native Method)
[junit4] > at net.sf.cglib.core.ReflectUtils.<clinit>(ReflectUtils.java:46)
[junit4] > ... 52 more
[junit4] 2> 928196 INFO (TEST-TestApiFramework.testTrailingTemplatePaths-seed#[62171CFA4AB6D24C]) [ ] o.a.s.SolrTestCaseJ4 ###Starting testTrailingTemplatePaths
[junit4] 2> 928196 INFO (TEST-TestApiFramework.testTrailingTemplatePaths-seed#[62171CFA4AB6D24C]) [ ] o.a.s.SolrTestCaseJ4 ###Ending testTrailingTemplatePaths
[junit4] 2> 928196 INFO (SUITE-TestApiFramework-seed#[62171CFA4AB6D24C]-worker) [ ] o.a.s.SolrTestCaseJ4 ###deleteCore
[junit4] 2> NOTE: leaving temporary files on disk at: /home/jenkins/workspace/Lucene-Solr-master-Linux/solr/build/solr-core/test/J2/temp/solr.handler.admin.TestApiFramework_62171CFA4AB6D24C-001
[junit4] 2> NOTE: test params are: codec=Asserting(Lucene70): {}, docValues:{}, maxPointsInLeafNode=1691, maxMBSortInHeap=5.657983103313725, sim=RandomSimilarity(queryNorm=true): {}, locale=vo, timezone=Etc/GMT-4
[junit4] 2> NOTE: Linux 4.4.0-53-generic amd64/Oracle Corporation 9-ea (64-bit)/cpus=12,threads=1,free=355880968,total=536870912
[junit4] 2> NOTE: All tests run in this JVM: [TestSSLRandomization, MissingSegmentRecoveryTest, TestAuthorizationFramework, DocValuesMultiTest, TestSolrQueryResponse, TestBinaryField, RequestHandlersTest, TestNumericTerms64, TestWriterPerf, FieldMutatingUpdateProcessorTest, TestRecovery, MetricUtilsTest, TestFieldCacheSort, BlobRepositoryCloudTest, TestShardHandlerFactory, TestDynamicLoading, TestConfigOverlay, TestZkChroot, SuggesterTest, TestSolrDeletionPolicy1, TestQuerySenderNoQuery, SecurityConfHandlerTest, ShowFileRequestHandlerTest, TlogReplayBufferedWhileIndexingTest, CoreSorterTest, TestIBSimilarityFactory, BlockCacheTest, TestConfig, SuggesterWFSTTest, OverseerTest, TestSearcherReuse, HdfsChaosMonkeySafeLeaderTest, DirectUpdateHandlerTest, RecoveryZkTest, TestSolrConfigHandlerCloud, BaseCdcrDistributedZkTest, TestMacros, FacetPivotSmallTest, TestUtils, TestHdfsBackupRestoreCore, SolrMetricReporterTest, TestSort, SolrTestCaseJ4Test, TestConfigSets, TestJettySolrRunner, LeaderInitiatedRecoveryOnCommitTest, DistanceUnitsTest, CloudMLTQParserTest, UnloadDistributedZkTest, TestIndexSearcher, LeaderElectionContextKeyTest, SpatialRPTFieldTypeTest, EchoParamsTest, ResourceLoaderTest, TestRTimerTree, FullSolrCloudDistribCmdsTest, TestInPlaceUpdatesStandalone, TestDynamicFieldCollectionResource, SimpleCollectionCreateDeleteTest, HLLSerializationTest, BasicAuthIntegrationTest, TestReload, TestSchemaNameResource, TestManagedSchema, TestIndexingPerformance, AliasIntegrationTest, HardAutoCommitTest, JvmMetricsTest, TestSolr4Spatial2, TestLMDirichletSimilarityFactory, PeerSyncReplicationTest, TestSolrQueryParser, SolrXmlInZkTest, TestSortByMinMaxFunction, HighlighterMaxOffsetTest, SuggestComponentTest, TestExactSharedStatsCache, UpdateParamsTest, ClassificationUpdateProcessorIntegrationTest, SynonymTokenizerTest, TestSolrQueryParserResource, TestScoreJoinQPNoScore, DeleteStatusTest, TestSolrCloudWithHadoopAuthPlugin, TestComplexPhraseQParserPlugin, TestComponentsName, DistributedFacetExistsSmallTest, SolrIndexConfigTest, WrapperMergePolicyFactoryTest, DistribJoinFromCollectionTest, TestDistributedMissingSort, TestStandardQParsers, BinaryUpdateRequestHandlerTest, XmlUpdateRequestHandlerTest, DocValuesNotIndexedTest, DateFieldTest, MBeansHandlerTest, HdfsRecoverLeaseTest, TestSubQueryTransformerCrossCore, AnalysisErrorHandlingTest, TestFieldResource, TestReRankQParserPlugin, DocExpirationUpdateProcessorFactoryTest, HighlighterConfigTest, TestFieldCache, StatsComponentTest, TestMissingGroups, TestApiFramework]
[junit4] Completed [302/693 (1!)] on J2 in 0.06s, 2 tests, 1 error <<< FAILURES!
[...truncated 936 lines...]
[junit4] Suite: org.apache.solr.handler.admin.TestCoreAdminApis
[junit4] 2> Creating dataDir: /home/jenkins/workspace/Lucene-Solr-master-Linux/solr/build/solr-core/test/J0/temp/solr.handler.admin.TestCoreAdminApis_62171CFA4AB6D24C-001/init-core-data-001
[junit4] 2> 2022695 INFO (SUITE-TestCoreAdminApis-seed#[62171CFA4AB6D24C]-worker) [ ] o.a.s.SolrTestCaseJ4 Using PointFields
[junit4] 2> 2022697 INFO (SUITE-TestCoreAdminApis-seed#[62171CFA4AB6D24C]-worker) [ ] o.a.s.SolrTestCaseJ4 Randomized ssl (false) and clientAuth (true) via: @org.apache.solr.util.RandomizeSSL(reason="", ssl=0.0/0.0, value=0.0/0.0, clientAuth=0.0/0.0)
[junit4] 2> 2022698 INFO (TEST-TestCoreAdminApis.testCalls-seed#[62171CFA4AB6D24C]) [ ] o.a.s.SolrTestCaseJ4 ###Starting testCalls
[junit4] 2> 2022730 INFO (TEST-TestCoreAdminApis.testCalls-seed#[62171CFA4AB6D24C]) [ ] o.a.s.SolrTestCaseJ4 ###Ending testCalls
[junit4] 2> NOTE: reproduce with: ant test -Dtestcase=TestCoreAdminApis -Dtests.method=testCalls -Dtests.seed=62171CFA4AB6D24C -Dtests.multiplier=3 -Dtests.slow=true -Dtests.locale=om-KE -Dtests.timezone=Pacific/Pago_Pago -Dtests.asserts=true -Dtests.file.encoding=UTF-8
[junit4] ERROR 0.04s J0 | TestCoreAdminApis.testCalls <<<
[junit4] > Throwable #1: java.lang.ExceptionInInitializerError
[junit4] > at __randomizedtesting.SeedInfo.seed([62171CFA4AB6D24C:50D60391CF3A61EB]:0)
[junit4] > at net.sf.cglib.core.KeyFactory$Generator.generateClass(KeyFactory.java:166)
[junit4] > at net.sf.cglib.core.DefaultGeneratorStrategy.generate(DefaultGeneratorStrategy.java:25)
[junit4] > at net.sf.cglib.core.AbstractClassGenerator.create(AbstractClassGenerator.java:216)
[junit4] > at net.sf.cglib.core.KeyFactory$Generator.create(KeyFactory.java:144)
[junit4] > at net.sf.cglib.core.KeyFactory.create(KeyFactory.java:116)
[junit4] > at net.sf.cglib.core.KeyFactory.create(KeyFactory.java:108)
[junit4] > at net.sf.cglib.core.KeyFactory.create(KeyFactory.java:104)
[junit4] > at net.sf.cglib.proxy.Enhancer.<clinit>(Enhancer.java:69)
[junit4] > at org.easymock.internal.ClassProxyFactory.createEnhancer(ClassProxyFactory.java:259)
[junit4] > at org.easymock.internal.ClassProxyFactory.createProxy(ClassProxyFactory.java:174)
[junit4] > at org.easymock.internal.MocksControl.createMock(MocksControl.java:60)
[junit4] > at org.easymock.EasyMock.createMock(EasyMock.java:104)
[junit4] > at org.apache.solr.handler.admin.TestCoreAdminApis.getCoreContainerMock(TestCoreAdminApis.java:76)
[junit4] > at org.apache.solr.handler.admin.TestCoreAdminApis.testCalls(TestCoreAdminApis.java:43)
[junit4] > at java.base/jdk.internal.reflect.NativeMethodAccessorImpl.invoke0(Native Method)
[junit4] > at java.base/jdk.internal.reflect.NativeMethodAccessorImpl.invoke(NativeMethodAccessorImpl.java:62)
[junit4] > at java.base/jdk.internal.reflect.DelegatingMethodAccessorImpl.invoke(DelegatingMethodAccessorImpl.java:43)
[junit4] > at java.base/java.lang.reflect.Method.invoke(Method.java:543)
[junit4] > at java.base/java.lang.Thread.run(Thread.java:844)
[junit4] > Caused by: java.lang.reflect.InaccessibleObjectException: Unable to make protected final java.lang.Class java.lang.ClassLoader.defineClass(java.lang.String,byte[],int,int,java.security.ProtectionDomain) throws java.lang.ClassFormatError accessible: module java.base does not "opens java.lang" to unnamed module @1d6664df
[junit4] > at java.base/java.lang.reflect.AccessibleObject.checkCanSetAccessible(AccessibleObject.java:207)
[junit4] > at java.base/java.lang.reflect.Method.checkCanSetAccessible(Method.java:192)
[junit4] > at java.base/java.lang.reflect.Method.setAccessible(Method.java:186)
[junit4] > at net.sf.cglib.core.ReflectUtils$2.run(ReflectUtils.java:56)
[junit4] > at java.base/java.security.AccessController.doPrivileged(Native Method)
[junit4] > at net.sf.cglib.core.ReflectUtils.<clinit>(ReflectUtils.java:46)
[junit4] > ... 52 more
[junit4] 2> 2022732 INFO (SUITE-TestCoreAdminApis-seed#[62171CFA4AB6D24C]-worker) [ ] o.a.s.SolrTestCaseJ4 ###deleteCore
[junit4] 2> NOTE: leaving temporary files on disk at: /home/jenkins/workspace/Lucene-Solr-master-Linux/solr/build/solr-core/test/J0/temp/solr.handler.admin.TestCoreAdminApis_62171CFA4AB6D24C-001
[junit4] 2> NOTE: test params are: codec=Asserting(Lucene70): {}, docValues:{}, maxPointsInLeafNode=1219, maxMBSortInHeap=6.412132483243665, sim=RandomSimilarity(queryNorm=false): {}, locale=om-KE, timezone=Pacific/Pago_Pago
[junit4] 2> NOTE: Linux 4.4.0-53-generic amd64/Oracle Corporation 9-ea (64-bit)/cpus=12,threads=1,free=245606120,total=536870912
[junit4] 2> NOTE: All tests run in this JVM: [TestLockTree, DistribCursorPagingTest, TestDFRSimilarityFactory, CopyFieldTest, TestRemoteStreaming, PolyFieldTest, TestDeleteCollectionOnDownNodes, DirectoryFactoryTest, TestTrackingShardHandlerFactory, TestAnalyzedSuggestions, ClassificationUpdateProcessorTest, TestLegacyNumericRangeQueryBuilder, HLLUtilTest, TestSuggestSpellingConverter, HdfsWriteToMultipleCollectionsTest, TestLazyCores, TestCorePropertiesReload, TestBadConfig, TestSegmentSorting, TestPKIAuthenticationPlugin, TestNRTOpen, BlockJoinFacetSimpleTest, TestJmxMonitoredMap, HdfsThreadLeakTest, XsltUpdateRequestHandlerTest, CoreAdminCreateDiscoverTest, TestSolrCloudWithDelegationTokens, ZkStateReaderTest, TestMinMaxOnMultiValuedField, SolrRequestParserTest, SolrCoreTest, TestDelegationWithHadoopAuth, LeaderElectionIntegrationTest, TestPseudoReturnFields, TriLevelCompositeIdRoutingTest, TestFieldCacheReopen, LeaderInitiatedRecoveryOnShardRestartTest, StandardRequestHandlerTest, TestSolrCoreProperties, DistributedFacetPivotSmallTest, TestFastWriter, DocumentAnalysisRequestHandlerTest, TestUnifiedSolrHighlighter, TestRealTimeGet, DisMaxRequestHandlerTest, TestCodecSupport, TestRandomDVFaceting, DeleteReplicaTest, TestXmlQParserPlugin, TestStressCloudBlindAtomicUpdates, TestCustomSort, ConnectionManagerTest, NotRequiredUniqueKeyTest, AnalysisAfterCoreReloadTest, PluginInfoTest, JsonValidatorTest, CollectionsAPISolrJTest, PeerSyncTest, RequiredFieldsTest, TestRawResponseWriter, RecoveryAfterSoftCommitTest, ExplicitHLLTest, SimpleMLTQParserTest, TestNoOpRegenerator, TestSubQueryTransformerDistrib, TestCloudSchemaless, SolrIndexMetricsTest, TestRandomFaceting, TestFieldCacheSortRandom, FastVectorHighlighterTest, TestRTGBase, BJQParserTest, LeaderFailoverAfterPartitionTest, TestRangeQuery, SSLMigrationTest, TestStressLucene, SearchHandlerTest, DistributedSpellCheckComponentTest, TestScoreJoinQPScore, TestAtomicUpdateErrorCases, UpdateLogTest, NumericFieldsTest, TestCopyFieldCollectionResource, TestValueSourceCache, CleanupOldIndexTest, TestNonDefinedSimilarityFactory, CursorMarkTest, QueryEqualityTest, TestCollectionAPIs, TestUninvertingReader, SpatialHeatmapFacetsTest, TestFieldTypeCollectionResource, ClusterStateTest, MinimalSchemaTest, TestRecoveryHdfs, TestSolrConfigHandler, TestCSVLoader, CollectionStateFormat2Test, BadCopyFieldTest, TestSolrConfigHandlerConcurrent, ZkNodePropsTest, JSONWriterTest, TestFreeTextSuggestions, TestChildDocTransformer, TestLRUCache, AtomicUpdatesTest, ResponseLogComponentTest, TestDistributedStatsComponentCardinality, SpellPossibilityIteratorTest, DistributedQueryElevationComponentTest, TestGraphTermsQParserPlugin, InfoHandlerTest, SolrMetricsIntegrationTest, ChaosMonkeySafeLeaderTest, SyncSliceTest, LeaderElectionTest, AutoCommitTest, TestDistributedGrouping, TestFaceting, TestHashPartitioner, ZkControllerTest, TestJoin, SolrCmdDistributorTest, BadIndexSchemaTest, ConvertedLegacyTest, TestFunctionQuery, CurrencyFieldXmlFileTest, SignatureUpdateProcessorFactoryTest, TestExtendedDismaxParser, CoreAdminHandlerTest, NoCacheHeaderTest, SchemaVersionSpecificBehaviorTest, SolrCoreCheckLockOnStartupTest, DirectUpdateHandlerOptimizeTest, DefaultValueUpdateProcessorTest, DistanceFunctionTest, DebugComponentTest, LukeRequestHandlerTest, DocumentBuilderTest, MoreLikeThisHandlerTest, SolrPluginUtilsTest, TestCollationField, UpdateRequestProcessorFactoryTest, UniqFieldsUpdateProcessorFactoryTest, CSVRequestHandlerTest, TestQuerySenderListener, TestSolrIndexConfig, BadComponentTest, TestMergePolicyConfig, TestSolrDeletionPolicy2, MultiTermTest, TestDocSet, TestElisionMultitermQuery, OutputWriterTest, ExternalFileFieldSortTest, TestLuceneMatchVersion, TestXIncludeConfig, TestLMJelinekMercerSimilarityFactory, TimeZoneUtilsTest, ScriptEngineTest, URLClassifyProcessorTest, ChaosMonkeyNothingIsSafeTest, CdcrReplicationDistributedZkTest, CdcrReplicationHandlerTest, CdcrRequestHandlerTest, CdcrVersionReplicationTest, ConfigSetsAPITest, CreateCollectionCleanupTest, CustomCollectionTest, ForceLeaderTest, SharedFSAutoReplicaFailoverTest, SharedFSAutoReplicaFailoverUtilsTest, SolrCLIZkUtilsTest, SolrCloudExampleTest, TestCloudInspectUtil, TestCloudPivotFacet, TestClusterProperties, TestCollectionAPI, TestConfigSetsAPI, TestConfigSetsAPIExclusivity, TestCryptoKeys, TestDownShardTolerantSearch, TestExclusionRuleCollectionAccess, TestLeaderElectionWithEmptyReplica, TestLeaderInitiatedRecoveryThread, TestMiniSolrCloudClusterSSL, TestRandomFlRTGCloud, TestReplicaProperties, TestRequestForwarding, TestSizeLimitedDistributedMap, TestTolerantUpdateProcessorCloud, HdfsRestartWhileUpdatingTest, HdfsTlogReplayBufferedWhileIndexingTest, TestClusterStateMutator, RulesTest, RequestLoggingTest, TestBlobHandler, V2ApiIntegrationTest, CoreMergeIndexesAdminHandlerTest, SegmentsInfoRequestHandlerTest, TestConfigsApi, TestCoreAdminApis]
[junit4] Completed [575/693 (2!)] on J0 in 0.05s, 1 test, 1 error <<< FAILURES!
[...truncated 51931 lines...]