You are viewing a plain text version of this content. The canonical link for it is here.
Posted to commits@tomee.apache.org by Apache Jenkins Server <je...@builds.apache.org> on 2024/12/02 20:13:16 UTC
Build failed in Jenkins: TomEE » tomee-9.x-build-full » TomEE :: Arquillian :: Functional Tests :: Spring CXF Test #685
See <https://ci-builds.apache.org/job/Tomee/job/tomee-9.x-build-full/org.apache.tomee$spring-cxf-tomee-4332/685/display/redirect>
Changes:
------------------------------------------
[INFO]
[INFO] ---------------< org.apache.tomee:spring-cxf-tomee-4332 >---------------
[INFO] Building TomEE :: Arquillian :: Functional Tests :: Spring CXF Test 9.1.4-SNAPSHOT [338/346]
[INFO] from arquillian/functional-tests/spring-cxf-tomee-4332/pom.xml
[INFO] --------------------------------[ war ]---------------------------------
[INFO] Downloading from central: https://repo.maven.apache.org/maven2/org/springframework/boot/spring-boot-maven-plugin/maven-metadata.xml
[INFO] Downloading from Nexus: https://repository.apache.org/snapshots/org/springframework/boot/spring-boot-maven-plugin/maven-metadata.xml
[INFO] Downloading from apache-plugin-snapshot: https://repository.apache.org/content/groups/snapshots/org/springframework/boot/spring-boot-maven-plugin/maven-metadata.xml
[INFO] Downloading from apache-plugin-release: https://repository.apache.org/content/repositories/releases/org/springframework/boot/spring-boot-maven-plugin/maven-metadata.xml
[INFO] Downloaded from central: https://repo.maven.apache.org/maven2/org/springframework/boot/spring-boot-maven-plugin/maven-metadata.xml (8.6 kB at 75 kB/s)
[INFO] Downloading from apache-plugin-release: https://repository.apache.org/content/repositories/releases/org/springframework/boot/spring-boot-maven-plugin/3.4.0/spring-boot-maven-plugin-3.4.0.pom
[INFO] Downloading from central: https://repo.maven.apache.org/maven2/org/springframework/boot/spring-boot-maven-plugin/3.4.0/spring-boot-maven-plugin-3.4.0.pom
[INFO] Downloaded from central: https://repo.maven.apache.org/maven2/org/springframework/boot/spring-boot-maven-plugin/3.4.0/spring-boot-maven-plugin-3.4.0.pom (4.0 kB at 134 kB/s)
[INFO] Downloading from apache-plugin-release: https://repository.apache.org/content/repositories/releases/org/springframework/boot/spring-boot-maven-plugin/3.4.0/spring-boot-maven-plugin-3.4.0.jar
[INFO] Downloading from central: https://repo.maven.apache.org/maven2/org/springframework/boot/spring-boot-maven-plugin/3.4.0/spring-boot-maven-plugin-3.4.0.jar
[INFO] Downloaded from central: https://repo.maven.apache.org/maven2/org/springframework/boot/spring-boot-maven-plugin/3.4.0/spring-boot-maven-plugin-3.4.0.jar (137 kB at 1.7 MB/s)
[INFO]
[INFO] --- clean:3.2.0:clean (default-clean) @ spring-cxf-tomee-4332 ---
[INFO]
[INFO] --- enforcer:3.0.0:enforce (enforce-maven-version) @ spring-cxf-tomee-4332 ---
[INFO]
[INFO] --- enforcer:3.0.0:enforce (enforce-java-version) @ spring-cxf-tomee-4332 ---
[INFO]
[INFO] --- remote-resources:1.5:process (process-resource-bundles) @ spring-cxf-tomee-4332 ---
[INFO]
[INFO] --- resources:3.0.2:resources (default-resources) @ spring-cxf-tomee-4332 ---
[INFO] Using 'UTF-8' encoding to copy filtered resources.
[INFO] Copying 1 resource
[INFO] Copying 3 resources
[INFO]
[INFO] --- compiler:3.6.2:compile (default-compile) @ spring-cxf-tomee-4332 ---
[INFO] Changes detected - recompiling the module!
[INFO] Compiling 4 source files to <https://ci-builds.apache.org/job/Tomee/job/tomee-9.x-build-full/org.apache.tomee$spring-cxf-tomee-4332/ws/target/classes>
[INFO] -------------------------------------------------------------
[ERROR] COMPILATION ERROR :
[INFO] -------------------------------------------------------------
[ERROR] <https://ci-builds.apache.org/job/Tomee/job/tomee-9.x-build-full/org.apache.tomee$spring-cxf-tomee-4332/ws/src/main/java/org/example/spring/DemoApplication.java>:[19,31] error: cannot access SpringApplication
bad class file: /home/jenkins/.m2/repository/org/springframework/boot/spring-boot/3.1.11/spring-boot-3.1.11.jar(/org/springframework/boot/SpringApplication.class)
class file has wrong version 61.0, should be 55.0
Please remove or make sure it appears in the correct subdirectory of the classpath.
[ERROR] <https://ci-builds.apache.org/job/Tomee/job/tomee-9.x-build-full/org.apache.tomee$spring-cxf-tomee-4332/ws/src/main/java/org/example/spring/DemoApplication.java>:[20,45] error: cannot access SpringBootApplication
bad class file: /home/jenkins/.m2/repository/org/springframework/boot/spring-boot-autoconfigure/3.1.11/spring-boot-autoconfigure-3.1.11.jar(/org/springframework/boot/autoconfigure/SpringBootApplication.class)
class file has wrong version 61.0, should be 55.0
Please remove or make sure it appears in the correct subdirectory of the classpath.
[ERROR] <https://ci-builds.apache.org/job/Tomee/job/tomee-9.x-build-full/org.apache.tomee$spring-cxf-tomee-4332/ws/src/main/java/org/example/spring/DemoApplication.java>:[22,1] error: cannot find symbol
symbol: class SpringBootApplication
[ERROR] <https://ci-builds.apache.org/job/Tomee/job/tomee-9.x-build-full/org.apache.tomee$spring-cxf-tomee-4332/ws/src/main/java/org/example/spring/ServletInitializer.java>:[19,39] error: cannot access SpringApplicationBuilder
bad class file: /home/jenkins/.m2/repository/org/springframework/boot/spring-boot/3.1.11/spring-boot-3.1.11.jar(/org/springframework/boot/builder/SpringApplicationBuilder.class)
class file has wrong version 61.0, should be 55.0
Please remove or make sure it appears in the correct subdirectory of the classpath.
[ERROR] <https://ci-builds.apache.org/job/Tomee/job/tomee-9.x-build-full/org.apache.tomee$spring-cxf-tomee-4332/ws/src/main/java/org/example/spring/ServletInitializer.java>:[20,51] error: cannot access SpringBootServletInitializer
bad class file: /home/jenkins/.m2/repository/org/springframework/boot/spring-boot/3.1.11/spring-boot-3.1.11.jar(/org/springframework/boot/web/servlet/support/SpringBootServletInitializer.class)
class file has wrong version 61.0, should be 55.0
Please remove or make sure it appears in the correct subdirectory of the classpath.
[ERROR] <https://ci-builds.apache.org/job/Tomee/job/tomee-9.x-build-full/org.apache.tomee$spring-cxf-tomee-4332/ws/src/main/java/org/example/spring/ServletInitializer.java>:[22,40] error: cannot find symbol
symbol: class SpringBootServletInitializer
[ERROR] <https://ci-builds.apache.org/job/Tomee/job/tomee-9.x-build-full/org.apache.tomee$spring-cxf-tomee-4332/ws/src/main/java/org/example/spring/ServletInitializer.java>:[25,46] error: cannot find symbol
symbol: class SpringApplicationBuilder
location: class ServletInitializer
[ERROR] <https://ci-builds.apache.org/job/Tomee/job/tomee-9.x-build-full/org.apache.tomee$spring-cxf-tomee-4332/ws/src/main/java/org/example/spring/ServletInitializer.java>:[25,11] error: cannot find symbol
symbol: class SpringApplicationBuilder
location: class ServletInitializer
[ERROR] <https://ci-builds.apache.org/job/Tomee/job/tomee-9.x-build-full/org.apache.tomee$spring-cxf-tomee-4332/ws/src/main/java/org/example/spring/GreetingController.java>:[19,31] error: cannot access MediaType
bad class file: /home/jenkins/.m2/repository/org/springframework/spring-web/6.0.19/spring-web-6.0.19.jar(/org/springframework/http/MediaType.class)
class file has wrong version 61.0, should be 55.0
Please remove or make sure it appears in the correct subdirectory of the classpath.
[ERROR] <https://ci-builds.apache.org/job/Tomee/job/tomee-9.x-build-full/org.apache.tomee$spring-cxf-tomee-4332/ws/src/main/java/org/example/spring/GreetingController.java>:[20,37] error: cannot access Controller
bad class file: /home/jenkins/.m2/repository/org/springframework/spring-context/6.0.19/spring-context-6.0.19.jar(/org/springframework/stereotype/Controller.class)
class file has wrong version 61.0, should be 55.0
Please remove or make sure it appears in the correct subdirectory of the classpath.
[ERROR] <https://ci-builds.apache.org/job/Tomee/job/tomee-9.x-build-full/org.apache.tomee$spring-cxf-tomee-4332/ws/src/main/java/org/example/spring/GreetingController.java>:[21,46] error: cannot access GetMapping
bad class file: /home/jenkins/.m2/repository/org/springframework/spring-web/6.0.19/spring-web-6.0.19.jar(/org/springframework/web/bind/annotation/GetMapping.class)
class file has wrong version 61.0, should be 55.0
Please remove or make sure it appears in the correct subdirectory of the classpath.
[ERROR] <https://ci-builds.apache.org/job/Tomee/job/tomee-9.x-build-full/org.apache.tomee$spring-cxf-tomee-4332/ws/src/main/java/org/example/spring/GreetingController.java>:[22,46] error: cannot access RequestMapping
bad class file: /home/jenkins/.m2/repository/org/springframework/spring-web/6.0.19/spring-web-6.0.19.jar(/org/springframework/web/bind/annotation/RequestMapping.class)
class file has wrong version 61.0, should be 55.0
Please remove or make sure it appears in the correct subdirectory of the classpath.
[ERROR] <https://ci-builds.apache.org/job/Tomee/job/tomee-9.x-build-full/org.apache.tomee$spring-cxf-tomee-4332/ws/src/main/java/org/example/spring/GreetingController.java>:[23,46] error: cannot access ResponseBody
bad class file: /home/jenkins/.m2/repository/org/springframework/spring-web/6.0.19/spring-web-6.0.19.jar(/org/springframework/web/bind/annotation/ResponseBody.class)
class file has wrong version 61.0, should be 55.0
Please remove or make sure it appears in the correct subdirectory of the classpath.
[ERROR] <https://ci-builds.apache.org/job/Tomee/job/tomee-9.x-build-full/org.apache.tomee$spring-cxf-tomee-4332/ws/src/main/java/org/example/spring/GreetingController.java>:[25,1] error: cannot find symbol
symbol: class Controller
[ERROR] <https://ci-builds.apache.org/job/Tomee/job/tomee-9.x-build-full/org.apache.tomee$spring-cxf-tomee-4332/ws/src/main/java/org/example/spring/GreetingController.java>:[26,1] error: cannot find symbol
symbol: class RequestMapping
[ERROR] <https://ci-builds.apache.org/job/Tomee/job/tomee-9.x-build-full/org.apache.tomee$spring-cxf-tomee-4332/ws/src/main/java/org/example/spring/GreetingController.java>:[29,5] error: cannot find symbol
symbol: class GetMapping
location: class GreetingController
[ERROR] <https://ci-builds.apache.org/job/Tomee/job/tomee-9.x-build-full/org.apache.tomee$spring-cxf-tomee-4332/ws/src/main/java/org/example/spring/GreetingController.java>:[29,27] error: cannot find symbol
symbol: variable MediaType
location: class GreetingController
[ERROR] <https://ci-builds.apache.org/job/Tomee/job/tomee-9.x-build-full/org.apache.tomee$spring-cxf-tomee-4332/ws/src/main/java/org/example/spring/GreetingController.java>:[30,5] error: cannot find symbol
symbol: class ResponseBody
location: class GreetingController
[ERROR] <https://ci-builds.apache.org/job/Tomee/job/tomee-9.x-build-full/org.apache.tomee$spring-cxf-tomee-4332/ws/src/main/java/org/example/spring/DemoApplication.java>:[26,2] error: cannot find symbol
symbol: variable SpringApplication
location: class DemoApplication
[ERROR] <https://ci-builds.apache.org/job/Tomee/job/tomee-9.x-build-full/org.apache.tomee$spring-cxf-tomee-4332/ws/src/main/java/org/example/spring/ServletInitializer.java>:[24,1] error: method does not override or implement a method from a supertype
[INFO] 20 errors
[INFO] -------------------------------------------------------------
Build failed in Jenkins: TomEE » tomee-9.x-build-full » TomEE :: Arquillian :: Functional Tests :: Spring CXF Test #687
Posted by Apache Jenkins Server <je...@builds.apache.org>.
See <https://ci-builds.apache.org/job/Tomee/job/tomee-9.x-build-full/org.apache.tomee$spring-cxf-tomee-4332/687/display/redirect>
Changes:
------------------------------------------
[INFO]
[INFO] ---------------< org.apache.tomee:spring-cxf-tomee-4332 >---------------
[INFO] Building TomEE :: Arquillian :: Functional Tests :: Spring CXF Test 9.1.4-SNAPSHOT [338/346]
[INFO] from arquillian/functional-tests/spring-cxf-tomee-4332/pom.xml
[INFO] --------------------------------[ war ]---------------------------------
[INFO] Downloading from Nexus: https://repository.apache.org/snapshots/org/springframework/boot/spring-boot-maven-plugin/maven-metadata.xml
[INFO] Downloading from apache-plugin-release: https://repository.apache.org/content/repositories/releases/org/springframework/boot/spring-boot-maven-plugin/maven-metadata.xml
[INFO] Downloading from apache-plugin-snapshot: https://repository.apache.org/content/groups/snapshots/org/springframework/boot/spring-boot-maven-plugin/maven-metadata.xml
[INFO] Downloading from central: https://repo.maven.apache.org/maven2/org/springframework/boot/spring-boot-maven-plugin/maven-metadata.xml
[INFO] Downloaded from central: https://repo.maven.apache.org/maven2/org/springframework/boot/spring-boot-maven-plugin/maven-metadata.xml (8.6 kB at 58 kB/s)
[INFO]
[INFO] --- clean:3.2.0:clean (default-clean) @ spring-cxf-tomee-4332 ---
[INFO]
[INFO] --- enforcer:3.0.0:enforce (enforce-maven-version) @ spring-cxf-tomee-4332 ---
[INFO]
[INFO] --- enforcer:3.0.0:enforce (enforce-java-version) @ spring-cxf-tomee-4332 ---
[INFO]
[INFO] --- remote-resources:1.5:process (process-resource-bundles) @ spring-cxf-tomee-4332 ---
[INFO]
[INFO] --- resources:3.0.2:resources (default-resources) @ spring-cxf-tomee-4332 ---
[INFO] Using 'UTF-8' encoding to copy filtered resources.
[INFO] Copying 1 resource
[INFO] Copying 3 resources
[INFO]
[INFO] --- compiler:3.6.2:compile (default-compile) @ spring-cxf-tomee-4332 ---
[INFO] Changes detected - recompiling the module!
[INFO] Compiling 4 source files to <https://ci-builds.apache.org/job/Tomee/job/tomee-9.x-build-full/org.apache.tomee$spring-cxf-tomee-4332/ws/target/classes>
[INFO] -------------------------------------------------------------
[ERROR] COMPILATION ERROR :
[INFO] -------------------------------------------------------------
[ERROR] <https://ci-builds.apache.org/job/Tomee/job/tomee-9.x-build-full/org.apache.tomee$spring-cxf-tomee-4332/ws/src/main/java/org/example/spring/ServletInitializer.java>:[19,39] error: cannot access SpringApplicationBuilder
bad class file: /home/jenkins/.m2/repository/org/springframework/boot/spring-boot/3.1.11/spring-boot-3.1.11.jar(/org/springframework/boot/builder/SpringApplicationBuilder.class)
class file has wrong version 61.0, should be 55.0
Please remove or make sure it appears in the correct subdirectory of the classpath.
[ERROR] <https://ci-builds.apache.org/job/Tomee/job/tomee-9.x-build-full/org.apache.tomee$spring-cxf-tomee-4332/ws/src/main/java/org/example/spring/ServletInitializer.java>:[20,51] error: cannot access SpringBootServletInitializer
bad class file: /home/jenkins/.m2/repository/org/springframework/boot/spring-boot/3.1.11/spring-boot-3.1.11.jar(/org/springframework/boot/web/servlet/support/SpringBootServletInitializer.class)
class file has wrong version 61.0, should be 55.0
Please remove or make sure it appears in the correct subdirectory of the classpath.
[ERROR] <https://ci-builds.apache.org/job/Tomee/job/tomee-9.x-build-full/org.apache.tomee$spring-cxf-tomee-4332/ws/src/main/java/org/example/spring/ServletInitializer.java>:[22,40] error: cannot find symbol
symbol: class SpringBootServletInitializer
[ERROR] <https://ci-builds.apache.org/job/Tomee/job/tomee-9.x-build-full/org.apache.tomee$spring-cxf-tomee-4332/ws/src/main/java/org/example/spring/ServletInitializer.java>:[25,46] error: cannot find symbol
symbol: class SpringApplicationBuilder
location: class ServletInitializer
[ERROR] <https://ci-builds.apache.org/job/Tomee/job/tomee-9.x-build-full/org.apache.tomee$spring-cxf-tomee-4332/ws/src/main/java/org/example/spring/ServletInitializer.java>:[25,11] error: cannot find symbol
symbol: class SpringApplicationBuilder
location: class ServletInitializer
[ERROR] <https://ci-builds.apache.org/job/Tomee/job/tomee-9.x-build-full/org.apache.tomee$spring-cxf-tomee-4332/ws/src/main/java/org/example/spring/DemoApplication.java>:[19,31] error: cannot access SpringApplication
bad class file: /home/jenkins/.m2/repository/org/springframework/boot/spring-boot/3.1.11/spring-boot-3.1.11.jar(/org/springframework/boot/SpringApplication.class)
class file has wrong version 61.0, should be 55.0
Please remove or make sure it appears in the correct subdirectory of the classpath.
[ERROR] <https://ci-builds.apache.org/job/Tomee/job/tomee-9.x-build-full/org.apache.tomee$spring-cxf-tomee-4332/ws/src/main/java/org/example/spring/DemoApplication.java>:[20,45] error: cannot access SpringBootApplication
bad class file: /home/jenkins/.m2/repository/org/springframework/boot/spring-boot-autoconfigure/3.1.11/spring-boot-autoconfigure-3.1.11.jar(/org/springframework/boot/autoconfigure/SpringBootApplication.class)
class file has wrong version 61.0, should be 55.0
Please remove or make sure it appears in the correct subdirectory of the classpath.
[ERROR] <https://ci-builds.apache.org/job/Tomee/job/tomee-9.x-build-full/org.apache.tomee$spring-cxf-tomee-4332/ws/src/main/java/org/example/spring/DemoApplication.java>:[22,1] error: cannot find symbol
symbol: class SpringBootApplication
[ERROR] <https://ci-builds.apache.org/job/Tomee/job/tomee-9.x-build-full/org.apache.tomee$spring-cxf-tomee-4332/ws/src/main/java/org/example/spring/GreetingController.java>:[19,31] error: cannot access MediaType
bad class file: /home/jenkins/.m2/repository/org/springframework/spring-web/6.0.19/spring-web-6.0.19.jar(/org/springframework/http/MediaType.class)
class file has wrong version 61.0, should be 55.0
Please remove or make sure it appears in the correct subdirectory of the classpath.
[ERROR] <https://ci-builds.apache.org/job/Tomee/job/tomee-9.x-build-full/org.apache.tomee$spring-cxf-tomee-4332/ws/src/main/java/org/example/spring/GreetingController.java>:[20,37] error: cannot access Controller
bad class file: /home/jenkins/.m2/repository/org/springframework/spring-context/6.0.19/spring-context-6.0.19.jar(/org/springframework/stereotype/Controller.class)
class file has wrong version 61.0, should be 55.0
Please remove or make sure it appears in the correct subdirectory of the classpath.
[ERROR] <https://ci-builds.apache.org/job/Tomee/job/tomee-9.x-build-full/org.apache.tomee$spring-cxf-tomee-4332/ws/src/main/java/org/example/spring/GreetingController.java>:[21,46] error: cannot access GetMapping
bad class file: /home/jenkins/.m2/repository/org/springframework/spring-web/6.0.19/spring-web-6.0.19.jar(/org/springframework/web/bind/annotation/GetMapping.class)
class file has wrong version 61.0, should be 55.0
Please remove or make sure it appears in the correct subdirectory of the classpath.
[ERROR] <https://ci-builds.apache.org/job/Tomee/job/tomee-9.x-build-full/org.apache.tomee$spring-cxf-tomee-4332/ws/src/main/java/org/example/spring/GreetingController.java>:[22,46] error: cannot access RequestMapping
bad class file: /home/jenkins/.m2/repository/org/springframework/spring-web/6.0.19/spring-web-6.0.19.jar(/org/springframework/web/bind/annotation/RequestMapping.class)
class file has wrong version 61.0, should be 55.0
Please remove or make sure it appears in the correct subdirectory of the classpath.
[ERROR] <https://ci-builds.apache.org/job/Tomee/job/tomee-9.x-build-full/org.apache.tomee$spring-cxf-tomee-4332/ws/src/main/java/org/example/spring/GreetingController.java>:[23,46] error: cannot access ResponseBody
bad class file: /home/jenkins/.m2/repository/org/springframework/spring-web/6.0.19/spring-web-6.0.19.jar(/org/springframework/web/bind/annotation/ResponseBody.class)
class file has wrong version 61.0, should be 55.0
Please remove or make sure it appears in the correct subdirectory of the classpath.
[ERROR] <https://ci-builds.apache.org/job/Tomee/job/tomee-9.x-build-full/org.apache.tomee$spring-cxf-tomee-4332/ws/src/main/java/org/example/spring/GreetingController.java>:[25,1] error: cannot find symbol
symbol: class Controller
[ERROR] <https://ci-builds.apache.org/job/Tomee/job/tomee-9.x-build-full/org.apache.tomee$spring-cxf-tomee-4332/ws/src/main/java/org/example/spring/GreetingController.java>:[26,1] error: cannot find symbol
symbol: class RequestMapping
[ERROR] <https://ci-builds.apache.org/job/Tomee/job/tomee-9.x-build-full/org.apache.tomee$spring-cxf-tomee-4332/ws/src/main/java/org/example/spring/GreetingController.java>:[29,5] error: cannot find symbol
symbol: class GetMapping
location: class GreetingController
[ERROR] <https://ci-builds.apache.org/job/Tomee/job/tomee-9.x-build-full/org.apache.tomee$spring-cxf-tomee-4332/ws/src/main/java/org/example/spring/GreetingController.java>:[29,27] error: cannot find symbol
symbol: variable MediaType
location: class GreetingController
[ERROR] <https://ci-builds.apache.org/job/Tomee/job/tomee-9.x-build-full/org.apache.tomee$spring-cxf-tomee-4332/ws/src/main/java/org/example/spring/GreetingController.java>:[30,5] error: cannot find symbol
symbol: class ResponseBody
location: class GreetingController
[ERROR] <https://ci-builds.apache.org/job/Tomee/job/tomee-9.x-build-full/org.apache.tomee$spring-cxf-tomee-4332/ws/src/main/java/org/example/spring/ServletInitializer.java>:[24,1] error: method does not override or implement a method from a supertype
[ERROR] <https://ci-builds.apache.org/job/Tomee/job/tomee-9.x-build-full/org.apache.tomee$spring-cxf-tomee-4332/ws/src/main/java/org/example/spring/DemoApplication.java>:[26,2] error: cannot find symbol
symbol: variable SpringApplication
location: class DemoApplication
[INFO] 20 errors
[INFO] -------------------------------------------------------------
Build failed in Jenkins: TomEE » tomee-9.x-build-full » TomEE :: Arquillian :: Functional Tests :: Spring CXF Test #686
Posted by Apache Jenkins Server <je...@builds.apache.org>.
See <https://ci-builds.apache.org/job/Tomee/job/tomee-9.x-build-full/org.apache.tomee$spring-cxf-tomee-4332/686/display/redirect>
Changes:
------------------------------------------
[INFO]
[INFO] ---------------< org.apache.tomee:spring-cxf-tomee-4332 >---------------
[INFO] Building TomEE :: Arquillian :: Functional Tests :: Spring CXF Test 9.1.4-SNAPSHOT [338/346]
[INFO] from arquillian/functional-tests/spring-cxf-tomee-4332/pom.xml
[INFO] --------------------------------[ war ]---------------------------------
[INFO] Downloading from Nexus: https://repository.apache.org/snapshots/org/springframework/boot/spring-boot-maven-plugin/maven-metadata.xml
[INFO] Downloading from apache-plugin-release: https://repository.apache.org/content/repositories/releases/org/springframework/boot/spring-boot-maven-plugin/maven-metadata.xml
[INFO] Downloading from apache-plugin-snapshot: https://repository.apache.org/content/groups/snapshots/org/springframework/boot/spring-boot-maven-plugin/maven-metadata.xml
[INFO] Downloading from central: https://repo.maven.apache.org/maven2/org/springframework/boot/spring-boot-maven-plugin/maven-metadata.xml
[INFO] Downloaded from central: https://repo.maven.apache.org/maven2/org/springframework/boot/spring-boot-maven-plugin/maven-metadata.xml (8.6 kB at 65 kB/s)
[INFO]
[INFO] --- clean:3.2.0:clean (default-clean) @ spring-cxf-tomee-4332 ---
[INFO]
[INFO] --- enforcer:3.0.0:enforce (enforce-maven-version) @ spring-cxf-tomee-4332 ---
[INFO]
[INFO] --- enforcer:3.0.0:enforce (enforce-java-version) @ spring-cxf-tomee-4332 ---
[INFO]
[INFO] --- remote-resources:1.5:process (process-resource-bundles) @ spring-cxf-tomee-4332 ---
[INFO]
[INFO] --- resources:3.0.2:resources (default-resources) @ spring-cxf-tomee-4332 ---
[INFO] Using 'UTF-8' encoding to copy filtered resources.
[INFO] Copying 1 resource
[INFO] Copying 3 resources
[INFO]
[INFO] --- compiler:3.6.2:compile (default-compile) @ spring-cxf-tomee-4332 ---
[INFO] Changes detected - recompiling the module!
[INFO] Compiling 4 source files to <https://ci-builds.apache.org/job/Tomee/job/tomee-9.x-build-full/org.apache.tomee$spring-cxf-tomee-4332/ws/target/classes>
[INFO] -------------------------------------------------------------
[ERROR] COMPILATION ERROR :
[INFO] -------------------------------------------------------------
[ERROR] <https://ci-builds.apache.org/job/Tomee/job/tomee-9.x-build-full/org.apache.tomee$spring-cxf-tomee-4332/ws/src/main/java/org/example/spring/DemoApplication.java>:[19,31] error: cannot access SpringApplication
bad class file: /home/jenkins/.m2/repository/org/springframework/boot/spring-boot/3.1.11/spring-boot-3.1.11.jar(/org/springframework/boot/SpringApplication.class)
class file has wrong version 61.0, should be 55.0
Please remove or make sure it appears in the correct subdirectory of the classpath.
[ERROR] <https://ci-builds.apache.org/job/Tomee/job/tomee-9.x-build-full/org.apache.tomee$spring-cxf-tomee-4332/ws/src/main/java/org/example/spring/DemoApplication.java>:[20,45] error: cannot access SpringBootApplication
bad class file: /home/jenkins/.m2/repository/org/springframework/boot/spring-boot-autoconfigure/3.1.11/spring-boot-autoconfigure-3.1.11.jar(/org/springframework/boot/autoconfigure/SpringBootApplication.class)
class file has wrong version 61.0, should be 55.0
Please remove or make sure it appears in the correct subdirectory of the classpath.
[ERROR] <https://ci-builds.apache.org/job/Tomee/job/tomee-9.x-build-full/org.apache.tomee$spring-cxf-tomee-4332/ws/src/main/java/org/example/spring/DemoApplication.java>:[22,1] error: cannot find symbol
symbol: class SpringBootApplication
[ERROR] <https://ci-builds.apache.org/job/Tomee/job/tomee-9.x-build-full/org.apache.tomee$spring-cxf-tomee-4332/ws/src/main/java/org/example/spring/ServletInitializer.java>:[19,39] error: cannot access SpringApplicationBuilder
bad class file: /home/jenkins/.m2/repository/org/springframework/boot/spring-boot/3.1.11/spring-boot-3.1.11.jar(/org/springframework/boot/builder/SpringApplicationBuilder.class)
class file has wrong version 61.0, should be 55.0
Please remove or make sure it appears in the correct subdirectory of the classpath.
[ERROR] <https://ci-builds.apache.org/job/Tomee/job/tomee-9.x-build-full/org.apache.tomee$spring-cxf-tomee-4332/ws/src/main/java/org/example/spring/ServletInitializer.java>:[20,51] error: cannot access SpringBootServletInitializer
bad class file: /home/jenkins/.m2/repository/org/springframework/boot/spring-boot/3.1.11/spring-boot-3.1.11.jar(/org/springframework/boot/web/servlet/support/SpringBootServletInitializer.class)
class file has wrong version 61.0, should be 55.0
Please remove or make sure it appears in the correct subdirectory of the classpath.
[ERROR] <https://ci-builds.apache.org/job/Tomee/job/tomee-9.x-build-full/org.apache.tomee$spring-cxf-tomee-4332/ws/src/main/java/org/example/spring/ServletInitializer.java>:[22,40] error: cannot find symbol
symbol: class SpringBootServletInitializer
[ERROR] <https://ci-builds.apache.org/job/Tomee/job/tomee-9.x-build-full/org.apache.tomee$spring-cxf-tomee-4332/ws/src/main/java/org/example/spring/ServletInitializer.java>:[25,46] error: cannot find symbol
symbol: class SpringApplicationBuilder
location: class ServletInitializer
[ERROR] <https://ci-builds.apache.org/job/Tomee/job/tomee-9.x-build-full/org.apache.tomee$spring-cxf-tomee-4332/ws/src/main/java/org/example/spring/ServletInitializer.java>:[25,11] error: cannot find symbol
symbol: class SpringApplicationBuilder
location: class ServletInitializer
[ERROR] <https://ci-builds.apache.org/job/Tomee/job/tomee-9.x-build-full/org.apache.tomee$spring-cxf-tomee-4332/ws/src/main/java/org/example/spring/GreetingController.java>:[19,31] error: cannot access MediaType
bad class file: /home/jenkins/.m2/repository/org/springframework/spring-web/6.0.19/spring-web-6.0.19.jar(/org/springframework/http/MediaType.class)
class file has wrong version 61.0, should be 55.0
Please remove or make sure it appears in the correct subdirectory of the classpath.
[ERROR] <https://ci-builds.apache.org/job/Tomee/job/tomee-9.x-build-full/org.apache.tomee$spring-cxf-tomee-4332/ws/src/main/java/org/example/spring/GreetingController.java>:[20,37] error: cannot access Controller
bad class file: /home/jenkins/.m2/repository/org/springframework/spring-context/6.0.19/spring-context-6.0.19.jar(/org/springframework/stereotype/Controller.class)
class file has wrong version 61.0, should be 55.0
Please remove or make sure it appears in the correct subdirectory of the classpath.
[ERROR] <https://ci-builds.apache.org/job/Tomee/job/tomee-9.x-build-full/org.apache.tomee$spring-cxf-tomee-4332/ws/src/main/java/org/example/spring/GreetingController.java>:[21,46] error: cannot access GetMapping
bad class file: /home/jenkins/.m2/repository/org/springframework/spring-web/6.0.19/spring-web-6.0.19.jar(/org/springframework/web/bind/annotation/GetMapping.class)
class file has wrong version 61.0, should be 55.0
Please remove or make sure it appears in the correct subdirectory of the classpath.
[ERROR] <https://ci-builds.apache.org/job/Tomee/job/tomee-9.x-build-full/org.apache.tomee$spring-cxf-tomee-4332/ws/src/main/java/org/example/spring/GreetingController.java>:[22,46] error: cannot access RequestMapping
bad class file: /home/jenkins/.m2/repository/org/springframework/spring-web/6.0.19/spring-web-6.0.19.jar(/org/springframework/web/bind/annotation/RequestMapping.class)
class file has wrong version 61.0, should be 55.0
Please remove or make sure it appears in the correct subdirectory of the classpath.
[ERROR] <https://ci-builds.apache.org/job/Tomee/job/tomee-9.x-build-full/org.apache.tomee$spring-cxf-tomee-4332/ws/src/main/java/org/example/spring/GreetingController.java>:[23,46] error: cannot access ResponseBody
bad class file: /home/jenkins/.m2/repository/org/springframework/spring-web/6.0.19/spring-web-6.0.19.jar(/org/springframework/web/bind/annotation/ResponseBody.class)
class file has wrong version 61.0, should be 55.0
Please remove or make sure it appears in the correct subdirectory of the classpath.
[ERROR] <https://ci-builds.apache.org/job/Tomee/job/tomee-9.x-build-full/org.apache.tomee$spring-cxf-tomee-4332/ws/src/main/java/org/example/spring/GreetingController.java>:[25,1] error: cannot find symbol
symbol: class Controller
[ERROR] <https://ci-builds.apache.org/job/Tomee/job/tomee-9.x-build-full/org.apache.tomee$spring-cxf-tomee-4332/ws/src/main/java/org/example/spring/GreetingController.java>:[26,1] error: cannot find symbol
symbol: class RequestMapping
[ERROR] <https://ci-builds.apache.org/job/Tomee/job/tomee-9.x-build-full/org.apache.tomee$spring-cxf-tomee-4332/ws/src/main/java/org/example/spring/GreetingController.java>:[29,5] error: cannot find symbol
symbol: class GetMapping
location: class GreetingController
[ERROR] <https://ci-builds.apache.org/job/Tomee/job/tomee-9.x-build-full/org.apache.tomee$spring-cxf-tomee-4332/ws/src/main/java/org/example/spring/GreetingController.java>:[29,27] error: cannot find symbol
symbol: variable MediaType
location: class GreetingController
[ERROR] <https://ci-builds.apache.org/job/Tomee/job/tomee-9.x-build-full/org.apache.tomee$spring-cxf-tomee-4332/ws/src/main/java/org/example/spring/GreetingController.java>:[30,5] error: cannot find symbol
symbol: class ResponseBody
location: class GreetingController
[ERROR] <https://ci-builds.apache.org/job/Tomee/job/tomee-9.x-build-full/org.apache.tomee$spring-cxf-tomee-4332/ws/src/main/java/org/example/spring/DemoApplication.java>:[26,2] error: cannot find symbol
symbol: variable SpringApplication
location: class DemoApplication
[ERROR] <https://ci-builds.apache.org/job/Tomee/job/tomee-9.x-build-full/org.apache.tomee$spring-cxf-tomee-4332/ws/src/main/java/org/example/spring/ServletInitializer.java>:[24,1] error: method does not override or implement a method from a supertype
[INFO] 20 errors
[INFO] -------------------------------------------------------------