You are viewing a plain text version of this content. The canonical link for it is here.
Posted to builds@mesos.apache.org by Apache Jenkins Server <je...@builds.apache.org> on 2026/01/16 07:51:06 UTC

Branch: origin/master Mesos » Mesos-Buildbot - Build # 387 - Failure!

Branch: origin/master

Mesos » Mesos-Buildbot - Build # 387 - Failure:

Check console output at https://ci-builds.apache.org/job/Mesos/job/Mesos-Buildbot/387/ to view the results.

11 tests failed.
FAILED:  SSLTest.PeerAddress

Error Message:
/tmp/SRC/3rdparty/libprocess/src/tests/ssl_tests.cpp:654
Failed to wait 15secs for socket

Stack Trace:
/tmp/SRC/3rdparty/libprocess/src/tests/ssl_tests.cpp:654
Failed to wait 15secs for socket

FAILED:  SSLTest.HTTPSGet

Error Message:
/tmp/SRC/3rdparty/libprocess/src/tests/ssl_tests.cpp:693
(socket).failure(): Failed to complete SSL connection for 172.17.0.2:41306: error:00000000:lib(0):func(0):reason(0)

Stack Trace:
/tmp/SRC/3rdparty/libprocess/src/tests/ssl_tests.cpp:693
(socket).failure(): Failed to complete SSL connection for 172.17.0.2:41306: error:00000000:lib(0):func(0):reason(0)

FAILED:  SSLTest.HTTPSPost

Error Message:
/tmp/SRC/3rdparty/libprocess/src/tests/ssl_tests.cpp:734
(socket).failure(): Failed to complete SSL connection for 172.17.0.2:41002: error:00000000:lib(0):func(0):reason(0)

Stack Trace:
/tmp/SRC/3rdparty/libprocess/src/tests/ssl_tests.cpp:734
(socket).failure(): Failed to complete SSL connection for 172.17.0.2:41002: error:00000000:lib(0):func(0):reason(0)

FAILED:  SSLTest.ShutdownThenSend

Error Message:
/tmp/SRC/3rdparty/libprocess/src/tests/ssl_tests.cpp:898
(client->connect( server->address().get(), openssl::create_tls_client_config(None()))).failure(): Failed connect: connection closed

Stack Trace:
/tmp/SRC/3rdparty/libprocess/src/tests/ssl_tests.cpp:898
(client->connect( server->address().get(), openssl::create_tls_client_config(None()))).failure(): Failed connect: connection closed

FAILED:  SSLTest.CustomSSLContext

Error Message:
/tmp/SRC/3rdparty/libprocess/src/tests/ssl_tests.cpp:1201
Failed to wait 15secs for socket

Stack Trace:
/tmp/SRC/3rdparty/libprocess/src/tests/ssl_tests.cpp:1201
Failed to wait 15secs for socket

FAILED:  Scheme/HTTPTest.EndpointsHelpRemoval/0

Error Message:
/tmp/SRC/3rdparty/libprocess/src/tests/http_tests.cpp:445
(response).failure(): Failed connect: connection closed

Stack Trace:
/tmp/SRC/3rdparty/libprocess/src/tests/http_tests.cpp:445
(response).failure(): Failed connect: connection closed

FAILED:  Scheme/HTTPTest.ProvideSendfile/0

Error Message:
/tmp/SRC/3rdparty/libprocess/src/tests/http_tests.cpp:956
(response).failure(): Failed connect: connection closed

Stack Trace:
/tmp/SRC/3rdparty/libprocess/src/tests/http_tests.cpp:956
(response).failure(): Failed connect: connection closed

FAILED:  SSLVerifyIPAdd/SSLVerifyIPAddTest.BasicSameProcess/0

Error Message:
/tmp/SRC/3rdparty/libprocess/src/tests/ssl_tests.cpp:956
(client->connect( address.get(), openssl::create_tls_client_config(None()))).failure(): Failed connect: connection closed

Stack Trace:
/tmp/SRC/3rdparty/libprocess/src/tests/ssl_tests.cpp:956
(client->connect( address.get(), openssl::create_tls_client_config(None()))).failure(): Failed connect: connection closed

FAILED:  SSLVerifyIPAdd/SSLVerifyIPAddTest.BasicSameProcess/1

Error Message:
/tmp/SRC/3rdparty/libprocess/src/tests/ssl_tests.cpp:956
(client->connect( address.get(), openssl::create_tls_client_config(None()))).failure(): Failed connect: connection closed

Stack Trace:
/tmp/SRC/3rdparty/libprocess/src/tests/ssl_tests.cpp:956
(client->connect( address.get(), openssl::create_tls_client_config(None()))).failure(): Failed connect: connection closed

FAILED:  SSLVerifyIPAdd/SSLVerifyIPAddTest.BasicSameProcessUnix/0

Error Message:
/tmp/SRC/3rdparty/libprocess/src/tests/ssl_tests.cpp:1014
(client->connect( address.get(), openssl::create_tls_client_config(None()))).failure(): Failed connect: connection closed

Stack Trace:
/tmp/SRC/3rdparty/libprocess/src/tests/ssl_tests.cpp:1014
(client->connect( address.get(), openssl::create_tls_client_config(None()))).failure(): Failed connect: connection closed

FAILED:  SSLVerifyIPAdd/SSLVerifyIPAddTest.BasicSameProcessUnix/1

Error Message:
/tmp/SRC/3rdparty/libprocess/src/tests/ssl_tests.cpp:1014
(client->connect( address.get(), openssl::create_tls_client_config(None()))).failure(): Failed connect: connection closed

Stack Trace:
/tmp/SRC/3rdparty/libprocess/src/tests/ssl_tests.cpp:1014
(client->connect( address.get(), openssl::create_tls_client_config(None()))).failure(): Failed connect: connection closed