You are viewing a plain text version of this content. The canonical link for it is here.
Posted to dev@ws.apache.org by Apache Jenkins Server <je...@builds.apache.org> on 2024/06/19 01:27:44 UTC
Build failed in Jenkins: webservices » Apache WSS4J - master JDK11 #106
See <https://ci-builds.apache.org/job/webservices/job/Apache%20WSS4J%20-%20master%20JDK11/106/display/redirect?page=changes>
Changes:
[github] Bump actions/checkout from 4.1.6 to 4.1.7 (#338)
[github] Bump github/codeql-action from 3.25.6 to 3.25.10 (#337)
[github] Bump org.apache.maven.plugins:maven-javadoc-plugin from 3.6.3 to 3.7.0 (#333)
[github] Bump com.google.guava:guava from 33.2.0-jre to 33.2.1-jre (#332)
[github] Bump com.google.errorprone:error_prone_core from 2.27.1 to 2.28.0 (#331)
[github] Bump org.apache.maven.plugins:maven-enforcer-plugin from 3.4.1 to 3.5.0 (#330)
------------------------------------------
[...truncated 12.76 KB...]
[INFO] Downloaded from Nexus: https://repository.apache.org/snapshots/org/apache/wss4j/wss4j-ws-security-stax/4.0.0-SNAPSHOT/wss4j-ws-security-stax-4.0.0-20240618.162521-54-tests.jar (364 kB at 1.4 MB/s)
[INFO] Downloading from A_maven.central: https://repo1.maven.org/maven2/org/apache/wss4j/wss4j-ws-security-stax/4.0.0-SNAPSHOT/wss4j-ws-security-stax-4.0.0-20240618.162521-54.pom
[INFO] Downloading from B_shibboleth: https://build.shibboleth.net/nexus/content/groups/public/org/apache/wss4j/wss4j-ws-security-stax/4.0.0-SNAPSHOT/wss4j-ws-security-stax-4.0.0-20240618.162521-54.pom
[INFO] Downloading from Nexus: https://repository.apache.org/snapshots/org/apache/wss4j/wss4j-ws-security-stax/4.0.0-SNAPSHOT/wss4j-ws-security-stax-4.0.0-20240618.162521-54.pom
[INFO] Downloaded from Nexus: https://repository.apache.org/snapshots/org/apache/wss4j/wss4j-ws-security-stax/4.0.0-SNAPSHOT/wss4j-ws-security-stax-4.0.0-20240618.162521-54.pom (5.6 kB at 32 kB/s)
[INFO] Downloading from B_shibboleth: https://build.shibboleth.net/nexus/content/groups/public/org/apache/wss4j/wss4j-policy/4.0.0-SNAPSHOT/maven-metadata.xml
[INFO] Downloading from A_maven.central: https://repo1.maven.org/maven2/org/apache/wss4j/wss4j-policy/4.0.0-SNAPSHOT/maven-metadata.xml
[INFO] Downloading from Nexus: https://repository.apache.org/snapshots/org/apache/wss4j/wss4j-policy/4.0.0-SNAPSHOT/maven-metadata.xml
[INFO] Downloaded from Nexus: https://repository.apache.org/snapshots/org/apache/wss4j/wss4j-policy/4.0.0-SNAPSHOT/maven-metadata.xml (1.6 kB at 4.6 kB/s)
[INFO] Downloading from Nexus: https://repository.apache.org/snapshots/org/apache/wss4j/wss4j-policy/4.0.0-SNAPSHOT/wss4j-policy-4.0.0-20240618.162521-54.jar
[INFO] Downloaded from Nexus: https://repository.apache.org/snapshots/org/apache/wss4j/wss4j-policy/4.0.0-SNAPSHOT/wss4j-policy-4.0.0-20240618.162521-54.jar (216 kB at 569 kB/s)
[WARNING] BOM dependency listed but is not depended upon: pkg:maven/commons-codec/commons-codec@1.17.0?type=jar
[INFO] CycloneDX: Creating BOM version 1.5 with 63 component(s)
[INFO] CycloneDX: Writing and validating BOM (XML): <https://ci-builds.apache.org/job/webservices/job/Apache%20WSS4J%20-%20master%20JDK11/ws/target/wss4j-4.0.0-SNAPSHOT-bom.xml>
[INFO] attaching as wss4j-4.0.0-SNAPSHOT-cyclonedx.xml
[INFO] CycloneDX: Writing and validating BOM (JSON): <https://ci-builds.apache.org/job/webservices/job/Apache%20WSS4J%20-%20master%20JDK11/ws/target/wss4j-4.0.0-SNAPSHOT-bom.json>
[INFO] attaching as wss4j-4.0.0-SNAPSHOT-cyclonedx.json
[INFO]
[INFO] --- checksum:1.11:artifacts (source-release-checksum) @ wss4j ---
[INFO] wss4j-4.0.0-SNAPSHOT-source-release.zip - SHA-512 : 002f7c2875dba742c886bd54f82e13bc6a743512fc4e314739dda822b6459cebaf4962543900f1c4bc123c909fe20ae5c6babe8da5a20ec49151ea08139ae354
[INFO]
[INFO] --- gpg:3.2.3:sign (sign-release-artifacts) @ wss4j ---
[INFO]
[INFO] --- install:3.1.1:install (default-install) @ wss4j ---
[INFO] Installing <https://ci-builds.apache.org/job/webservices/job/Apache%20WSS4J%20-%20master%20JDK11/ws/pom.xml> to /home/jenkins/.m2/repository/org/apache/wss4j/wss4j/4.0.0-SNAPSHOT/wss4j-4.0.0-SNAPSHOT.pom
[INFO] Installing <https://ci-builds.apache.org/job/webservices/job/Apache%20WSS4J%20-%20master%20JDK11/ws/target/wss4j-4.0.0-SNAPSHOT-source-release.zip> to /home/jenkins/.m2/repository/org/apache/wss4j/wss4j/4.0.0-SNAPSHOT/wss4j-4.0.0-SNAPSHOT-source-release.zip
[INFO] Installing <https://ci-builds.apache.org/job/webservices/job/Apache%20WSS4J%20-%20master%20JDK11/ws/target/wss4j-4.0.0-SNAPSHOT-bom.xml> to /home/jenkins/.m2/repository/org/apache/wss4j/wss4j/4.0.0-SNAPSHOT/wss4j-4.0.0-SNAPSHOT-cyclonedx.xml
[INFO] Installing <https://ci-builds.apache.org/job/webservices/job/Apache%20WSS4J%20-%20master%20JDK11/ws/target/wss4j-4.0.0-SNAPSHOT-bom.json> to /home/jenkins/.m2/repository/org/apache/wss4j/wss4j/4.0.0-SNAPSHOT/wss4j-4.0.0-SNAPSHOT-cyclonedx.json
[INFO] Installing <https://ci-builds.apache.org/job/webservices/job/Apache%20WSS4J%20-%20master%20JDK11/ws/target/wss4j-4.0.0-SNAPSHOT-source-release.zip.sha512> to /home/jenkins/.m2/repository/org/apache/wss4j/wss4j/4.0.0-SNAPSHOT/wss4j-4.0.0-SNAPSHOT-source-release.zip.sha512
[INFO]
[INFO] --- deploy:3.1.1:deploy (default-deploy) @ wss4j ---
[INFO] Downloading from apache.snapshots.https: https://repository.apache.org/content/repositories/snapshots/org/apache/wss4j/wss4j/4.0.0-SNAPSHOT/maven-metadata.xml
[INFO] Downloaded from apache.snapshots.https: https://repository.apache.org/content/repositories/snapshots/org/apache/wss4j/wss4j/4.0.0-SNAPSHOT/maven-metadata.xml (1.5 kB at 8.2 kB/s)
[INFO] Uploading to apache.snapshots.https: https://repository.apache.org/content/repositories/snapshots/org/apache/wss4j/wss4j/4.0.0-SNAPSHOT/wss4j-4.0.0-20240619.012548-57.pom
[INFO] Uploaded to apache.snapshots.https: https://repository.apache.org/content/repositories/snapshots/org/apache/wss4j/wss4j/4.0.0-SNAPSHOT/wss4j-4.0.0-20240619.012548-57.pom (22 kB at 18 kB/s)
[INFO] Uploading to apache.snapshots.https: https://repository.apache.org/content/repositories/snapshots/org/apache/wss4j/wss4j/4.0.0-SNAPSHOT/wss4j-4.0.0-20240619.012548-57-source-release.zip
[INFO] Uploading to apache.snapshots.https: https://repository.apache.org/content/repositories/snapshots/org/apache/wss4j/wss4j/4.0.0-SNAPSHOT/wss4j-4.0.0-20240619.012548-57-cyclonedx.xml
[INFO] Uploading to apache.snapshots.https: https://repository.apache.org/content/repositories/snapshots/org/apache/wss4j/wss4j/4.0.0-SNAPSHOT/wss4j-4.0.0-20240619.012548-57-cyclonedx.json
[INFO] Uploading to apache.snapshots.https: https://repository.apache.org/content/repositories/snapshots/org/apache/wss4j/wss4j/4.0.0-SNAPSHOT/wss4j-4.0.0-20240619.012548-57-source-release.zip.sha512
[INFO] Uploaded to apache.snapshots.https: https://repository.apache.org/content/repositories/snapshots/org/apache/wss4j/wss4j/4.0.0-SNAPSHOT/wss4j-4.0.0-20240619.012548-57-source-release.zip.sha512 (128 B at 179 B/s)
[INFO] Uploaded to apache.snapshots.https: https://repository.apache.org/content/repositories/snapshots/org/apache/wss4j/wss4j/4.0.0-SNAPSHOT/wss4j-4.0.0-20240619.012548-57-cyclonedx.json (171 kB at 89 kB/s)
[INFO] Uploaded to apache.snapshots.https: https://repository.apache.org/content/repositories/snapshots/org/apache/wss4j/wss4j/4.0.0-SNAPSHOT/wss4j-4.0.0-20240619.012548-57-cyclonedx.xml (150 kB at 78 kB/s)
[INFO] Uploaded to apache.snapshots.https: https://repository.apache.org/content/repositories/snapshots/org/apache/wss4j/wss4j/4.0.0-SNAPSHOT/wss4j-4.0.0-20240619.012548-57-source-release.zip (2.1 MB at 1.1 MB/s)
[INFO] Downloading from apache.snapshots.https: https://repository.apache.org/content/repositories/snapshots/org/apache/wss4j/wss4j/maven-metadata.xml
[INFO] Downloaded from apache.snapshots.https: https://repository.apache.org/content/repositories/snapshots/org/apache/wss4j/wss4j/maven-metadata.xml (590 B at 2.6 kB/s)
[INFO] Uploading to apache.snapshots.https: https://repository.apache.org/content/repositories/snapshots/org/apache/wss4j/wss4j/4.0.0-SNAPSHOT/maven-metadata.xml
[INFO] Uploaded to apache.snapshots.https: https://repository.apache.org/content/repositories/snapshots/org/apache/wss4j/wss4j/4.0.0-SNAPSHOT/maven-metadata.xml (1.5 kB at 1.4 kB/s)
[INFO] Uploading to apache.snapshots.https: https://repository.apache.org/content/repositories/snapshots/org/apache/wss4j/wss4j/maven-metadata.xml
[INFO] Uploaded to apache.snapshots.https: https://repository.apache.org/content/repositories/snapshots/org/apache/wss4j/wss4j/maven-metadata.xml (590 B at 558 B/s)
[WARNING] Attempt to (de-)serialize anonymous class org.jfrog.hudson.maven2.MavenDependenciesRecorder$1; see: https://jenkins.io/redirect/serialization-of-anonymous-classes/
[INFO]
[INFO] -------------------< org.apache.wss4j:wss4j-parent >--------------------
[INFO] Building Apache WSS4J parent 4.0.0-SNAPSHOT [2/10]
[INFO] from parent/pom.xml
[INFO] --------------------------------[ pom ]---------------------------------
[WARNING] Parameter 'sourceEncoding' is unknown for plugin 'maven-pmd-plugin:3.19.0:check (validate)'
[WARNING] Parameter 'sourceEncoding' is unknown for plugin 'maven-pmd-plugin:3.19.0:pmd (pmd)'
[WARNING] Parameter 'encoding' is unknown for plugin 'maven-checkstyle-plugin:3.3.1:check (validate)'
[INFO]
[INFO] --- clean:3.3.2:clean (default-clean) @ wss4j-parent ---
[INFO] Deleting <https://ci-builds.apache.org/job/webservices/job/Apache%20WSS4J%20-%20master%20JDK11/ws/parent/target>
[INFO]
[INFO] --- enforcer:3.5.0:enforce (enforce-maven-version) @ wss4j-parent ---
[INFO]
[INFO] --- enforcer:3.5.0:enforce (enforce-java-version) @ wss4j-parent ---
[INFO]
[INFO] >>> pmd:3.19.0:check (validate) > :pmd @ wss4j-parent >>>
[INFO]
[INFO] --- pmd:3.19.0:pmd (pmd) @ wss4j-parent ---
[INFO]
[INFO] <<< pmd:3.19.0:check (validate) < :pmd @ wss4j-parent <<<
[INFO]
[INFO]
[INFO] --- pmd:3.19.0:check (validate) @ wss4j-parent ---
[INFO]
[INFO] --- checkstyle:3.3.1:check (validate) @ wss4j-parent ---
[INFO] You have 0 Checkstyle violations.
[INFO]
[INFO] --- bundle:5.1.9:cleanVersions (versions) @ wss4j-parent ---
[INFO]
[INFO] --- remote-resources:3.2.0:process (process-resource-bundles) @ wss4j-parent ---
[INFO] Preparing remote bundle org.apache.apache.resources:apache-jar-resource-bundle:1.5
[INFO] Copying 3 resources from 1 bundle.
[INFO]
[INFO] --- bundle:5.1.9:manifest (bundle-manifest) @ wss4j-parent ---
[WARNING] Ignoring project type pom - supportedProjectTypes = [jar, bundle]
[INFO]
[INFO] --- assembly:3.7.1:single (source-release-assembly) @ wss4j-parent ---
[INFO] Skipping the assembly in this project because it's not the Execution Root
[INFO]
[INFO] --- source:3.3.1:jar-no-fork (attach-sources) @ wss4j-parent ---
[INFO]
[INFO] --- javadoc:3.7.0:jar (default) @ wss4j-parent ---
[INFO] Not executing Javadoc as the project is not a Java classpath-capable package
[INFO]
[INFO] --- javadoc:3.7.0:jar (attach-javadocs) @ wss4j-parent ---
[INFO] Not executing Javadoc as the project is not a Java classpath-capable package
[INFO]
[INFO] --- cyclonedx:2.8.0:makeAggregateBom (make-bom) @ wss4j-parent ---
[INFO] CycloneDX: Resolving Dependencies
[INFO] CycloneDX: Creating BOM version 1.5 with 0 component(s)
[INFO] CycloneDX: Writing and validating BOM (XML): <https://ci-builds.apache.org/job/webservices/job/Apache%20WSS4J%20-%20master%20JDK11/ws/parent/target/wss4j-parent-4.0.0-SNAPSHOT-bom.xml>
[INFO] attaching as wss4j-parent-4.0.0-SNAPSHOT-cyclonedx.xml
[INFO] CycloneDX: Writing and validating BOM (JSON): <https://ci-builds.apache.org/job/webservices/job/Apache%20WSS4J%20-%20master%20JDK11/ws/parent/target/wss4j-parent-4.0.0-SNAPSHOT-bom.json>
[INFO] attaching as wss4j-parent-4.0.0-SNAPSHOT-cyclonedx.json
[INFO]
[INFO] --- checksum:1.11:artifacts (source-release-checksum) @ wss4j-parent ---
[INFO]
[INFO] --- gpg:3.2.3:sign (sign-release-artifacts) @ wss4j-parent ---
[INFO]
[INFO] --- install:3.1.1:install (default-install) @ wss4j-parent ---
[INFO] Installing <https://ci-builds.apache.org/job/webservices/job/Apache%20WSS4J%20-%20master%20JDK11/ws/parent/pom.xml> to /home/jenkins/.m2/repository/org/apache/wss4j/wss4j-parent/4.0.0-SNAPSHOT/wss4j-parent-4.0.0-SNAPSHOT.pom
[INFO] Installing <https://ci-builds.apache.org/job/webservices/job/Apache%20WSS4J%20-%20master%20JDK11/ws/parent/target/wss4j-parent-4.0.0-SNAPSHOT-bom.xml> to /home/jenkins/.m2/repository/org/apache/wss4j/wss4j-parent/4.0.0-SNAPSHOT/wss4j-parent-4.0.0-SNAPSHOT-cyclonedx.xml
[INFO] Installing <https://ci-builds.apache.org/job/webservices/job/Apache%20WSS4J%20-%20master%20JDK11/ws/parent/target/wss4j-parent-4.0.0-SNAPSHOT-bom.json> to /home/jenkins/.m2/repository/org/apache/wss4j/wss4j-parent/4.0.0-SNAPSHOT/wss4j-parent-4.0.0-SNAPSHOT-cyclonedx.json
[INFO]
[INFO] --- deploy:3.1.1:deploy (default-deploy) @ wss4j-parent ---
[INFO] Downloading from apache.snapshots.https: https://repository.apache.org/content/repositories/snapshots/org/apache/wss4j/wss4j-parent/4.0.0-SNAPSHOT/maven-metadata.xml
[INFO] Downloaded from apache.snapshots.https: https://repository.apache.org/content/repositories/snapshots/org/apache/wss4j/wss4j-parent/4.0.0-SNAPSHOT/maven-metadata.xml (1.0 kB at 1.9 kB/s)
[INFO] Uploading to apache.snapshots.https: https://repository.apache.org/content/repositories/snapshots/org/apache/wss4j/wss4j-parent/4.0.0-SNAPSHOT/wss4j-parent-4.0.0-20240619.012548-57.pom
[INFO] Uploaded to apache.snapshots.https: https://repository.apache.org/content/repositories/snapshots/org/apache/wss4j/wss4j-parent/4.0.0-SNAPSHOT/wss4j-parent-4.0.0-20240619.012548-57.pom (16 kB at 13 kB/s)
[INFO] Uploading to apache.snapshots.https: https://repository.apache.org/content/repositories/snapshots/org/apache/wss4j/wss4j-parent/4.0.0-SNAPSHOT/wss4j-parent-4.0.0-20240619.012548-57-cyclonedx.xml
[INFO] Uploading to apache.snapshots.https: https://repository.apache.org/content/repositories/snapshots/org/apache/wss4j/wss4j-parent/4.0.0-SNAPSHOT/wss4j-parent-4.0.0-20240619.012548-57-cyclonedx.json
[INFO] Uploaded to apache.snapshots.https: https://repository.apache.org/content/repositories/snapshots/org/apache/wss4j/wss4j-parent/4.0.0-SNAPSHOT/wss4j-parent-4.0.0-20240619.012548-57-cyclonedx.xml (3.0 kB at 2.9 kB/s)
[INFO] Uploaded to apache.snapshots.https: https://repository.apache.org/content/repositories/snapshots/org/apache/wss4j/wss4j-parent/4.0.0-SNAPSHOT/wss4j-parent-4.0.0-20240619.012548-57-cyclonedx.json (3.4 kB at 2.4 kB/s)
[INFO] Downloading from apache.snapshots.https: https://repository.apache.org/content/repositories/snapshots/org/apache/wss4j/wss4j-parent/maven-metadata.xml
[INFO] Downloaded from apache.snapshots.https: https://repository.apache.org/content/repositories/snapshots/org/apache/wss4j/wss4j-parent/maven-metadata.xml (597 B at 3.3 kB/s)
[INFO] Uploading to apache.snapshots.https: https://repository.apache.org/content/repositories/snapshots/org/apache/wss4j/wss4j-parent/4.0.0-SNAPSHOT/maven-metadata.xml
[INFO] Uploaded to apache.snapshots.https: https://repository.apache.org/content/repositories/snapshots/org/apache/wss4j/wss4j-parent/4.0.0-SNAPSHOT/maven-metadata.xml (1.0 kB at 990 B/s)
[INFO] Uploading to apache.snapshots.https: https://repository.apache.org/content/repositories/snapshots/org/apache/wss4j/wss4j-parent/maven-metadata.xml
[INFO] Uploaded to apache.snapshots.https: https://repository.apache.org/content/repositories/snapshots/org/apache/wss4j/wss4j-parent/maven-metadata.xml (597 B at 549 B/s)
[INFO]
[INFO] ------------------< org.apache.wss4j:wss4j-bindings >-------------------
[INFO] Building Apache WSS4J WS-Security Bindings 4.0.0-SNAPSHOT [3/10]
[INFO] from bindings/pom.xml
[INFO] --------------------------------[ jar ]---------------------------------
[WARNING] Parameter 'sourceEncoding' is unknown for plugin 'maven-pmd-plugin:3.19.0:check (validate)'
[WARNING] Parameter 'sourceEncoding' is unknown for plugin 'maven-pmd-plugin:3.19.0:pmd (pmd)'
[WARNING] Parameter 'encoding' is unknown for plugin 'maven-checkstyle-plugin:3.3.1:check (validate)'
[INFO]
[INFO] --- clean:3.3.2:clean (default-clean) @ wss4j-bindings ---
[INFO] Deleting <https://ci-builds.apache.org/job/webservices/job/Apache%20WSS4J%20-%20master%20JDK11/ws/bindings/target>
[INFO]
[INFO] --- enforcer:3.5.0:enforce (enforce-maven-version) @ wss4j-bindings ---
[INFO]
[INFO] --- enforcer:3.5.0:enforce (enforce-java-version) @ wss4j-bindings ---
[INFO]
[INFO] >>> pmd:3.19.0:check (validate) > :pmd @ wss4j-bindings >>>
[INFO]
[INFO] --- pmd:3.19.0:pmd (pmd) @ wss4j-bindings ---
[INFO] PMD version: 6.49.0
[WARNING] Removed misconfigured rule: LoosePackageCoupling cause: No packages or classes specified
[INFO] Rendering content with org.apache.maven.skins:maven-default-skin:jar:1.3 skin.
[INFO]
[INFO] <<< pmd:3.19.0:check (validate) < :pmd @ wss4j-bindings <<<
[INFO]
[INFO]
[INFO] --- pmd:3.19.0:check (validate) @ wss4j-bindings ---
[INFO] PMD version: 6.49.0
[INFO]
[INFO]
[INFO] --- checkstyle:3.3.1:check (validate) @ wss4j-bindings ---
[INFO]
[INFO] --- bundle:5.1.9:cleanVersions (versions) @ wss4j-bindings ---
[INFO]
[INFO] --- remote-resources:3.2.0:process (process-resource-bundles) @ wss4j-bindings ---
[INFO] Preparing remote bundle org.apache.apache.resources:apache-jar-resource-bundle:1.5
[INFO] Copying 3 resources from 1 bundle.
[INFO]
[INFO] --- resources:3.3.1:resources (default-resources) @ wss4j-bindings ---
[INFO] Copying 0 resource from src/main/java to target/classes
[INFO] skip non existing resourceDirectory <https://ci-builds.apache.org/job/webservices/job/Apache%20WSS4J%20-%20master%20JDK11/ws/bindings/src/main/resources>
[INFO] skip non existing resourceDirectory <https://ci-builds.apache.org/job/webservices/job/Apache%20WSS4J%20-%20master%20JDK11/ws/bindings/src/main/resources-filtered>
[INFO] skip non existing resourceDirectory <https://ci-builds.apache.org/job/webservices/job/Apache%20WSS4J%20-%20master%20JDK11/ws/bindings/target/generated/src/main/resources>
[INFO] Copying 3 resources from target/maven-shared-archive-resources to target/classes
[INFO]
[INFO] --- compiler:3.13.0:compile (default-compile) @ wss4j-bindings ---
[INFO] Downloading from A_maven.central: https://repo1.maven.org/maven2/com/google/errorprone/error_prone_core/2.28.0/error_prone_core-2.28.0.pom
[INFO] Downloaded from A_maven.central: https://repo1.maven.org/maven2/com/google/errorprone/error_prone_core/2.28.0/error_prone_core-2.28.0.pom (17 kB at 345 kB/s)
[INFO] Downloading from A_maven.central: https://repo1.maven.org/maven2/com/google/errorprone/error_prone_annotation/2.28.0/error_prone_annotation-2.28.0.pom
[INFO] Downloaded from A_maven.central: https://repo1.maven.org/maven2/com/google/errorprone/error_prone_annotation/2.28.0/error_prone_annotation-2.28.0.pom (1.8 kB at 47 kB/s)
[INFO] Downloading from A_maven.central: https://repo1.maven.org/maven2/com/google/errorprone/error_prone_type_annotations/2.28.0/error_prone_type_annotations-2.28.0.pom
[INFO] Downloaded from A_maven.central: https://repo1.maven.org/maven2/com/google/errorprone/error_prone_type_annotations/2.28.0/error_prone_type_annotations-2.28.0.pom (1.9 kB at 62 kB/s)
[INFO] Downloading from A_maven.central: https://repo1.maven.org/maven2/com/google/errorprone/error_prone_check_api/2.28.0/error_prone_check_api-2.28.0.pom
[INFO] Downloaded from A_maven.central: https://repo1.maven.org/maven2/com/google/errorprone/error_prone_check_api/2.28.0/error_prone_check_api-2.28.0.pom (5.5 kB at 165 kB/s)
[INFO] Downloading from A_maven.central: https://repo1.maven.org/maven2/com/google/errorprone/error_prone_core/2.28.0/error_prone_core-2.28.0.jar
[INFO] Downloaded from A_maven.central: https://repo1.maven.org/maven2/com/google/errorprone/error_prone_core/2.28.0/error_prone_core-2.28.0.jar (4.5 MB at 14 MB/s)
[INFO] Downloading from A_maven.central: https://repo1.maven.org/maven2/com/google/errorprone/error_prone_annotation/2.28.0/error_prone_annotation-2.28.0.jar
[INFO] Downloading from A_maven.central: https://repo1.maven.org/maven2/com/google/errorprone/error_prone_type_annotations/2.28.0/error_prone_type_annotations-2.28.0.jar
[INFO] Downloading from A_maven.central: https://repo1.maven.org/maven2/com/google/errorprone/error_prone_check_api/2.28.0/error_prone_check_api-2.28.0.jar
[INFO] Downloaded from A_maven.central: https://repo1.maven.org/maven2/com/google/errorprone/error_prone_annotation/2.28.0/error_prone_annotation-2.28.0.jar (8.2 kB at 216 kB/s)
[INFO] Downloaded from A_maven.central: https://repo1.maven.org/maven2/com/google/errorprone/error_prone_type_annotations/2.28.0/error_prone_type_annotations-2.28.0.jar (3.5 kB at 33 kB/s)
[INFO] Downloaded from A_maven.central: https://repo1.maven.org/maven2/com/google/errorprone/error_prone_check_api/2.28.0/error_prone_check_api-2.28.0.jar (706 kB at 3.3 MB/s)
[INFO] Recompiling the module because of changed source code.
[INFO] Compiling 36 source files with javac [debug release 17] to target/classes
[INFO] ------------------------------------------------------------------------
[INFO] Reactor Summary for Apache WSS4J 4.0.0-SNAPSHOT:
[INFO]
[INFO] Apache WSS4J ....................................... SUCCESS [ 44.967 s]
[INFO] Apache WSS4J parent ................................ SUCCESS [ 13.681 s]
[INFO] Apache WSS4J WS-Security Bindings .................. FAILURE [ 9.082 s]
[INFO] Apache WSS4J WS-SecurityPolicy model ............... SKIPPED
[INFO] Apache WSS4J WS-Security Common .................... SKIPPED
[INFO] Apache WSS4J DOM WS-Security ....................... SKIPPED
[INFO] Apache WSS4J Streaming WS-Security ................. SKIPPED
[INFO] Apache WSS4J Web WS-Security ....................... SKIPPED
[INFO] Apache WSS4J WS-Security Integration ............... SKIPPED
[INFO] Apache WSS4J Streaming WS-SecurityPolicy ........... SKIPPED
[INFO] ------------------------------------------------------------------------
[INFO] BUILD FAILURE
[INFO] ------------------------------------------------------------------------
[INFO] Total time: 01:37 min
[INFO] Finished at: 2024-06-19T01:27:25Z
[INFO] ------------------------------------------------------------------------
Waiting for Jenkins to finish collecting data
[ERROR] Failed to execute goal org.apache.maven.plugins:maven-compiler-plugin:3.13.0:compile (default-compile) on project wss4j-bindings: Fatal error compiling: error: release version 17 not supported -> [Help 1]
[ERROR]
[ERROR] To see the full stack trace of the errors, re-run Maven with the -e switch.
[ERROR] Re-run Maven using the -X switch to enable full debug logging.
[ERROR]
[ERROR] For more information about the errors and possible solutions, please read the following articles:
[ERROR] [Help 1] http://cwiki.apache.org/confluence/display/MAVEN/MojoExecutionException
[ERROR]
[ERROR] After correcting the problems, you can resume the build with the command
[ERROR] mvn <goals> -rf :wss4j-bindings
[JENKINS] Archiving <https://ci-builds.apache.org/job/webservices/job/Apache%20WSS4J%20-%20master%20JDK11/ws/bindings/pom.xml> to org.apache.wss4j/wss4j-bindings/4.0.0-SNAPSHOT/wss4j-bindings-4.0.0-SNAPSHOT.pom
[JENKINS] Archiving <https://ci-builds.apache.org/job/webservices/job/Apache%20WSS4J%20-%20master%20JDK11/ws/ws-security-policy-stax/pom.xml> to org.apache.wss4j/wss4j-ws-security-policy-stax/4.0.0-SNAPSHOT/wss4j-ws-security-policy-stax-4.0.0-SNAPSHOT.pom
[JENKINS] Archiving <https://ci-builds.apache.org/job/webservices/job/Apache%20WSS4J%20-%20master%20JDK11/ws/ws-security-common/pom.xml> to org.apache.wss4j/wss4j-ws-security-common/4.0.0-SNAPSHOT/wss4j-ws-security-common-4.0.0-SNAPSHOT.pom
[JENKINS] Archiving <https://ci-builds.apache.org/job/webservices/job/Apache%20WSS4J%20-%20master%20JDK11/ws/ws-security-dom/pom.xml> to org.apache.wss4j/wss4j-ws-security-dom/4.0.0-SNAPSHOT/wss4j-ws-security-dom-4.0.0-SNAPSHOT.pom
[JENKINS] Archiving <https://ci-builds.apache.org/job/webservices/job/Apache%20WSS4J%20-%20master%20JDK11/ws/policy/pom.xml> to org.apache.wss4j/wss4j-policy/4.0.0-SNAPSHOT/wss4j-policy-4.0.0-SNAPSHOT.pom
[JENKINS] Archiving <https://ci-builds.apache.org/job/webservices/job/Apache%20WSS4J%20-%20master%20JDK11/ws/integration/pom.xml> to org.apache.wss4j/wss4j-integration/4.0.0-SNAPSHOT/wss4j-integration-4.0.0-SNAPSHOT.pom
[JENKINS] Archiving <https://ci-builds.apache.org/job/webservices/job/Apache%20WSS4J%20-%20master%20JDK11/ws/ws-security-stax/pom.xml> to org.apache.wss4j/wss4j-ws-security-stax/4.0.0-SNAPSHOT/wss4j-ws-security-stax-4.0.0-SNAPSHOT.pom
[JENKINS] Archiving <https://ci-builds.apache.org/job/webservices/job/Apache%20WSS4J%20-%20master%20JDK11/ws/parent/pom.xml> to org.apache.wss4j/wss4j-parent/4.0.0-SNAPSHOT/wss4j-parent-4.0.0-SNAPSHOT.pom
[JENKINS] Archiving <https://ci-builds.apache.org/job/webservices/job/Apache%20WSS4J%20-%20master%20JDK11/ws/parent/target/wss4j-parent-4.0.0-SNAPSHOT-bom.xml> to org.apache.wss4j/wss4j-parent/4.0.0-SNAPSHOT/wss4j-parent-4.0.0-SNAPSHOT-cyclonedx.xml
[JENKINS] Archiving <https://ci-builds.apache.org/job/webservices/job/Apache%20WSS4J%20-%20master%20JDK11/ws/parent/target/wss4j-parent-4.0.0-SNAPSHOT-bom.json> to org.apache.wss4j/wss4j-parent/4.0.0-SNAPSHOT/wss4j-parent-4.0.0-SNAPSHOT-cyclonedx.json
[JENKINS] Archiving <https://ci-builds.apache.org/job/webservices/job/Apache%20WSS4J%20-%20master%20JDK11/ws/pom.xml> to org.apache.wss4j/wss4j/4.0.0-SNAPSHOT/wss4j-4.0.0-SNAPSHOT.pom
[JENKINS] Archiving <https://ci-builds.apache.org/job/webservices/job/Apache%20WSS4J%20-%20master%20JDK11/ws/target/wss4j-4.0.0-SNAPSHOT-source-release.zip> to org.apache.wss4j/wss4j/4.0.0-SNAPSHOT/wss4j-4.0.0-SNAPSHOT-source-release.zip
[JENKINS] Archiving <https://ci-builds.apache.org/job/webservices/job/Apache%20WSS4J%20-%20master%20JDK11/ws/target/wss4j-4.0.0-SNAPSHOT-bom.xml> to org.apache.wss4j/wss4j/4.0.0-SNAPSHOT/wss4j-4.0.0-SNAPSHOT-cyclonedx.xml
[JENKINS] Archiving <https://ci-builds.apache.org/job/webservices/job/Apache%20WSS4J%20-%20master%20JDK11/ws/target/wss4j-4.0.0-SNAPSHOT-bom.json> to org.apache.wss4j/wss4j/4.0.0-SNAPSHOT/wss4j-4.0.0-SNAPSHOT-cyclonedx.json
[JENKINS] Archiving <https://ci-builds.apache.org/job/webservices/job/Apache%20WSS4J%20-%20master%20JDK11/ws/target/wss4j-4.0.0-SNAPSHOT-source-release.zip.sha512> to org.apache.wss4j/wss4j/4.0.0-SNAPSHOT/wss4j-4.0.0-SNAPSHOT-source-release.zip.sha512
[JENKINS] Archiving <https://ci-builds.apache.org/job/webservices/job/Apache%20WSS4J%20-%20master%20JDK11/ws/ws-security-web/pom.xml> to org.apache.wss4j/wss4j-ws-security-web/4.0.0-SNAPSHOT/wss4j-ws-security-web-4.0.0-SNAPSHOT.pom
Sending e-mails to: dev@ws.apache.org
No mail will be sent out, as 'webservices » Apache WSS4J - master JDK11 » Apache WSS4J Streaming WS-SecurityPolicy #106' does not have a result yet. Please make sure you set a proper result in case of pipeline/build scripts.
No mail will be sent out, as 'webservices » Apache WSS4J - master JDK11 » Apache WSS4J WS-Security Common #106' does not have a result yet. Please make sure you set a proper result in case of pipeline/build scripts.
No mail will be sent out, as 'webservices » Apache WSS4J - master JDK11 » Apache WSS4J DOM WS-Security #106' does not have a result yet. Please make sure you set a proper result in case of pipeline/build scripts.
No mail will be sent out, as 'webservices » Apache WSS4J - master JDK11 » Apache WSS4J WS-SecurityPolicy model #106' does not have a result yet. Please make sure you set a proper result in case of pipeline/build scripts.
No mail will be sent out, as 'webservices » Apache WSS4J - master JDK11 » Apache WSS4J WS-Security Integration #106' does not have a result yet. Please make sure you set a proper result in case of pipeline/build scripts.
No mail will be sent out, as 'webservices » Apache WSS4J - master JDK11 » Apache WSS4J Streaming WS-Security #106' does not have a result yet. Please make sure you set a proper result in case of pipeline/build scripts.
No mail will be sent out, as 'webservices » Apache WSS4J - master JDK11 » Apache WSS4J Web WS-Security #106' does not have a result yet. Please make sure you set a proper result in case of pipeline/build scripts.
channel stopped
---------------------------------------------------------------------
To unsubscribe, e-mail: dev-unsubscribe@ws.apache.org
For additional commands, e-mail: dev-help@ws.apache.org
Build failed in Jenkins: webservices » Apache WSS4J - master JDK11 #113
Posted by Apache Jenkins Server <je...@builds.apache.org>.
See <https://ci-builds.apache.org/job/webservices/job/Apache%20WSS4J%20-%20master%20JDK11/113/display/redirect>
Changes:
------------------------------------------
[...truncated 12.12 KB...]
[INFO] Downloaded from Nexus: https://repository.apache.org/snapshots/org/apache/wss4j/wss4j-bindings/4.0.0-SNAPSHOT/wss4j-bindings-4.0.0-20240722.101423-60.jar (44 kB at 243 kB/s)
[INFO] Downloading from Nexus: https://repository.apache.org/snapshots/org/apache/wss4j/wss4j-ws-security-dom/4.0.0-SNAPSHOT/wss4j-ws-security-dom-4.0.0-20240722.101423-60.jar
[INFO] Downloaded from Nexus: https://repository.apache.org/snapshots/org/apache/wss4j/wss4j-ws-security-dom/4.0.0-SNAPSHOT/wss4j-ws-security-dom-4.0.0-20240722.101423-60.jar (349 kB at 670 kB/s)
[INFO] Downloading from Nexus: https://repository.apache.org/snapshots/org/apache/wss4j/wss4j-ws-security-dom/4.0.0-SNAPSHOT/wss4j-ws-security-dom-4.0.0-20240722.101423-60-tests.jar
[INFO] Downloaded from Nexus: https://repository.apache.org/snapshots/org/apache/wss4j/wss4j-ws-security-dom/4.0.0-SNAPSHOT/wss4j-ws-security-dom-4.0.0-20240722.101423-60-tests.jar (425 kB at 1.3 MB/s)
[INFO] Downloading from A_maven.central: https://repo1.maven.org/maven2/org/apache/wss4j/wss4j-ws-security-dom/4.0.0-SNAPSHOT/wss4j-ws-security-dom-4.0.0-20240722.101423-60.pom
[INFO] Downloading from B_shibboleth: https://build.shibboleth.net/nexus/content/groups/public/org/apache/wss4j/wss4j-ws-security-dom/4.0.0-SNAPSHOT/wss4j-ws-security-dom-4.0.0-20240722.101423-60.pom
[INFO] Downloading from Nexus: https://repository.apache.org/snapshots/org/apache/wss4j/wss4j-ws-security-dom/4.0.0-SNAPSHOT/wss4j-ws-security-dom-4.0.0-20240722.101423-60.pom
[INFO] Downloaded from Nexus: https://repository.apache.org/snapshots/org/apache/wss4j/wss4j-ws-security-dom/4.0.0-SNAPSHOT/wss4j-ws-security-dom-4.0.0-20240722.101423-60.pom (5.2 kB at 30 kB/s)
[INFO] Downloading from A_maven.central: https://repo1.maven.org/maven2/org/apache/wss4j/wss4j-ws-security-stax/4.0.0-SNAPSHOT/maven-metadata.xml
[INFO] Downloading from B_shibboleth: https://build.shibboleth.net/nexus/content/groups/public/org/apache/wss4j/wss4j-ws-security-stax/4.0.0-SNAPSHOT/maven-metadata.xml
[INFO] Downloading from Nexus: https://repository.apache.org/snapshots/org/apache/wss4j/wss4j-ws-security-stax/4.0.0-SNAPSHOT/maven-metadata.xml
[INFO] Downloaded from Nexus: https://repository.apache.org/snapshots/org/apache/wss4j/wss4j-ws-security-stax/4.0.0-SNAPSHOT/maven-metadata.xml (1.9 kB at 5.2 kB/s)
[INFO] Downloading from Nexus: https://repository.apache.org/snapshots/org/apache/wss4j/wss4j-ws-security-stax/4.0.0-SNAPSHOT/wss4j-ws-security-stax-4.0.0-20240722.101423-60.jar
[INFO] Downloaded from Nexus: https://repository.apache.org/snapshots/org/apache/wss4j/wss4j-ws-security-stax/4.0.0-SNAPSHOT/wss4j-ws-security-stax-4.0.0-20240722.101423-60.jar (417 kB at 573 kB/s)
[INFO] Downloading from Nexus: https://repository.apache.org/snapshots/org/apache/wss4j/wss4j-ws-security-stax/4.0.0-SNAPSHOT/wss4j-ws-security-stax-4.0.0-20240722.101423-60-tests.jar
[INFO] Downloaded from Nexus: https://repository.apache.org/snapshots/org/apache/wss4j/wss4j-ws-security-stax/4.0.0-SNAPSHOT/wss4j-ws-security-stax-4.0.0-20240722.101423-60-tests.jar (364 kB at 1.1 MB/s)
[INFO] Downloading from A_maven.central: https://repo1.maven.org/maven2/org/apache/wss4j/wss4j-ws-security-stax/4.0.0-SNAPSHOT/wss4j-ws-security-stax-4.0.0-20240722.101423-60.pom
[INFO] Downloading from B_shibboleth: https://build.shibboleth.net/nexus/content/groups/public/org/apache/wss4j/wss4j-ws-security-stax/4.0.0-SNAPSHOT/wss4j-ws-security-stax-4.0.0-20240722.101423-60.pom
[INFO] Downloading from Nexus: https://repository.apache.org/snapshots/org/apache/wss4j/wss4j-ws-security-stax/4.0.0-SNAPSHOT/wss4j-ws-security-stax-4.0.0-20240722.101423-60.pom
[INFO] Downloaded from Nexus: https://repository.apache.org/snapshots/org/apache/wss4j/wss4j-ws-security-stax/4.0.0-SNAPSHOT/wss4j-ws-security-stax-4.0.0-20240722.101423-60.pom (5.6 kB at 21 kB/s)
[INFO] Downloading from Nexus: https://repository.apache.org/snapshots/org/apache/wss4j/wss4j-policy/4.0.0-SNAPSHOT/maven-metadata.xml
[INFO] Downloading from B_shibboleth: https://build.shibboleth.net/nexus/content/groups/public/org/apache/wss4j/wss4j-policy/4.0.0-SNAPSHOT/maven-metadata.xml
[INFO] Downloading from A_maven.central: https://repo1.maven.org/maven2/org/apache/wss4j/wss4j-policy/4.0.0-SNAPSHOT/maven-metadata.xml
[INFO] Downloaded from Nexus: https://repository.apache.org/snapshots/org/apache/wss4j/wss4j-policy/4.0.0-SNAPSHOT/maven-metadata.xml (1.6 kB at 4.5 kB/s)
[INFO] Downloading from Nexus: https://repository.apache.org/snapshots/org/apache/wss4j/wss4j-policy/4.0.0-SNAPSHOT/wss4j-policy-4.0.0-20240722.101423-60.jar
[INFO] Downloaded from Nexus: https://repository.apache.org/snapshots/org/apache/wss4j/wss4j-policy/4.0.0-SNAPSHOT/wss4j-policy-4.0.0-20240722.101423-60.jar (216 kB at 417 kB/s)
[WARNING] BOM dependency listed but is not depended upon: pkg:maven/commons-codec/commons-codec@1.17.0?type=jar
[INFO] CycloneDX: Creating BOM version 1.5 with 63 component(s)
[INFO] CycloneDX: Writing and validating BOM (XML): <https://ci-builds.apache.org/job/webservices/job/Apache%20WSS4J%20-%20master%20JDK11/ws/target/wss4j-4.0.0-SNAPSHOT-bom.xml>
[INFO] attaching as wss4j-4.0.0-SNAPSHOT-cyclonedx.xml
[INFO] CycloneDX: Writing and validating BOM (JSON): <https://ci-builds.apache.org/job/webservices/job/Apache%20WSS4J%20-%20master%20JDK11/ws/target/wss4j-4.0.0-SNAPSHOT-bom.json>
[INFO] attaching as wss4j-4.0.0-SNAPSHOT-cyclonedx.json
[INFO]
[INFO] --- checksum:1.11:artifacts (source-release-checksum) @ wss4j ---
[INFO] wss4j-4.0.0-SNAPSHOT-source-release.zip - SHA-512 : a2aa7ea510994c238e70e20eee92ea6fa9b97d46db7739044772e2d0159f642d7bb8960db826366a165a76ed869d9c1c534b35402016210368cfdb115f04be10
[INFO]
[INFO] --- gpg:3.2.4:sign (sign-release-artifacts) @ wss4j ---
[INFO]
[INFO] --- install:3.1.2:install (default-install) @ wss4j ---
[INFO] Installing <https://ci-builds.apache.org/job/webservices/job/Apache%20WSS4J%20-%20master%20JDK11/ws/pom.xml> to /home/jenkins/.m2/repository/org/apache/wss4j/wss4j/4.0.0-SNAPSHOT/wss4j-4.0.0-SNAPSHOT.pom
[INFO] Installing <https://ci-builds.apache.org/job/webservices/job/Apache%20WSS4J%20-%20master%20JDK11/ws/target/wss4j-4.0.0-SNAPSHOT-source-release.zip> to /home/jenkins/.m2/repository/org/apache/wss4j/wss4j/4.0.0-SNAPSHOT/wss4j-4.0.0-SNAPSHOT-source-release.zip
[INFO] Installing <https://ci-builds.apache.org/job/webservices/job/Apache%20WSS4J%20-%20master%20JDK11/ws/target/wss4j-4.0.0-SNAPSHOT-bom.xml> to /home/jenkins/.m2/repository/org/apache/wss4j/wss4j/4.0.0-SNAPSHOT/wss4j-4.0.0-SNAPSHOT-cyclonedx.xml
[INFO] Installing <https://ci-builds.apache.org/job/webservices/job/Apache%20WSS4J%20-%20master%20JDK11/ws/target/wss4j-4.0.0-SNAPSHOT-bom.json> to /home/jenkins/.m2/repository/org/apache/wss4j/wss4j/4.0.0-SNAPSHOT/wss4j-4.0.0-SNAPSHOT-cyclonedx.json
[INFO] Installing <https://ci-builds.apache.org/job/webservices/job/Apache%20WSS4J%20-%20master%20JDK11/ws/target/wss4j-4.0.0-SNAPSHOT-source-release.zip.sha512> to /home/jenkins/.m2/repository/org/apache/wss4j/wss4j/4.0.0-SNAPSHOT/wss4j-4.0.0-SNAPSHOT-source-release.zip.sha512
[INFO]
[INFO] --- deploy:3.1.2:deploy (default-deploy) @ wss4j ---
[INFO] Downloading from apache.snapshots.https: https://repository.apache.org/content/repositories/snapshots/org/apache/wss4j/wss4j/4.0.0-SNAPSHOT/maven-metadata.xml
[INFO] Downloaded from apache.snapshots.https: https://repository.apache.org/content/repositories/snapshots/org/apache/wss4j/wss4j/4.0.0-SNAPSHOT/maven-metadata.xml (1.5 kB at 8.3 kB/s)
[INFO] Uploading to apache.snapshots.https: https://repository.apache.org/content/repositories/snapshots/org/apache/wss4j/wss4j/4.0.0-SNAPSHOT/wss4j-4.0.0-20240807.100900-70.pom
[INFO] Uploaded to apache.snapshots.https: https://repository.apache.org/content/repositories/snapshots/org/apache/wss4j/wss4j/4.0.0-SNAPSHOT/wss4j-4.0.0-20240807.100900-70.pom (22 kB at 17 kB/s)
[INFO] Uploading to apache.snapshots.https: https://repository.apache.org/content/repositories/snapshots/org/apache/wss4j/wss4j/4.0.0-SNAPSHOT/wss4j-4.0.0-20240807.100900-70-source-release.zip
[INFO] Uploading to apache.snapshots.https: https://repository.apache.org/content/repositories/snapshots/org/apache/wss4j/wss4j/4.0.0-SNAPSHOT/wss4j-4.0.0-20240807.100900-70-cyclonedx.xml
[INFO] Uploading to apache.snapshots.https: https://repository.apache.org/content/repositories/snapshots/org/apache/wss4j/wss4j/4.0.0-SNAPSHOT/wss4j-4.0.0-20240807.100900-70-cyclonedx.json
[INFO] Uploading to apache.snapshots.https: https://repository.apache.org/content/repositories/snapshots/org/apache/wss4j/wss4j/4.0.0-SNAPSHOT/wss4j-4.0.0-20240807.100900-70-source-release.zip.sha512
[INFO] Uploaded to apache.snapshots.https: https://repository.apache.org/content/repositories/snapshots/org/apache/wss4j/wss4j/4.0.0-SNAPSHOT/wss4j-4.0.0-20240807.100900-70-source-release.zip.sha512 (128 B at 176 B/s)
[INFO] Uploaded to apache.snapshots.https: https://repository.apache.org/content/repositories/snapshots/org/apache/wss4j/wss4j/4.0.0-SNAPSHOT/wss4j-4.0.0-20240807.100900-70-source-release.zip (2.1 MB at 1.1 MB/s)
[INFO] Uploaded to apache.snapshots.https: https://repository.apache.org/content/repositories/snapshots/org/apache/wss4j/wss4j/4.0.0-SNAPSHOT/wss4j-4.0.0-20240807.100900-70-cyclonedx.xml (150 kB at 76 kB/s)
[INFO] Uploaded to apache.snapshots.https: https://repository.apache.org/content/repositories/snapshots/org/apache/wss4j/wss4j/4.0.0-SNAPSHOT/wss4j-4.0.0-20240807.100900-70-cyclonedx.json (171 kB at 87 kB/s)
[INFO] Downloading from apache.snapshots.https: https://repository.apache.org/content/repositories/snapshots/org/apache/wss4j/wss4j/maven-metadata.xml
[INFO] Downloaded from apache.snapshots.https: https://repository.apache.org/content/repositories/snapshots/org/apache/wss4j/wss4j/maven-metadata.xml (590 B at 3.2 kB/s)
[INFO] Uploading to apache.snapshots.https: https://repository.apache.org/content/repositories/snapshots/org/apache/wss4j/wss4j/4.0.0-SNAPSHOT/maven-metadata.xml
[INFO] Uploaded to apache.snapshots.https: https://repository.apache.org/content/repositories/snapshots/org/apache/wss4j/wss4j/4.0.0-SNAPSHOT/maven-metadata.xml (1.5 kB at 1.4 kB/s)
[INFO] Uploading to apache.snapshots.https: https://repository.apache.org/content/repositories/snapshots/org/apache/wss4j/wss4j/maven-metadata.xml
[INFO] Uploaded to apache.snapshots.https: https://repository.apache.org/content/repositories/snapshots/org/apache/wss4j/wss4j/maven-metadata.xml (590 B at 560 B/s)
[WARNING] Attempt to (de-)serialize anonymous class org.jfrog.hudson.maven2.MavenDependenciesRecorder$1; see: https://jenkins.io/redirect/serialization-of-anonymous-classes/
[INFO]
[INFO] -------------------< org.apache.wss4j:wss4j-parent >--------------------
[INFO] Building Apache WSS4J parent 4.0.0-SNAPSHOT [2/10]
[INFO] from parent/pom.xml
[INFO] --------------------------------[ pom ]---------------------------------
[WARNING] Parameter 'sourceEncoding' is unknown for plugin 'maven-pmd-plugin:3.19.0:check (validate)'
[WARNING] Parameter 'sourceEncoding' is unknown for plugin 'maven-pmd-plugin:3.19.0:pmd (pmd)'
[WARNING] Parameter 'encoding' is unknown for plugin 'maven-checkstyle-plugin:3.4.0:check (validate)'
[INFO]
[INFO] --- clean:3.4.0:clean (default-clean) @ wss4j-parent ---
[INFO] Deleting <https://ci-builds.apache.org/job/webservices/job/Apache%20WSS4J%20-%20master%20JDK11/ws/parent/target>
[INFO]
[INFO] --- enforcer:3.5.0:enforce (enforce-maven-version) @ wss4j-parent ---
[INFO]
[INFO] --- enforcer:3.5.0:enforce (enforce-java-version) @ wss4j-parent ---
[INFO]
[INFO] >>> pmd:3.19.0:check (validate) > :pmd @ wss4j-parent >>>
[INFO]
[INFO] --- pmd:3.19.0:pmd (pmd) @ wss4j-parent ---
[INFO]
[INFO] <<< pmd:3.19.0:check (validate) < :pmd @ wss4j-parent <<<
[INFO]
[INFO]
[INFO] --- pmd:3.19.0:check (validate) @ wss4j-parent ---
[INFO]
[INFO] --- checkstyle:3.4.0:check (validate) @ wss4j-parent ---
[INFO] You have 0 Checkstyle violations.
[INFO]
[INFO] --- bundle:5.1.9:cleanVersions (versions) @ wss4j-parent ---
[INFO]
[INFO] --- remote-resources:3.2.0:process (process-resource-bundles) @ wss4j-parent ---
[INFO] Preparing remote bundle org.apache.apache.resources:apache-jar-resource-bundle:1.5
[INFO] Copying 3 resources from 1 bundle.
[INFO]
[INFO] --- bundle:5.1.9:manifest (bundle-manifest) @ wss4j-parent ---
[WARNING] Ignoring project type pom - supportedProjectTypes = [jar, bundle]
[INFO]
[INFO] --- assembly:3.7.1:single (source-release-assembly) @ wss4j-parent ---
[INFO] Skipping the assembly in this project because it's not the Execution Root
[INFO]
[INFO] --- source:3.3.1:jar-no-fork (attach-sources) @ wss4j-parent ---
[INFO]
[INFO] --- javadoc:3.8.0:jar (default) @ wss4j-parent ---
[INFO] Not executing Javadoc as the project is not a Java classpath-capable package
[INFO]
[INFO] --- javadoc:3.8.0:jar (attach-javadocs) @ wss4j-parent ---
[INFO] Not executing Javadoc as the project is not a Java classpath-capable package
[INFO]
[INFO] --- cyclonedx:2.8.0:makeAggregateBom (make-bom) @ wss4j-parent ---
[INFO] CycloneDX: Resolving Dependencies
[INFO] CycloneDX: Creating BOM version 1.5 with 0 component(s)
[INFO] CycloneDX: Writing and validating BOM (XML): <https://ci-builds.apache.org/job/webservices/job/Apache%20WSS4J%20-%20master%20JDK11/ws/parent/target/wss4j-parent-4.0.0-SNAPSHOT-bom.xml>
[INFO] attaching as wss4j-parent-4.0.0-SNAPSHOT-cyclonedx.xml
[INFO] CycloneDX: Writing and validating BOM (JSON): <https://ci-builds.apache.org/job/webservices/job/Apache%20WSS4J%20-%20master%20JDK11/ws/parent/target/wss4j-parent-4.0.0-SNAPSHOT-bom.json>
[INFO] attaching as wss4j-parent-4.0.0-SNAPSHOT-cyclonedx.json
[INFO]
[INFO] --- checksum:1.11:artifacts (source-release-checksum) @ wss4j-parent ---
[INFO]
[INFO] --- gpg:3.2.4:sign (sign-release-artifacts) @ wss4j-parent ---
[INFO]
[INFO] --- install:3.1.2:install (default-install) @ wss4j-parent ---
[INFO] Installing <https://ci-builds.apache.org/job/webservices/job/Apache%20WSS4J%20-%20master%20JDK11/ws/parent/pom.xml> to /home/jenkins/.m2/repository/org/apache/wss4j/wss4j-parent/4.0.0-SNAPSHOT/wss4j-parent-4.0.0-SNAPSHOT.pom
[INFO] Installing <https://ci-builds.apache.org/job/webservices/job/Apache%20WSS4J%20-%20master%20JDK11/ws/parent/target/wss4j-parent-4.0.0-SNAPSHOT-bom.xml> to /home/jenkins/.m2/repository/org/apache/wss4j/wss4j-parent/4.0.0-SNAPSHOT/wss4j-parent-4.0.0-SNAPSHOT-cyclonedx.xml
[INFO] Installing <https://ci-builds.apache.org/job/webservices/job/Apache%20WSS4J%20-%20master%20JDK11/ws/parent/target/wss4j-parent-4.0.0-SNAPSHOT-bom.json> to /home/jenkins/.m2/repository/org/apache/wss4j/wss4j-parent/4.0.0-SNAPSHOT/wss4j-parent-4.0.0-SNAPSHOT-cyclonedx.json
[INFO]
[INFO] --- deploy:3.1.2:deploy (default-deploy) @ wss4j-parent ---
[INFO] Downloading from apache.snapshots.https: https://repository.apache.org/content/repositories/snapshots/org/apache/wss4j/wss4j-parent/4.0.0-SNAPSHOT/maven-metadata.xml
[INFO] Downloaded from apache.snapshots.https: https://repository.apache.org/content/repositories/snapshots/org/apache/wss4j/wss4j-parent/4.0.0-SNAPSHOT/maven-metadata.xml (1.0 kB at 1.9 kB/s)
[INFO] Uploading to apache.snapshots.https: https://repository.apache.org/content/repositories/snapshots/org/apache/wss4j/wss4j-parent/4.0.0-SNAPSHOT/wss4j-parent-4.0.0-20240807.100900-70.pom
[INFO] Uploaded to apache.snapshots.https: https://repository.apache.org/content/repositories/snapshots/org/apache/wss4j/wss4j-parent/4.0.0-SNAPSHOT/wss4j-parent-4.0.0-20240807.100900-70.pom (16 kB at 13 kB/s)
[INFO] Uploading to apache.snapshots.https: https://repository.apache.org/content/repositories/snapshots/org/apache/wss4j/wss4j-parent/4.0.0-SNAPSHOT/wss4j-parent-4.0.0-20240807.100900-70-cyclonedx.xml
[INFO] Uploading to apache.snapshots.https: https://repository.apache.org/content/repositories/snapshots/org/apache/wss4j/wss4j-parent/4.0.0-SNAPSHOT/wss4j-parent-4.0.0-20240807.100900-70-cyclonedx.json
[INFO] Uploaded to apache.snapshots.https: https://repository.apache.org/content/repositories/snapshots/org/apache/wss4j/wss4j-parent/4.0.0-SNAPSHOT/wss4j-parent-4.0.0-20240807.100900-70-cyclonedx.json (3.4 kB at 3.3 kB/s)
[INFO] Uploaded to apache.snapshots.https: https://repository.apache.org/content/repositories/snapshots/org/apache/wss4j/wss4j-parent/4.0.0-SNAPSHOT/wss4j-parent-4.0.0-20240807.100900-70-cyclonedx.xml (3.0 kB at 2.1 kB/s)
[INFO] Downloading from apache.snapshots.https: https://repository.apache.org/content/repositories/snapshots/org/apache/wss4j/wss4j-parent/maven-metadata.xml
[INFO] Downloaded from apache.snapshots.https: https://repository.apache.org/content/repositories/snapshots/org/apache/wss4j/wss4j-parent/maven-metadata.xml (597 B at 3.4 kB/s)
[INFO] Uploading to apache.snapshots.https: https://repository.apache.org/content/repositories/snapshots/org/apache/wss4j/wss4j-parent/4.0.0-SNAPSHOT/maven-metadata.xml
[INFO] Uploaded to apache.snapshots.https: https://repository.apache.org/content/repositories/snapshots/org/apache/wss4j/wss4j-parent/4.0.0-SNAPSHOT/maven-metadata.xml (1.0 kB at 1.0 kB/s)
[INFO] Uploading to apache.snapshots.https: https://repository.apache.org/content/repositories/snapshots/org/apache/wss4j/wss4j-parent/maven-metadata.xml
[INFO] Uploaded to apache.snapshots.https: https://repository.apache.org/content/repositories/snapshots/org/apache/wss4j/wss4j-parent/maven-metadata.xml (597 B at 511 B/s)
[INFO]
[INFO] ------------------< org.apache.wss4j:wss4j-bindings >-------------------
[INFO] Building Apache WSS4J WS-Security Bindings 4.0.0-SNAPSHOT [3/10]
[INFO] from bindings/pom.xml
[INFO] --------------------------------[ jar ]---------------------------------
[WARNING] Parameter 'sourceEncoding' is unknown for plugin 'maven-pmd-plugin:3.19.0:check (validate)'
[WARNING] Parameter 'sourceEncoding' is unknown for plugin 'maven-pmd-plugin:3.19.0:pmd (pmd)'
[WARNING] Parameter 'encoding' is unknown for plugin 'maven-checkstyle-plugin:3.4.0:check (validate)'
[INFO]
[INFO] --- clean:3.4.0:clean (default-clean) @ wss4j-bindings ---
[INFO] Deleting <https://ci-builds.apache.org/job/webservices/job/Apache%20WSS4J%20-%20master%20JDK11/ws/bindings/target>
[INFO]
[INFO] --- enforcer:3.5.0:enforce (enforce-maven-version) @ wss4j-bindings ---
[INFO]
[INFO] --- enforcer:3.5.0:enforce (enforce-java-version) @ wss4j-bindings ---
[INFO]
[INFO] >>> pmd:3.19.0:check (validate) > :pmd @ wss4j-bindings >>>
[INFO]
[INFO] --- pmd:3.19.0:pmd (pmd) @ wss4j-bindings ---
[INFO] PMD version: 6.49.0
[WARNING] Removed misconfigured rule: LoosePackageCoupling cause: No packages or classes specified
[INFO] Rendering content with org.apache.maven.skins:maven-default-skin:jar:1.3 skin.
[INFO]
[INFO] <<< pmd:3.19.0:check (validate) < :pmd @ wss4j-bindings <<<
[INFO]
[INFO]
[INFO] --- pmd:3.19.0:check (validate) @ wss4j-bindings ---
[INFO] PMD version: 6.49.0
[INFO]
[INFO]
[INFO] --- checkstyle:3.4.0:check (validate) @ wss4j-bindings ---
[INFO]
[INFO] --- bundle:5.1.9:cleanVersions (versions) @ wss4j-bindings ---
[INFO]
[INFO] --- remote-resources:3.2.0:process (process-resource-bundles) @ wss4j-bindings ---
[INFO] Preparing remote bundle org.apache.apache.resources:apache-jar-resource-bundle:1.5
[INFO] Copying 3 resources from 1 bundle.
[INFO]
[INFO] --- resources:3.3.1:resources (default-resources) @ wss4j-bindings ---
[INFO] Copying 0 resource from src/main/java to target/classes
[INFO] skip non existing resourceDirectory <https://ci-builds.apache.org/job/webservices/job/Apache%20WSS4J%20-%20master%20JDK11/ws/bindings/src/main/resources>
[INFO] skip non existing resourceDirectory <https://ci-builds.apache.org/job/webservices/job/Apache%20WSS4J%20-%20master%20JDK11/ws/bindings/src/main/resources-filtered>
[INFO] skip non existing resourceDirectory <https://ci-builds.apache.org/job/webservices/job/Apache%20WSS4J%20-%20master%20JDK11/ws/bindings/target/generated/src/main/resources>
[INFO] Copying 3 resources from target/maven-shared-archive-resources to target/classes
[INFO]
[INFO] --- compiler:3.13.0:compile (default-compile) @ wss4j-bindings ---
[INFO] Recompiling the module because of changed source code.
[INFO] Compiling 36 source files with javac [debug release 17] to target/classes
[INFO] ------------------------------------------------------------------------
[INFO] Reactor Summary for Apache WSS4J 4.0.0-SNAPSHOT:
[INFO]
[INFO] Apache WSS4J ....................................... SUCCESS [ 53.455 s]
[INFO] Apache WSS4J parent ................................ SUCCESS [ 12.499 s]
[INFO] Apache WSS4J WS-Security Bindings .................. FAILURE [ 10.002 s]
[INFO] Apache WSS4J WS-SecurityPolicy model ............... SKIPPED
[INFO] Apache WSS4J WS-Security Common .................... SKIPPED
[INFO] Apache WSS4J DOM WS-Security ....................... SKIPPED
[INFO] Apache WSS4J Streaming WS-Security ................. SKIPPED
[INFO] Apache WSS4J Web WS-Security ....................... SKIPPED
[INFO] Apache WSS4J WS-Security Integration ............... SKIPPED
[INFO] Apache WSS4J Streaming WS-SecurityPolicy ........... SKIPPED
[INFO] ------------------------------------------------------------------------
[INFO] BUILD FAILURE
[INFO] ------------------------------------------------------------------------
[INFO] Total time: 01:41 min
[INFO] Finished at: 2024-08-07T10:10:42Z
[INFO] ------------------------------------------------------------------------
Waiting for Jenkins to finish collecting data
[ERROR] Failed to execute goal org.apache.maven.plugins:maven-compiler-plugin:3.13.0:compile (default-compile) on project wss4j-bindings: Fatal error compiling: error: release version 17 not supported -> [Help 1]
[ERROR]
[ERROR] To see the full stack trace of the errors, re-run Maven with the -e switch.
[ERROR] Re-run Maven using the -X switch to enable full debug logging.
[ERROR]
[ERROR] For more information about the errors and possible solutions, please read the following articles:
[ERROR] [Help 1] http://cwiki.apache.org/confluence/display/MAVEN/MojoExecutionException
[ERROR]
[ERROR] After correcting the problems, you can resume the build with the command
[ERROR] mvn <goals> -rf :wss4j-bindings
[JENKINS] Archiving <https://ci-builds.apache.org/job/webservices/job/Apache%20WSS4J%20-%20master%20JDK11/ws/bindings/pom.xml> to org.apache.wss4j/wss4j-bindings/4.0.0-SNAPSHOT/wss4j-bindings-4.0.0-SNAPSHOT.pom
[JENKINS] Archiving <https://ci-builds.apache.org/job/webservices/job/Apache%20WSS4J%20-%20master%20JDK11/ws/ws-security-policy-stax/pom.xml> to org.apache.wss4j/wss4j-ws-security-policy-stax/4.0.0-SNAPSHOT/wss4j-ws-security-policy-stax-4.0.0-SNAPSHOT.pom
[JENKINS] Archiving <https://ci-builds.apache.org/job/webservices/job/Apache%20WSS4J%20-%20master%20JDK11/ws/ws-security-common/pom.xml> to org.apache.wss4j/wss4j-ws-security-common/4.0.0-SNAPSHOT/wss4j-ws-security-common-4.0.0-SNAPSHOT.pom
[JENKINS] Archiving <https://ci-builds.apache.org/job/webservices/job/Apache%20WSS4J%20-%20master%20JDK11/ws/ws-security-dom/pom.xml> to org.apache.wss4j/wss4j-ws-security-dom/4.0.0-SNAPSHOT/wss4j-ws-security-dom-4.0.0-SNAPSHOT.pom
[JENKINS] Archiving <https://ci-builds.apache.org/job/webservices/job/Apache%20WSS4J%20-%20master%20JDK11/ws/policy/pom.xml> to org.apache.wss4j/wss4j-policy/4.0.0-SNAPSHOT/wss4j-policy-4.0.0-SNAPSHOT.pom
[JENKINS] Archiving <https://ci-builds.apache.org/job/webservices/job/Apache%20WSS4J%20-%20master%20JDK11/ws/integration/pom.xml> to org.apache.wss4j/wss4j-integration/4.0.0-SNAPSHOT/wss4j-integration-4.0.0-SNAPSHOT.pom
[JENKINS] Archiving <https://ci-builds.apache.org/job/webservices/job/Apache%20WSS4J%20-%20master%20JDK11/ws/ws-security-stax/pom.xml> to org.apache.wss4j/wss4j-ws-security-stax/4.0.0-SNAPSHOT/wss4j-ws-security-stax-4.0.0-SNAPSHOT.pom
[JENKINS] Archiving <https://ci-builds.apache.org/job/webservices/job/Apache%20WSS4J%20-%20master%20JDK11/ws/parent/pom.xml> to org.apache.wss4j/wss4j-parent/4.0.0-SNAPSHOT/wss4j-parent-4.0.0-SNAPSHOT.pom
[JENKINS] Archiving <https://ci-builds.apache.org/job/webservices/job/Apache%20WSS4J%20-%20master%20JDK11/ws/parent/target/wss4j-parent-4.0.0-SNAPSHOT-bom.xml> to org.apache.wss4j/wss4j-parent/4.0.0-SNAPSHOT/wss4j-parent-4.0.0-SNAPSHOT-cyclonedx.xml
[JENKINS] Archiving <https://ci-builds.apache.org/job/webservices/job/Apache%20WSS4J%20-%20master%20JDK11/ws/parent/target/wss4j-parent-4.0.0-SNAPSHOT-bom.json> to org.apache.wss4j/wss4j-parent/4.0.0-SNAPSHOT/wss4j-parent-4.0.0-SNAPSHOT-cyclonedx.json
[JENKINS] Archiving <https://ci-builds.apache.org/job/webservices/job/Apache%20WSS4J%20-%20master%20JDK11/ws/pom.xml> to org.apache.wss4j/wss4j/4.0.0-SNAPSHOT/wss4j-4.0.0-SNAPSHOT.pom
[JENKINS] Archiving <https://ci-builds.apache.org/job/webservices/job/Apache%20WSS4J%20-%20master%20JDK11/ws/target/wss4j-4.0.0-SNAPSHOT-source-release.zip> to org.apache.wss4j/wss4j/4.0.0-SNAPSHOT/wss4j-4.0.0-SNAPSHOT-source-release.zip
[JENKINS] Archiving <https://ci-builds.apache.org/job/webservices/job/Apache%20WSS4J%20-%20master%20JDK11/ws/target/wss4j-4.0.0-SNAPSHOT-bom.xml> to org.apache.wss4j/wss4j/4.0.0-SNAPSHOT/wss4j-4.0.0-SNAPSHOT-cyclonedx.xml
[JENKINS] Archiving <https://ci-builds.apache.org/job/webservices/job/Apache%20WSS4J%20-%20master%20JDK11/ws/target/wss4j-4.0.0-SNAPSHOT-bom.json> to org.apache.wss4j/wss4j/4.0.0-SNAPSHOT/wss4j-4.0.0-SNAPSHOT-cyclonedx.json
[JENKINS] Archiving <https://ci-builds.apache.org/job/webservices/job/Apache%20WSS4J%20-%20master%20JDK11/ws/target/wss4j-4.0.0-SNAPSHOT-source-release.zip.sha512> to org.apache.wss4j/wss4j/4.0.0-SNAPSHOT/wss4j-4.0.0-SNAPSHOT-source-release.zip.sha512
[JENKINS] Archiving <https://ci-builds.apache.org/job/webservices/job/Apache%20WSS4J%20-%20master%20JDK11/ws/ws-security-web/pom.xml> to org.apache.wss4j/wss4j-ws-security-web/4.0.0-SNAPSHOT/wss4j-ws-security-web-4.0.0-SNAPSHOT.pom
Sending e-mails to: dev@ws.apache.org
No mail will be sent out, as 'webservices » Apache WSS4J - master JDK11 » Apache WSS4J Streaming WS-SecurityPolicy #113' does not have a result yet. Please make sure you set a proper result in case of pipeline/build scripts.
No mail will be sent out, as 'webservices » Apache WSS4J - master JDK11 » Apache WSS4J WS-Security Common #113' does not have a result yet. Please make sure you set a proper result in case of pipeline/build scripts.
No mail will be sent out, as 'webservices » Apache WSS4J - master JDK11 » Apache WSS4J DOM WS-Security #113' does not have a result yet. Please make sure you set a proper result in case of pipeline/build scripts.
No mail will be sent out, as 'webservices » Apache WSS4J - master JDK11 » Apache WSS4J WS-SecurityPolicy model #113' does not have a result yet. Please make sure you set a proper result in case of pipeline/build scripts.
No mail will be sent out, as 'webservices » Apache WSS4J - master JDK11 » Apache WSS4J WS-Security Integration #113' does not have a result yet. Please make sure you set a proper result in case of pipeline/build scripts.
No mail will be sent out, as 'webservices » Apache WSS4J - master JDK11 » Apache WSS4J Streaming WS-Security #113' does not have a result yet. Please make sure you set a proper result in case of pipeline/build scripts.
No mail will be sent out, as 'webservices » Apache WSS4J - master JDK11 » Apache WSS4J Web WS-Security #113' does not have a result yet. Please make sure you set a proper result in case of pipeline/build scripts.
channel stopped
---------------------------------------------------------------------
To unsubscribe, e-mail: dev-unsubscribe@ws.apache.org
For additional commands, e-mail: dev-help@ws.apache.org
Build failed in Jenkins: webservices » Apache WSS4J - master JDK11 #112
Posted by Apache Jenkins Server <je...@builds.apache.org>.
See <https://ci-builds.apache.org/job/webservices/job/Apache%20WSS4J%20-%20master%20JDK11/112/display/redirect?page=changes>
Changes:
[github] Bump github/codeql-action from 3.25.12 to 3.25.13 (#363)
[github] Bump org.apache.maven.plugins:maven-javadoc-plugin from 3.7.0 to 3.8.0 (#362)
[github] Bump com.google.errorprone:error_prone_core from 2.29.1 to 2.29.2 (#361)
------------------------------------------
[...truncated 10.39 KB...]
[INFO] Downloaded from Nexus: https://repository.apache.org/snapshots/org/apache/wss4j/wss4j-ws-security-dom/4.0.0-SNAPSHOT/maven-metadata.xml (1.9 kB at 5.0 kB/s)
[INFO] Downloading from Nexus: https://repository.apache.org/snapshots/org/apache/wss4j/wss4j-bindings/4.0.0-SNAPSHOT/wss4j-bindings-4.0.0-20240718.112028-59.jar
[INFO] Downloaded from Nexus: https://repository.apache.org/snapshots/org/apache/wss4j/wss4j-bindings/4.0.0-SNAPSHOT/wss4j-bindings-4.0.0-20240718.112028-59.jar (44 kB at 235 kB/s)
[INFO] Downloading from Nexus: https://repository.apache.org/snapshots/org/apache/wss4j/wss4j-ws-security-dom/4.0.0-SNAPSHOT/wss4j-ws-security-dom-4.0.0-20240718.112028-59.jar
[INFO] Downloaded from Nexus: https://repository.apache.org/snapshots/org/apache/wss4j/wss4j-ws-security-dom/4.0.0-SNAPSHOT/wss4j-ws-security-dom-4.0.0-20240718.112028-59.jar (349 kB at 958 kB/s)
[INFO] Downloading from Nexus: https://repository.apache.org/snapshots/org/apache/wss4j/wss4j-ws-security-dom/4.0.0-SNAPSHOT/wss4j-ws-security-dom-4.0.0-20240718.112028-59-tests.jar
[INFO] Downloaded from Nexus: https://repository.apache.org/snapshots/org/apache/wss4j/wss4j-ws-security-dom/4.0.0-SNAPSHOT/wss4j-ws-security-dom-4.0.0-20240718.112028-59-tests.jar (425 kB at 1.8 MB/s)
[INFO] Downloading from A_maven.central: https://repo1.maven.org/maven2/org/apache/wss4j/wss4j-ws-security-dom/4.0.0-SNAPSHOT/wss4j-ws-security-dom-4.0.0-20240718.112028-59.pom
[INFO] Downloading from B_shibboleth: https://build.shibboleth.net/nexus/content/groups/public/org/apache/wss4j/wss4j-ws-security-dom/4.0.0-SNAPSHOT/wss4j-ws-security-dom-4.0.0-20240718.112028-59.pom
[INFO] Downloading from Nexus: https://repository.apache.org/snapshots/org/apache/wss4j/wss4j-ws-security-dom/4.0.0-SNAPSHOT/wss4j-ws-security-dom-4.0.0-20240718.112028-59.pom
[INFO] Downloaded from Nexus: https://repository.apache.org/snapshots/org/apache/wss4j/wss4j-ws-security-dom/4.0.0-SNAPSHOT/wss4j-ws-security-dom-4.0.0-20240718.112028-59.pom (5.2 kB at 29 kB/s)
[INFO] Downloading from A_maven.central: https://repo1.maven.org/maven2/org/apache/wss4j/wss4j-ws-security-stax/4.0.0-SNAPSHOT/maven-metadata.xml
[INFO] Downloading from B_shibboleth: https://build.shibboleth.net/nexus/content/groups/public/org/apache/wss4j/wss4j-ws-security-stax/4.0.0-SNAPSHOT/maven-metadata.xml
[INFO] Downloading from Nexus: https://repository.apache.org/snapshots/org/apache/wss4j/wss4j-ws-security-stax/4.0.0-SNAPSHOT/maven-metadata.xml
[INFO] Downloaded from Nexus: https://repository.apache.org/snapshots/org/apache/wss4j/wss4j-ws-security-stax/4.0.0-SNAPSHOT/maven-metadata.xml (1.9 kB at 5.1 kB/s)
[INFO] Downloading from Nexus: https://repository.apache.org/snapshots/org/apache/wss4j/wss4j-ws-security-stax/4.0.0-SNAPSHOT/wss4j-ws-security-stax-4.0.0-20240718.112028-59.jar
[INFO] Downloaded from Nexus: https://repository.apache.org/snapshots/org/apache/wss4j/wss4j-ws-security-stax/4.0.0-SNAPSHOT/wss4j-ws-security-stax-4.0.0-20240718.112028-59.jar (417 kB at 601 kB/s)
[INFO] Downloading from Nexus: https://repository.apache.org/snapshots/org/apache/wss4j/wss4j-ws-security-stax/4.0.0-SNAPSHOT/wss4j-ws-security-stax-4.0.0-20240718.112028-59-tests.jar
[INFO] Downloaded from Nexus: https://repository.apache.org/snapshots/org/apache/wss4j/wss4j-ws-security-stax/4.0.0-SNAPSHOT/wss4j-ws-security-stax-4.0.0-20240718.112028-59-tests.jar (364 kB at 1.7 MB/s)
[INFO] Downloading from A_maven.central: https://repo1.maven.org/maven2/org/apache/wss4j/wss4j-ws-security-stax/4.0.0-SNAPSHOT/wss4j-ws-security-stax-4.0.0-20240718.112028-59.pom
[INFO] Downloading from B_shibboleth: https://build.shibboleth.net/nexus/content/groups/public/org/apache/wss4j/wss4j-ws-security-stax/4.0.0-SNAPSHOT/wss4j-ws-security-stax-4.0.0-20240718.112028-59.pom
[INFO] Downloading from Nexus: https://repository.apache.org/snapshots/org/apache/wss4j/wss4j-ws-security-stax/4.0.0-SNAPSHOT/wss4j-ws-security-stax-4.0.0-20240718.112028-59.pom
[INFO] Downloaded from Nexus: https://repository.apache.org/snapshots/org/apache/wss4j/wss4j-ws-security-stax/4.0.0-SNAPSHOT/wss4j-ws-security-stax-4.0.0-20240718.112028-59.pom (5.6 kB at 31 kB/s)
[INFO] Downloading from A_maven.central: https://repo1.maven.org/maven2/org/apache/wss4j/wss4j-policy/4.0.0-SNAPSHOT/maven-metadata.xml
[INFO] Downloading from Nexus: https://repository.apache.org/snapshots/org/apache/wss4j/wss4j-policy/4.0.0-SNAPSHOT/maven-metadata.xml
[INFO] Downloading from B_shibboleth: https://build.shibboleth.net/nexus/content/groups/public/org/apache/wss4j/wss4j-policy/4.0.0-SNAPSHOT/maven-metadata.xml
[INFO] Downloaded from Nexus: https://repository.apache.org/snapshots/org/apache/wss4j/wss4j-policy/4.0.0-SNAPSHOT/maven-metadata.xml (1.6 kB at 4.0 kB/s)
[INFO] Downloading from Nexus: https://repository.apache.org/snapshots/org/apache/wss4j/wss4j-policy/4.0.0-SNAPSHOT/wss4j-policy-4.0.0-20240718.112028-59.jar
[INFO] Downloaded from Nexus: https://repository.apache.org/snapshots/org/apache/wss4j/wss4j-policy/4.0.0-SNAPSHOT/wss4j-policy-4.0.0-20240718.112028-59.jar (216 kB at 594 kB/s)
[WARNING] BOM dependency listed but is not depended upon: pkg:maven/commons-codec/commons-codec@1.17.0?type=jar
[INFO] CycloneDX: Creating BOM version 1.5 with 63 component(s)
[INFO] CycloneDX: Writing and validating BOM (XML): <https://ci-builds.apache.org/job/webservices/job/Apache%20WSS4J%20-%20master%20JDK11/ws/target/wss4j-4.0.0-SNAPSHOT-bom.xml>
[INFO] attaching as wss4j-4.0.0-SNAPSHOT-cyclonedx.xml
[INFO] CycloneDX: Writing and validating BOM (JSON): <https://ci-builds.apache.org/job/webservices/job/Apache%20WSS4J%20-%20master%20JDK11/ws/target/wss4j-4.0.0-SNAPSHOT-bom.json>
[INFO] attaching as wss4j-4.0.0-SNAPSHOT-cyclonedx.json
[INFO]
[INFO] --- checksum:1.11:artifacts (source-release-checksum) @ wss4j ---
[INFO] wss4j-4.0.0-SNAPSHOT-source-release.zip - SHA-512 : a2aa7ea510994c238e70e20eee92ea6fa9b97d46db7739044772e2d0159f642d7bb8960db826366a165a76ed869d9c1c534b35402016210368cfdb115f04be10
[INFO]
[INFO] --- gpg:3.2.4:sign (sign-release-artifacts) @ wss4j ---
[INFO]
[INFO] --- install:3.1.2:install (default-install) @ wss4j ---
[INFO] Installing <https://ci-builds.apache.org/job/webservices/job/Apache%20WSS4J%20-%20master%20JDK11/ws/pom.xml> to /home/jenkins/.m2/repository/org/apache/wss4j/wss4j/4.0.0-SNAPSHOT/wss4j-4.0.0-SNAPSHOT.pom
[INFO] Installing <https://ci-builds.apache.org/job/webservices/job/Apache%20WSS4J%20-%20master%20JDK11/ws/target/wss4j-4.0.0-SNAPSHOT-source-release.zip> to /home/jenkins/.m2/repository/org/apache/wss4j/wss4j/4.0.0-SNAPSHOT/wss4j-4.0.0-SNAPSHOT-source-release.zip
[INFO] Installing <https://ci-builds.apache.org/job/webservices/job/Apache%20WSS4J%20-%20master%20JDK11/ws/target/wss4j-4.0.0-SNAPSHOT-bom.xml> to /home/jenkins/.m2/repository/org/apache/wss4j/wss4j/4.0.0-SNAPSHOT/wss4j-4.0.0-SNAPSHOT-cyclonedx.xml
[INFO] Installing <https://ci-builds.apache.org/job/webservices/job/Apache%20WSS4J%20-%20master%20JDK11/ws/target/wss4j-4.0.0-SNAPSHOT-bom.json> to /home/jenkins/.m2/repository/org/apache/wss4j/wss4j/4.0.0-SNAPSHOT/wss4j-4.0.0-SNAPSHOT-cyclonedx.json
[INFO] Installing <https://ci-builds.apache.org/job/webservices/job/Apache%20WSS4J%20-%20master%20JDK11/ws/target/wss4j-4.0.0-SNAPSHOT-source-release.zip.sha512> to /home/jenkins/.m2/repository/org/apache/wss4j/wss4j/4.0.0-SNAPSHOT/wss4j-4.0.0-SNAPSHOT-source-release.zip.sha512
[INFO]
[INFO] --- deploy:3.1.2:deploy (default-deploy) @ wss4j ---
[INFO] Downloading from apache.snapshots.https: https://repository.apache.org/content/repositories/snapshots/org/apache/wss4j/wss4j/4.0.0-SNAPSHOT/maven-metadata.xml
[INFO] Downloaded from apache.snapshots.https: https://repository.apache.org/content/repositories/snapshots/org/apache/wss4j/wss4j/4.0.0-SNAPSHOT/maven-metadata.xml (1.3 kB at 6.9 kB/s)
[INFO] Uploading to apache.snapshots.https: https://repository.apache.org/content/repositories/snapshots/org/apache/wss4j/wss4j/4.0.0-SNAPSHOT/wss4j-4.0.0-20240722.101423-67.pom
[INFO] Uploaded to apache.snapshots.https: https://repository.apache.org/content/repositories/snapshots/org/apache/wss4j/wss4j/4.0.0-SNAPSHOT/wss4j-4.0.0-20240722.101423-67.pom (22 kB at 10 kB/s)
[INFO] Uploading to apache.snapshots.https: https://repository.apache.org/content/repositories/snapshots/org/apache/wss4j/wss4j/4.0.0-SNAPSHOT/wss4j-4.0.0-20240722.101423-67-source-release.zip
[INFO] Uploading to apache.snapshots.https: https://repository.apache.org/content/repositories/snapshots/org/apache/wss4j/wss4j/4.0.0-SNAPSHOT/wss4j-4.0.0-20240722.101423-67-cyclonedx.xml
[INFO] Uploading to apache.snapshots.https: https://repository.apache.org/content/repositories/snapshots/org/apache/wss4j/wss4j/4.0.0-SNAPSHOT/wss4j-4.0.0-20240722.101423-67-cyclonedx.json
[INFO] Uploading to apache.snapshots.https: https://repository.apache.org/content/repositories/snapshots/org/apache/wss4j/wss4j/4.0.0-SNAPSHOT/wss4j-4.0.0-20240722.101423-67-source-release.zip.sha512
[INFO] Uploaded to apache.snapshots.https: https://repository.apache.org/content/repositories/snapshots/org/apache/wss4j/wss4j/4.0.0-SNAPSHOT/wss4j-4.0.0-20240722.101423-67-source-release.zip.sha512 (128 B at 162 B/s)
[INFO] Uploaded to apache.snapshots.https: https://repository.apache.org/content/repositories/snapshots/org/apache/wss4j/wss4j/4.0.0-SNAPSHOT/wss4j-4.0.0-20240722.101423-67-cyclonedx.xml (150 kB at 73 kB/s)
[INFO] Uploaded to apache.snapshots.https: https://repository.apache.org/content/repositories/snapshots/org/apache/wss4j/wss4j/4.0.0-SNAPSHOT/wss4j-4.0.0-20240722.101423-67-source-release.zip (2.1 MB at 1.0 MB/s)
[INFO] Uploaded to apache.snapshots.https: https://repository.apache.org/content/repositories/snapshots/org/apache/wss4j/wss4j/4.0.0-SNAPSHOT/wss4j-4.0.0-20240722.101423-67-cyclonedx.json (171 kB at 79 kB/s)
[INFO] Downloading from apache.snapshots.https: https://repository.apache.org/content/repositories/snapshots/org/apache/wss4j/wss4j/maven-metadata.xml
[INFO] Downloaded from apache.snapshots.https: https://repository.apache.org/content/repositories/snapshots/org/apache/wss4j/wss4j/maven-metadata.xml (590 B at 1.7 kB/s)
[INFO] Uploading to apache.snapshots.https: https://repository.apache.org/content/repositories/snapshots/org/apache/wss4j/wss4j/4.0.0-SNAPSHOT/maven-metadata.xml
[INFO] Uploaded to apache.snapshots.https: https://repository.apache.org/content/repositories/snapshots/org/apache/wss4j/wss4j/4.0.0-SNAPSHOT/maven-metadata.xml (1.5 kB at 1.1 kB/s)
[INFO] Uploading to apache.snapshots.https: https://repository.apache.org/content/repositories/snapshots/org/apache/wss4j/wss4j/maven-metadata.xml
[INFO] Uploaded to apache.snapshots.https: https://repository.apache.org/content/repositories/snapshots/org/apache/wss4j/wss4j/maven-metadata.xml (590 B at 414 B/s)
[WARNING] Attempt to (de-)serialize anonymous class org.jfrog.hudson.maven2.MavenDependenciesRecorder$1; see: https://jenkins.io/redirect/serialization-of-anonymous-classes/
[INFO]
[INFO] -------------------< org.apache.wss4j:wss4j-parent >--------------------
[INFO] Building Apache WSS4J parent 4.0.0-SNAPSHOT [2/10]
[INFO] from parent/pom.xml
[INFO] --------------------------------[ pom ]---------------------------------
[WARNING] Parameter 'sourceEncoding' is unknown for plugin 'maven-pmd-plugin:3.19.0:check (validate)'
[WARNING] Parameter 'sourceEncoding' is unknown for plugin 'maven-pmd-plugin:3.19.0:pmd (pmd)'
[WARNING] Parameter 'encoding' is unknown for plugin 'maven-checkstyle-plugin:3.4.0:check (validate)'
[INFO]
[INFO] --- clean:3.4.0:clean (default-clean) @ wss4j-parent ---
[INFO]
[INFO] --- enforcer:3.5.0:enforce (enforce-maven-version) @ wss4j-parent ---
[INFO]
[INFO] --- enforcer:3.5.0:enforce (enforce-java-version) @ wss4j-parent ---
[INFO]
[INFO] >>> pmd:3.19.0:check (validate) > :pmd @ wss4j-parent >>>
[INFO]
[INFO] --- pmd:3.19.0:pmd (pmd) @ wss4j-parent ---
[INFO]
[INFO] <<< pmd:3.19.0:check (validate) < :pmd @ wss4j-parent <<<
[INFO]
[INFO]
[INFO] --- pmd:3.19.0:check (validate) @ wss4j-parent ---
[INFO]
[INFO] --- checkstyle:3.4.0:check (validate) @ wss4j-parent ---
[INFO] You have 0 Checkstyle violations.
[INFO]
[INFO] --- bundle:5.1.9:cleanVersions (versions) @ wss4j-parent ---
[INFO]
[INFO] --- remote-resources:3.2.0:process (process-resource-bundles) @ wss4j-parent ---
[INFO] Preparing remote bundle org.apache.apache.resources:apache-jar-resource-bundle:1.5
[INFO] Copying 3 resources from 1 bundle.
[INFO]
[INFO] --- bundle:5.1.9:manifest (bundle-manifest) @ wss4j-parent ---
[WARNING] Ignoring project type pom - supportedProjectTypes = [jar, bundle]
[INFO]
[INFO] --- assembly:3.7.1:single (source-release-assembly) @ wss4j-parent ---
[INFO] Skipping the assembly in this project because it's not the Execution Root
[INFO]
[INFO] --- source:3.3.1:jar-no-fork (attach-sources) @ wss4j-parent ---
[INFO]
[INFO] --- javadoc:3.8.0:jar (default) @ wss4j-parent ---
[INFO] Not executing Javadoc as the project is not a Java classpath-capable package
[INFO]
[INFO] --- javadoc:3.8.0:jar (attach-javadocs) @ wss4j-parent ---
[INFO] Not executing Javadoc as the project is not a Java classpath-capable package
[INFO]
[INFO] --- cyclonedx:2.8.0:makeAggregateBom (make-bom) @ wss4j-parent ---
[INFO] CycloneDX: Resolving Dependencies
[INFO] CycloneDX: Creating BOM version 1.5 with 0 component(s)
[INFO] CycloneDX: Writing and validating BOM (XML): <https://ci-builds.apache.org/job/webservices/job/Apache%20WSS4J%20-%20master%20JDK11/ws/parent/target/wss4j-parent-4.0.0-SNAPSHOT-bom.xml>
[INFO] attaching as wss4j-parent-4.0.0-SNAPSHOT-cyclonedx.xml
[INFO] CycloneDX: Writing and validating BOM (JSON): <https://ci-builds.apache.org/job/webservices/job/Apache%20WSS4J%20-%20master%20JDK11/ws/parent/target/wss4j-parent-4.0.0-SNAPSHOT-bom.json>
[INFO] attaching as wss4j-parent-4.0.0-SNAPSHOT-cyclonedx.json
[INFO]
[INFO] --- checksum:1.11:artifacts (source-release-checksum) @ wss4j-parent ---
[INFO]
[INFO] --- gpg:3.2.4:sign (sign-release-artifacts) @ wss4j-parent ---
[INFO]
[INFO] --- install:3.1.2:install (default-install) @ wss4j-parent ---
[INFO] Installing <https://ci-builds.apache.org/job/webservices/job/Apache%20WSS4J%20-%20master%20JDK11/ws/parent/pom.xml> to /home/jenkins/.m2/repository/org/apache/wss4j/wss4j-parent/4.0.0-SNAPSHOT/wss4j-parent-4.0.0-SNAPSHOT.pom
[INFO] Installing <https://ci-builds.apache.org/job/webservices/job/Apache%20WSS4J%20-%20master%20JDK11/ws/parent/target/wss4j-parent-4.0.0-SNAPSHOT-bom.xml> to /home/jenkins/.m2/repository/org/apache/wss4j/wss4j-parent/4.0.0-SNAPSHOT/wss4j-parent-4.0.0-SNAPSHOT-cyclonedx.xml
[INFO] Installing <https://ci-builds.apache.org/job/webservices/job/Apache%20WSS4J%20-%20master%20JDK11/ws/parent/target/wss4j-parent-4.0.0-SNAPSHOT-bom.json> to /home/jenkins/.m2/repository/org/apache/wss4j/wss4j-parent/4.0.0-SNAPSHOT/wss4j-parent-4.0.0-SNAPSHOT-cyclonedx.json
[INFO]
[INFO] --- deploy:3.1.2:deploy (default-deploy) @ wss4j-parent ---
[INFO] Downloading from apache.snapshots.https: https://repository.apache.org/content/repositories/snapshots/org/apache/wss4j/wss4j-parent/4.0.0-SNAPSHOT/maven-metadata.xml
[INFO] Downloaded from apache.snapshots.https: https://repository.apache.org/content/repositories/snapshots/org/apache/wss4j/wss4j-parent/4.0.0-SNAPSHOT/maven-metadata.xml (1.0 kB at 1.9 kB/s)
[INFO] Uploading to apache.snapshots.https: https://repository.apache.org/content/repositories/snapshots/org/apache/wss4j/wss4j-parent/4.0.0-SNAPSHOT/wss4j-parent-4.0.0-20240722.101423-67.pom
[INFO] Uploaded to apache.snapshots.https: https://repository.apache.org/content/repositories/snapshots/org/apache/wss4j/wss4j-parent/4.0.0-SNAPSHOT/wss4j-parent-4.0.0-20240722.101423-67.pom (16 kB at 12 kB/s)
[INFO] Uploading to apache.snapshots.https: https://repository.apache.org/content/repositories/snapshots/org/apache/wss4j/wss4j-parent/4.0.0-SNAPSHOT/wss4j-parent-4.0.0-20240722.101423-67-cyclonedx.xml
[INFO] Uploading to apache.snapshots.https: https://repository.apache.org/content/repositories/snapshots/org/apache/wss4j/wss4j-parent/4.0.0-SNAPSHOT/wss4j-parent-4.0.0-20240722.101423-67-cyclonedx.json
[INFO] Uploaded to apache.snapshots.https: https://repository.apache.org/content/repositories/snapshots/org/apache/wss4j/wss4j-parent/4.0.0-SNAPSHOT/wss4j-parent-4.0.0-20240722.101423-67-cyclonedx.json (3.4 kB at 3.0 kB/s)
[INFO] Uploaded to apache.snapshots.https: https://repository.apache.org/content/repositories/snapshots/org/apache/wss4j/wss4j-parent/4.0.0-SNAPSHOT/wss4j-parent-4.0.0-20240722.101423-67-cyclonedx.xml (3.0 kB at 2.1 kB/s)
[INFO] Downloading from apache.snapshots.https: https://repository.apache.org/content/repositories/snapshots/org/apache/wss4j/wss4j-parent/maven-metadata.xml
[INFO] Downloaded from apache.snapshots.https: https://repository.apache.org/content/repositories/snapshots/org/apache/wss4j/wss4j-parent/maven-metadata.xml (597 B at 1.8 kB/s)
[INFO] Uploading to apache.snapshots.https: https://repository.apache.org/content/repositories/snapshots/org/apache/wss4j/wss4j-parent/4.0.0-SNAPSHOT/maven-metadata.xml
[INFO] Uploaded to apache.snapshots.https: https://repository.apache.org/content/repositories/snapshots/org/apache/wss4j/wss4j-parent/4.0.0-SNAPSHOT/maven-metadata.xml (1.0 kB at 870 B/s)
[INFO] Uploading to apache.snapshots.https: https://repository.apache.org/content/repositories/snapshots/org/apache/wss4j/wss4j-parent/maven-metadata.xml
[INFO] Uploaded to apache.snapshots.https: https://repository.apache.org/content/repositories/snapshots/org/apache/wss4j/wss4j-parent/maven-metadata.xml (597 B at 520 B/s)
[INFO]
[INFO] ------------------< org.apache.wss4j:wss4j-bindings >-------------------
[INFO] Building Apache WSS4J WS-Security Bindings 4.0.0-SNAPSHOT [3/10]
[INFO] from bindings/pom.xml
[INFO] --------------------------------[ jar ]---------------------------------
[WARNING] Parameter 'sourceEncoding' is unknown for plugin 'maven-pmd-plugin:3.19.0:check (validate)'
[WARNING] Parameter 'sourceEncoding' is unknown for plugin 'maven-pmd-plugin:3.19.0:pmd (pmd)'
[WARNING] Parameter 'encoding' is unknown for plugin 'maven-checkstyle-plugin:3.4.0:check (validate)'
[INFO]
[INFO] --- clean:3.4.0:clean (default-clean) @ wss4j-bindings ---
[INFO]
[INFO] --- enforcer:3.5.0:enforce (enforce-maven-version) @ wss4j-bindings ---
[INFO]
[INFO] --- enforcer:3.5.0:enforce (enforce-java-version) @ wss4j-bindings ---
[INFO]
[INFO] >>> pmd:3.19.0:check (validate) > :pmd @ wss4j-bindings >>>
[INFO]
[INFO] --- pmd:3.19.0:pmd (pmd) @ wss4j-bindings ---
[INFO] PMD version: 6.49.0
[WARNING] Removed misconfigured rule: LoosePackageCoupling cause: No packages or classes specified
[INFO] Rendering content with org.apache.maven.skins:maven-default-skin:jar:1.3 skin.
[INFO]
[INFO] <<< pmd:3.19.0:check (validate) < :pmd @ wss4j-bindings <<<
[INFO]
[INFO]
[INFO] --- pmd:3.19.0:check (validate) @ wss4j-bindings ---
[INFO] PMD version: 6.49.0
[INFO]
[INFO]
[INFO] --- checkstyle:3.4.0:check (validate) @ wss4j-bindings ---
[INFO]
[INFO] --- bundle:5.1.9:cleanVersions (versions) @ wss4j-bindings ---
[INFO]
[INFO] --- remote-resources:3.2.0:process (process-resource-bundles) @ wss4j-bindings ---
[INFO] Preparing remote bundle org.apache.apache.resources:apache-jar-resource-bundle:1.5
[INFO] Copying 3 resources from 1 bundle.
[INFO]
[INFO] --- resources:3.3.1:resources (default-resources) @ wss4j-bindings ---
[INFO] Copying 0 resource from src/main/java to target/classes
[INFO] skip non existing resourceDirectory <https://ci-builds.apache.org/job/webservices/job/Apache%20WSS4J%20-%20master%20JDK11/ws/bindings/src/main/resources>
[INFO] skip non existing resourceDirectory <https://ci-builds.apache.org/job/webservices/job/Apache%20WSS4J%20-%20master%20JDK11/ws/bindings/src/main/resources-filtered>
[INFO] skip non existing resourceDirectory <https://ci-builds.apache.org/job/webservices/job/Apache%20WSS4J%20-%20master%20JDK11/ws/bindings/target/generated/src/main/resources>
[INFO] Copying 3 resources from target/maven-shared-archive-resources to target/classes
[INFO]
[INFO] --- compiler:3.13.0:compile (default-compile) @ wss4j-bindings ---
[INFO] Recompiling the module because of changed source code.
[INFO] Compiling 36 source files with javac [debug release 17] to target/classes
[INFO] ------------------------------------------------------------------------
[INFO] Reactor Summary for Apache WSS4J 4.0.0-SNAPSHOT:
[INFO]
[INFO] Apache WSS4J ....................................... SUCCESS [ 45.252 s]
[INFO] Apache WSS4J parent ................................ SUCCESS [ 14.088 s]
[INFO] Apache WSS4J WS-Security Bindings .................. FAILURE [ 7.951 s]
[INFO] Apache WSS4J WS-SecurityPolicy model ............... SKIPPED
[INFO] Apache WSS4J WS-Security Common .................... SKIPPED
[INFO] Apache WSS4J DOM WS-Security ....................... SKIPPED
[INFO] Apache WSS4J Streaming WS-Security ................. SKIPPED
[INFO] Apache WSS4J Web WS-Security ....................... SKIPPED
[INFO] Apache WSS4J WS-Security Integration ............... SKIPPED
[INFO] Apache WSS4J Streaming WS-SecurityPolicy ........... SKIPPED
[INFO] ------------------------------------------------------------------------
[INFO] BUILD FAILURE
[INFO] ------------------------------------------------------------------------
[INFO] Total time: 01:33 min
[INFO] Finished at: 2024-07-22T10:15:56Z
[INFO] ------------------------------------------------------------------------
Waiting for Jenkins to finish collecting data
[ERROR] Failed to execute goal org.apache.maven.plugins:maven-compiler-plugin:3.13.0:compile (default-compile) on project wss4j-bindings: Fatal error compiling: error: release version 17 not supported -> [Help 1]
[ERROR]
[ERROR] To see the full stack trace of the errors, re-run Maven with the -e switch.
[ERROR] Re-run Maven using the -X switch to enable full debug logging.
[ERROR]
[ERROR] For more information about the errors and possible solutions, please read the following articles:
[ERROR] [Help 1] http://cwiki.apache.org/confluence/display/MAVEN/MojoExecutionException
[ERROR]
[ERROR] After correcting the problems, you can resume the build with the command
[ERROR] mvn <goals> -rf :wss4j-bindings
[JENKINS] Archiving <https://ci-builds.apache.org/job/webservices/job/Apache%20WSS4J%20-%20master%20JDK11/ws/bindings/pom.xml> to org.apache.wss4j/wss4j-bindings/4.0.0-SNAPSHOT/wss4j-bindings-4.0.0-SNAPSHOT.pom
[JENKINS] Archiving <https://ci-builds.apache.org/job/webservices/job/Apache%20WSS4J%20-%20master%20JDK11/ws/ws-security-policy-stax/pom.xml> to org.apache.wss4j/wss4j-ws-security-policy-stax/4.0.0-SNAPSHOT/wss4j-ws-security-policy-stax-4.0.0-SNAPSHOT.pom
[JENKINS] Archiving <https://ci-builds.apache.org/job/webservices/job/Apache%20WSS4J%20-%20master%20JDK11/ws/ws-security-common/pom.xml> to org.apache.wss4j/wss4j-ws-security-common/4.0.0-SNAPSHOT/wss4j-ws-security-common-4.0.0-SNAPSHOT.pom
[JENKINS] Archiving <https://ci-builds.apache.org/job/webservices/job/Apache%20WSS4J%20-%20master%20JDK11/ws/ws-security-dom/pom.xml> to org.apache.wss4j/wss4j-ws-security-dom/4.0.0-SNAPSHOT/wss4j-ws-security-dom-4.0.0-SNAPSHOT.pom
[JENKINS] Archiving <https://ci-builds.apache.org/job/webservices/job/Apache%20WSS4J%20-%20master%20JDK11/ws/policy/pom.xml> to org.apache.wss4j/wss4j-policy/4.0.0-SNAPSHOT/wss4j-policy-4.0.0-SNAPSHOT.pom
[JENKINS] Archiving <https://ci-builds.apache.org/job/webservices/job/Apache%20WSS4J%20-%20master%20JDK11/ws/integration/pom.xml> to org.apache.wss4j/wss4j-integration/4.0.0-SNAPSHOT/wss4j-integration-4.0.0-SNAPSHOT.pom
[JENKINS] Archiving <https://ci-builds.apache.org/job/webservices/job/Apache%20WSS4J%20-%20master%20JDK11/ws/ws-security-stax/pom.xml> to org.apache.wss4j/wss4j-ws-security-stax/4.0.0-SNAPSHOT/wss4j-ws-security-stax-4.0.0-SNAPSHOT.pom
[JENKINS] Archiving <https://ci-builds.apache.org/job/webservices/job/Apache%20WSS4J%20-%20master%20JDK11/ws/parent/pom.xml> to org.apache.wss4j/wss4j-parent/4.0.0-SNAPSHOT/wss4j-parent-4.0.0-SNAPSHOT.pom
[JENKINS] Archiving <https://ci-builds.apache.org/job/webservices/job/Apache%20WSS4J%20-%20master%20JDK11/ws/parent/target/wss4j-parent-4.0.0-SNAPSHOT-bom.xml> to org.apache.wss4j/wss4j-parent/4.0.0-SNAPSHOT/wss4j-parent-4.0.0-SNAPSHOT-cyclonedx.xml
[JENKINS] Archiving <https://ci-builds.apache.org/job/webservices/job/Apache%20WSS4J%20-%20master%20JDK11/ws/parent/target/wss4j-parent-4.0.0-SNAPSHOT-bom.json> to org.apache.wss4j/wss4j-parent/4.0.0-SNAPSHOT/wss4j-parent-4.0.0-SNAPSHOT-cyclonedx.json
[JENKINS] Archiving <https://ci-builds.apache.org/job/webservices/job/Apache%20WSS4J%20-%20master%20JDK11/ws/pom.xml> to org.apache.wss4j/wss4j/4.0.0-SNAPSHOT/wss4j-4.0.0-SNAPSHOT.pom
[JENKINS] Archiving <https://ci-builds.apache.org/job/webservices/job/Apache%20WSS4J%20-%20master%20JDK11/ws/target/wss4j-4.0.0-SNAPSHOT-source-release.zip> to org.apache.wss4j/wss4j/4.0.0-SNAPSHOT/wss4j-4.0.0-SNAPSHOT-source-release.zip
[JENKINS] Archiving <https://ci-builds.apache.org/job/webservices/job/Apache%20WSS4J%20-%20master%20JDK11/ws/target/wss4j-4.0.0-SNAPSHOT-bom.xml> to org.apache.wss4j/wss4j/4.0.0-SNAPSHOT/wss4j-4.0.0-SNAPSHOT-cyclonedx.xml
[JENKINS] Archiving <https://ci-builds.apache.org/job/webservices/job/Apache%20WSS4J%20-%20master%20JDK11/ws/target/wss4j-4.0.0-SNAPSHOT-bom.json> to org.apache.wss4j/wss4j/4.0.0-SNAPSHOT/wss4j-4.0.0-SNAPSHOT-cyclonedx.json
[JENKINS] Archiving <https://ci-builds.apache.org/job/webservices/job/Apache%20WSS4J%20-%20master%20JDK11/ws/target/wss4j-4.0.0-SNAPSHOT-source-release.zip.sha512> to org.apache.wss4j/wss4j/4.0.0-SNAPSHOT/wss4j-4.0.0-SNAPSHOT-source-release.zip.sha512
[JENKINS] Archiving <https://ci-builds.apache.org/job/webservices/job/Apache%20WSS4J%20-%20master%20JDK11/ws/ws-security-web/pom.xml> to org.apache.wss4j/wss4j-ws-security-web/4.0.0-SNAPSHOT/wss4j-ws-security-web-4.0.0-SNAPSHOT.pom
Sending e-mails to: dev@ws.apache.org
No mail will be sent out, as 'webservices » Apache WSS4J - master JDK11 » Apache WSS4J Streaming WS-SecurityPolicy #112' does not have a result yet. Please make sure you set a proper result in case of pipeline/build scripts.
No mail will be sent out, as 'webservices » Apache WSS4J - master JDK11 » Apache WSS4J WS-Security Common #112' does not have a result yet. Please make sure you set a proper result in case of pipeline/build scripts.
No mail will be sent out, as 'webservices » Apache WSS4J - master JDK11 » Apache WSS4J DOM WS-Security #112' does not have a result yet. Please make sure you set a proper result in case of pipeline/build scripts.
No mail will be sent out, as 'webservices » Apache WSS4J - master JDK11 » Apache WSS4J WS-SecurityPolicy model #112' does not have a result yet. Please make sure you set a proper result in case of pipeline/build scripts.
No mail will be sent out, as 'webservices » Apache WSS4J - master JDK11 » Apache WSS4J WS-Security Integration #112' does not have a result yet. Please make sure you set a proper result in case of pipeline/build scripts.
No mail will be sent out, as 'webservices » Apache WSS4J - master JDK11 » Apache WSS4J Streaming WS-Security #112' does not have a result yet. Please make sure you set a proper result in case of pipeline/build scripts.
No mail will be sent out, as 'webservices » Apache WSS4J - master JDK11 » Apache WSS4J Web WS-Security #112' does not have a result yet. Please make sure you set a proper result in case of pipeline/build scripts.
channel stopped
---------------------------------------------------------------------
To unsubscribe, e-mail: dev-unsubscribe@ws.apache.org
For additional commands, e-mail: dev-help@ws.apache.org
Build failed in Jenkins: webservices » Apache WSS4J - master JDK11 #111
Posted by Apache Jenkins Server <je...@builds.apache.org>.
See <https://ci-builds.apache.org/job/webservices/job/Apache%20WSS4J%20-%20master%20JDK11/111/display/redirect?page=changes>
Changes:
[github] Bump org.owasp:dependency-check-maven from 10.0.2 to 10.0.3 (#359)
[github] Bump com.google.errorprone:error_prone_core from 2.28.0 to 2.29.1 (#360)
------------------------------------------
[...truncated 81.95 KB...]
[INFO] Downloaded from Nexus: https://repository.apache.org/snapshots/org/apache/wss4j/wss4j-ws-security-stax/4.0.0-SNAPSHOT/wss4j-ws-security-stax-4.0.0-20240715.161054-58.jar (417 kB at 611 kB/s)
[INFO] Downloading from Nexus: https://repository.apache.org/snapshots/org/apache/wss4j/wss4j-ws-security-stax/4.0.0-SNAPSHOT/wss4j-ws-security-stax-4.0.0-20240715.161054-58-tests.jar
[INFO] Downloaded from Nexus: https://repository.apache.org/snapshots/org/apache/wss4j/wss4j-ws-security-stax/4.0.0-SNAPSHOT/wss4j-ws-security-stax-4.0.0-20240715.161054-58-tests.jar (364 kB at 1.9 MB/s)
[INFO] Downloading from A_maven.central: https://repo1.maven.org/maven2/org/apache/wss4j/wss4j-ws-security-stax/4.0.0-SNAPSHOT/wss4j-ws-security-stax-4.0.0-20240715.161054-58.pom
[INFO] Downloading from B_shibboleth: https://build.shibboleth.net/nexus/content/groups/public/org/apache/wss4j/wss4j-ws-security-stax/4.0.0-SNAPSHOT/wss4j-ws-security-stax-4.0.0-20240715.161054-58.pom
[INFO] Downloading from Nexus: https://repository.apache.org/snapshots/org/apache/wss4j/wss4j-ws-security-stax/4.0.0-SNAPSHOT/wss4j-ws-security-stax-4.0.0-20240715.161054-58.pom
[INFO] Downloaded from Nexus: https://repository.apache.org/snapshots/org/apache/wss4j/wss4j-ws-security-stax/4.0.0-SNAPSHOT/wss4j-ws-security-stax-4.0.0-20240715.161054-58.pom (5.6 kB at 32 kB/s)
[INFO] Downloading from A_maven.central: https://repo1.maven.org/maven2/org/apache/wss4j/wss4j-policy/4.0.0-SNAPSHOT/maven-metadata.xml
[INFO] Downloading from B_shibboleth: https://build.shibboleth.net/nexus/content/groups/public/org/apache/wss4j/wss4j-policy/4.0.0-SNAPSHOT/maven-metadata.xml
[INFO] Downloading from Nexus: https://repository.apache.org/snapshots/org/apache/wss4j/wss4j-policy/4.0.0-SNAPSHOT/maven-metadata.xml
[INFO] Downloaded from Nexus: https://repository.apache.org/snapshots/org/apache/wss4j/wss4j-policy/4.0.0-SNAPSHOT/maven-metadata.xml (1.6 kB at 4.5 kB/s)
[INFO] Downloading from Nexus: https://repository.apache.org/snapshots/org/apache/wss4j/wss4j-policy/4.0.0-SNAPSHOT/wss4j-policy-4.0.0-20240715.161054-58.jar
[INFO] Downloaded from Nexus: https://repository.apache.org/snapshots/org/apache/wss4j/wss4j-policy/4.0.0-SNAPSHOT/wss4j-policy-4.0.0-20240715.161054-58.jar (216 kB at 614 kB/s)
[WARNING] BOM dependency listed but is not depended upon: pkg:maven/commons-codec/commons-codec@1.17.0?type=jar
[INFO] CycloneDX: Creating BOM version 1.5 with 63 component(s)
[INFO] CycloneDX: Writing and validating BOM (XML): <https://ci-builds.apache.org/job/webservices/job/Apache%20WSS4J%20-%20master%20JDK11/ws/target/wss4j-4.0.0-SNAPSHOT-bom.xml>
[INFO] attaching as wss4j-4.0.0-SNAPSHOT-cyclonedx.xml
[INFO] CycloneDX: Writing and validating BOM (JSON): <https://ci-builds.apache.org/job/webservices/job/Apache%20WSS4J%20-%20master%20JDK11/ws/target/wss4j-4.0.0-SNAPSHOT-bom.json>
[INFO] attaching as wss4j-4.0.0-SNAPSHOT-cyclonedx.json
[INFO]
[INFO] --- checksum:1.11:artifacts (source-release-checksum) @ wss4j ---
[INFO] wss4j-4.0.0-SNAPSHOT-source-release.zip - SHA-512 : 3d6efc3812738e1aeece96dba1cdf5cd7cda17596b66f38c0db1a8bc53ce723cb165e862283cfe0276ef6f4c6e5bd10e793c5a6f1a641b49b0ba24d584983258
[INFO]
[INFO] --- gpg:3.2.4:sign (sign-release-artifacts) @ wss4j ---
[INFO] Downloading from central: https://repo.maven.apache.org/maven2/com/kohlschutter/junixsocket/junixsocket-core/2.9.1/junixsocket-core-2.9.1.pom
[INFO] Downloaded from central: https://repo.maven.apache.org/maven2/com/kohlschutter/junixsocket/junixsocket-core/2.9.1/junixsocket-core-2.9.1.pom (1.5 kB at 45 kB/s)
[INFO] Downloading from central: https://repo.maven.apache.org/maven2/com/kohlschutter/junixsocket/junixsocket/2.9.1/junixsocket-2.9.1.pom
[INFO] Downloaded from central: https://repo.maven.apache.org/maven2/com/kohlschutter/junixsocket/junixsocket/2.9.1/junixsocket-2.9.1.pom (22 kB at 711 kB/s)
[INFO] Downloading from central: https://repo.maven.apache.org/maven2/com/kohlschutter/kohlschutter-parent-multirelease/1.7.0/kohlschutter-parent-multirelease-1.7.0.pom
[INFO] Downloaded from central: https://repo.maven.apache.org/maven2/com/kohlschutter/kohlschutter-parent-multirelease/1.7.0/kohlschutter-parent-multirelease-1.7.0.pom (103 kB at 2.7 MB/s)
[INFO] Downloading from central: https://repo.maven.apache.org/maven2/com/kohlschutter/kohlschutter-parent/1.7.0/kohlschutter-parent-1.7.0.pom
[INFO] Downloaded from central: https://repo.maven.apache.org/maven2/com/kohlschutter/kohlschutter-parent/1.7.0/kohlschutter-parent-1.7.0.pom (92 kB at 2.6 MB/s)
[INFO] Downloading from central: https://repo.maven.apache.org/maven2/com/kohlschutter/junixsocket/junixsocket-native-common/2.9.1/junixsocket-native-common-2.9.1.pom
[INFO] Downloaded from central: https://repo.maven.apache.org/maven2/com/kohlschutter/junixsocket/junixsocket-native-common/2.9.1/junixsocket-native-common-2.9.1.pom (11 kB at 363 kB/s)
[INFO] Downloading from central: https://repo.maven.apache.org/maven2/com/kohlschutter/junixsocket/junixsocket-common/2.9.1/junixsocket-common-2.9.1.pom
[INFO] Downloaded from central: https://repo.maven.apache.org/maven2/com/kohlschutter/junixsocket/junixsocket-common/2.9.1/junixsocket-common-2.9.1.pom (3.7 kB at 124 kB/s)
[INFO] Downloading from central: https://repo.maven.apache.org/maven2/com/kohlschutter/junixsocket/junixsocket-native-common/2.9.1/junixsocket-native-common-2.9.1.jar
[INFO] Downloaded from central: https://repo.maven.apache.org/maven2/com/kohlschutter/junixsocket/junixsocket-native-common/2.9.1/junixsocket-native-common-2.9.1.jar (723 kB at 8.4 MB/s)
[INFO] Downloading from central: https://repo.maven.apache.org/maven2/com/kohlschutter/junixsocket/junixsocket-common/2.9.1/junixsocket-common-2.9.1.jar
[INFO] Downloaded from central: https://repo.maven.apache.org/maven2/com/kohlschutter/junixsocket/junixsocket-common/2.9.1/junixsocket-common-2.9.1.jar (1.4 MB at 11 MB/s)
[INFO]
[INFO] --- install:3.1.2:install (default-install) @ wss4j ---
[INFO] Installing <https://ci-builds.apache.org/job/webservices/job/Apache%20WSS4J%20-%20master%20JDK11/ws/pom.xml> to /home/jenkins/.m2/repository/org/apache/wss4j/wss4j/4.0.0-SNAPSHOT/wss4j-4.0.0-SNAPSHOT.pom
[INFO] Installing <https://ci-builds.apache.org/job/webservices/job/Apache%20WSS4J%20-%20master%20JDK11/ws/target/wss4j-4.0.0-SNAPSHOT-source-release.zip> to /home/jenkins/.m2/repository/org/apache/wss4j/wss4j/4.0.0-SNAPSHOT/wss4j-4.0.0-SNAPSHOT-source-release.zip
[INFO] Installing <https://ci-builds.apache.org/job/webservices/job/Apache%20WSS4J%20-%20master%20JDK11/ws/target/wss4j-4.0.0-SNAPSHOT-bom.xml> to /home/jenkins/.m2/repository/org/apache/wss4j/wss4j/4.0.0-SNAPSHOT/wss4j-4.0.0-SNAPSHOT-cyclonedx.xml
[INFO] Installing <https://ci-builds.apache.org/job/webservices/job/Apache%20WSS4J%20-%20master%20JDK11/ws/target/wss4j-4.0.0-SNAPSHOT-bom.json> to /home/jenkins/.m2/repository/org/apache/wss4j/wss4j/4.0.0-SNAPSHOT/wss4j-4.0.0-SNAPSHOT-cyclonedx.json
[INFO] Installing <https://ci-builds.apache.org/job/webservices/job/Apache%20WSS4J%20-%20master%20JDK11/ws/target/wss4j-4.0.0-SNAPSHOT-source-release.zip.sha512> to /home/jenkins/.m2/repository/org/apache/wss4j/wss4j/4.0.0-SNAPSHOT/wss4j-4.0.0-SNAPSHOT-source-release.zip.sha512
[INFO]
[INFO] --- deploy:3.1.2:deploy (default-deploy) @ wss4j ---
[INFO] Downloading from apache.snapshots.https: https://repository.apache.org/content/repositories/snapshots/org/apache/wss4j/wss4j/4.0.0-SNAPSHOT/maven-metadata.xml
[INFO] Downloaded from apache.snapshots.https: https://repository.apache.org/content/repositories/snapshots/org/apache/wss4j/wss4j/4.0.0-SNAPSHOT/maven-metadata.xml (1.5 kB at 8.4 kB/s)
[INFO] Uploading to apache.snapshots.https: https://repository.apache.org/content/repositories/snapshots/org/apache/wss4j/wss4j/4.0.0-SNAPSHOT/wss4j-4.0.0-20240718.112029-66.pom
[INFO] Uploaded to apache.snapshots.https: https://repository.apache.org/content/repositories/snapshots/org/apache/wss4j/wss4j/4.0.0-SNAPSHOT/wss4j-4.0.0-20240718.112029-66.pom (22 kB at 17 kB/s)
[INFO] Uploading to apache.snapshots.https: https://repository.apache.org/content/repositories/snapshots/org/apache/wss4j/wss4j/4.0.0-SNAPSHOT/wss4j-4.0.0-20240718.112029-66-source-release.zip
[INFO] Uploading to apache.snapshots.https: https://repository.apache.org/content/repositories/snapshots/org/apache/wss4j/wss4j/4.0.0-SNAPSHOT/wss4j-4.0.0-20240718.112029-66-cyclonedx.xml
[INFO] Uploading to apache.snapshots.https: https://repository.apache.org/content/repositories/snapshots/org/apache/wss4j/wss4j/4.0.0-SNAPSHOT/wss4j-4.0.0-20240718.112029-66-cyclonedx.json
[INFO] Uploading to apache.snapshots.https: https://repository.apache.org/content/repositories/snapshots/org/apache/wss4j/wss4j/4.0.0-SNAPSHOT/wss4j-4.0.0-20240718.112029-66-source-release.zip.sha512
[INFO] Uploaded to apache.snapshots.https: https://repository.apache.org/content/repositories/snapshots/org/apache/wss4j/wss4j/4.0.0-SNAPSHOT/wss4j-4.0.0-20240718.112029-66-source-release.zip.sha512 (128 B at 167 B/s)
[INFO] Uploaded to apache.snapshots.https: https://repository.apache.org/content/repositories/snapshots/org/apache/wss4j/wss4j/4.0.0-SNAPSHOT/wss4j-4.0.0-20240718.112029-66-cyclonedx.json (171 kB at 90 kB/s)
[INFO] Uploaded to apache.snapshots.https: https://repository.apache.org/content/repositories/snapshots/org/apache/wss4j/wss4j/4.0.0-SNAPSHOT/wss4j-4.0.0-20240718.112029-66-cyclonedx.xml (150 kB at 78 kB/s)
[INFO] Uploaded to apache.snapshots.https: https://repository.apache.org/content/repositories/snapshots/org/apache/wss4j/wss4j/4.0.0-SNAPSHOT/wss4j-4.0.0-20240718.112029-66-source-release.zip (2.1 MB at 1.0 MB/s)
[INFO] Downloading from apache.snapshots.https: https://repository.apache.org/content/repositories/snapshots/org/apache/wss4j/wss4j/maven-metadata.xml
[INFO] Downloaded from apache.snapshots.https: https://repository.apache.org/content/repositories/snapshots/org/apache/wss4j/wss4j/maven-metadata.xml (590 B at 2.9 kB/s)
[INFO] Uploading to apache.snapshots.https: https://repository.apache.org/content/repositories/snapshots/org/apache/wss4j/wss4j/4.0.0-SNAPSHOT/maven-metadata.xml
[INFO] Uploaded to apache.snapshots.https: https://repository.apache.org/content/repositories/snapshots/org/apache/wss4j/wss4j/4.0.0-SNAPSHOT/maven-metadata.xml (1.5 kB at 1.3 kB/s)
[INFO] Uploading to apache.snapshots.https: https://repository.apache.org/content/repositories/snapshots/org/apache/wss4j/wss4j/maven-metadata.xml
[INFO] Uploaded to apache.snapshots.https: https://repository.apache.org/content/repositories/snapshots/org/apache/wss4j/wss4j/maven-metadata.xml (590 B at 502 B/s)
[WARNING] Attempt to (de-)serialize anonymous class org.jfrog.hudson.maven2.MavenDependenciesRecorder$1; see: https://jenkins.io/redirect/serialization-of-anonymous-classes/
[INFO]
[INFO] -------------------< org.apache.wss4j:wss4j-parent >--------------------
[INFO] Building Apache WSS4J parent 4.0.0-SNAPSHOT [2/10]
[INFO] from parent/pom.xml
[INFO] --------------------------------[ pom ]---------------------------------
[WARNING] Parameter 'sourceEncoding' is unknown for plugin 'maven-pmd-plugin:3.19.0:check (validate)'
[WARNING] Parameter 'sourceEncoding' is unknown for plugin 'maven-pmd-plugin:3.19.0:pmd (pmd)'
[WARNING] Parameter 'encoding' is unknown for plugin 'maven-checkstyle-plugin:3.4.0:check (validate)'
[INFO]
[INFO] --- clean:3.4.0:clean (default-clean) @ wss4j-parent ---
[INFO]
[INFO] --- enforcer:3.5.0:enforce (enforce-maven-version) @ wss4j-parent ---
[INFO]
[INFO] --- enforcer:3.5.0:enforce (enforce-java-version) @ wss4j-parent ---
[INFO]
[INFO] >>> pmd:3.19.0:check (validate) > :pmd @ wss4j-parent >>>
[INFO]
[INFO] --- pmd:3.19.0:pmd (pmd) @ wss4j-parent ---
[INFO]
[INFO] <<< pmd:3.19.0:check (validate) < :pmd @ wss4j-parent <<<
[INFO]
[INFO]
[INFO] --- pmd:3.19.0:check (validate) @ wss4j-parent ---
[INFO]
[INFO] --- checkstyle:3.4.0:check (validate) @ wss4j-parent ---
[INFO] You have 0 Checkstyle violations.
[INFO]
[INFO] --- bundle:5.1.9:cleanVersions (versions) @ wss4j-parent ---
[INFO]
[INFO] --- remote-resources:3.2.0:process (process-resource-bundles) @ wss4j-parent ---
[INFO] Preparing remote bundle org.apache.apache.resources:apache-jar-resource-bundle:1.5
[INFO] Copying 3 resources from 1 bundle.
[INFO]
[INFO] --- bundle:5.1.9:manifest (bundle-manifest) @ wss4j-parent ---
[WARNING] Ignoring project type pom - supportedProjectTypes = [jar, bundle]
[INFO]
[INFO] --- assembly:3.7.1:single (source-release-assembly) @ wss4j-parent ---
[INFO] Skipping the assembly in this project because it's not the Execution Root
[INFO]
[INFO] --- source:3.3.1:jar-no-fork (attach-sources) @ wss4j-parent ---
[INFO]
[INFO] --- javadoc:3.7.0:jar (default) @ wss4j-parent ---
[INFO] Not executing Javadoc as the project is not a Java classpath-capable package
[INFO]
[INFO] --- javadoc:3.7.0:jar (attach-javadocs) @ wss4j-parent ---
[INFO] Not executing Javadoc as the project is not a Java classpath-capable package
[INFO]
[INFO] --- cyclonedx:2.8.0:makeAggregateBom (make-bom) @ wss4j-parent ---
[INFO] CycloneDX: Resolving Dependencies
[INFO] CycloneDX: Creating BOM version 1.5 with 0 component(s)
[INFO] CycloneDX: Writing and validating BOM (XML): <https://ci-builds.apache.org/job/webservices/job/Apache%20WSS4J%20-%20master%20JDK11/ws/parent/target/wss4j-parent-4.0.0-SNAPSHOT-bom.xml>
[INFO] attaching as wss4j-parent-4.0.0-SNAPSHOT-cyclonedx.xml
[INFO] CycloneDX: Writing and validating BOM (JSON): <https://ci-builds.apache.org/job/webservices/job/Apache%20WSS4J%20-%20master%20JDK11/ws/parent/target/wss4j-parent-4.0.0-SNAPSHOT-bom.json>
[INFO] attaching as wss4j-parent-4.0.0-SNAPSHOT-cyclonedx.json
[INFO]
[INFO] --- checksum:1.11:artifacts (source-release-checksum) @ wss4j-parent ---
[INFO]
[INFO] --- gpg:3.2.4:sign (sign-release-artifacts) @ wss4j-parent ---
[INFO]
[INFO] --- install:3.1.2:install (default-install) @ wss4j-parent ---
[INFO] Installing <https://ci-builds.apache.org/job/webservices/job/Apache%20WSS4J%20-%20master%20JDK11/ws/parent/pom.xml> to /home/jenkins/.m2/repository/org/apache/wss4j/wss4j-parent/4.0.0-SNAPSHOT/wss4j-parent-4.0.0-SNAPSHOT.pom
[INFO] Installing <https://ci-builds.apache.org/job/webservices/job/Apache%20WSS4J%20-%20master%20JDK11/ws/parent/target/wss4j-parent-4.0.0-SNAPSHOT-bom.xml> to /home/jenkins/.m2/repository/org/apache/wss4j/wss4j-parent/4.0.0-SNAPSHOT/wss4j-parent-4.0.0-SNAPSHOT-cyclonedx.xml
[INFO] Installing <https://ci-builds.apache.org/job/webservices/job/Apache%20WSS4J%20-%20master%20JDK11/ws/parent/target/wss4j-parent-4.0.0-SNAPSHOT-bom.json> to /home/jenkins/.m2/repository/org/apache/wss4j/wss4j-parent/4.0.0-SNAPSHOT/wss4j-parent-4.0.0-SNAPSHOT-cyclonedx.json
[INFO]
[INFO] --- deploy:3.1.2:deploy (default-deploy) @ wss4j-parent ---
[INFO] Downloading from apache.snapshots.https: https://repository.apache.org/content/repositories/snapshots/org/apache/wss4j/wss4j-parent/4.0.0-SNAPSHOT/maven-metadata.xml
[INFO] Downloaded from apache.snapshots.https: https://repository.apache.org/content/repositories/snapshots/org/apache/wss4j/wss4j-parent/4.0.0-SNAPSHOT/maven-metadata.xml (1.0 kB at 1.9 kB/s)
[INFO] Uploading to apache.snapshots.https: https://repository.apache.org/content/repositories/snapshots/org/apache/wss4j/wss4j-parent/4.0.0-SNAPSHOT/wss4j-parent-4.0.0-20240718.112029-66.pom
[INFO] Uploaded to apache.snapshots.https: https://repository.apache.org/content/repositories/snapshots/org/apache/wss4j/wss4j-parent/4.0.0-SNAPSHOT/wss4j-parent-4.0.0-20240718.112029-66.pom (16 kB at 13 kB/s)
[INFO] Uploading to apache.snapshots.https: https://repository.apache.org/content/repositories/snapshots/org/apache/wss4j/wss4j-parent/4.0.0-SNAPSHOT/wss4j-parent-4.0.0-20240718.112029-66-cyclonedx.xml
[INFO] Uploading to apache.snapshots.https: https://repository.apache.org/content/repositories/snapshots/org/apache/wss4j/wss4j-parent/4.0.0-SNAPSHOT/wss4j-parent-4.0.0-20240718.112029-66-cyclonedx.json
[INFO] Uploaded to apache.snapshots.https: https://repository.apache.org/content/repositories/snapshots/org/apache/wss4j/wss4j-parent/4.0.0-SNAPSHOT/wss4j-parent-4.0.0-20240718.112029-66-cyclonedx.xml (3.0 kB at 2.9 kB/s)
[INFO] Uploaded to apache.snapshots.https: https://repository.apache.org/content/repositories/snapshots/org/apache/wss4j/wss4j-parent/4.0.0-SNAPSHOT/wss4j-parent-4.0.0-20240718.112029-66-cyclonedx.json (3.4 kB at 2.4 kB/s)
[INFO] Downloading from apache.snapshots.https: https://repository.apache.org/content/repositories/snapshots/org/apache/wss4j/wss4j-parent/maven-metadata.xml
[INFO] Downloaded from apache.snapshots.https: https://repository.apache.org/content/repositories/snapshots/org/apache/wss4j/wss4j-parent/maven-metadata.xml (597 B at 3.1 kB/s)
[INFO] Uploading to apache.snapshots.https: https://repository.apache.org/content/repositories/snapshots/org/apache/wss4j/wss4j-parent/4.0.0-SNAPSHOT/maven-metadata.xml
[INFO] Uploaded to apache.snapshots.https: https://repository.apache.org/content/repositories/snapshots/org/apache/wss4j/wss4j-parent/4.0.0-SNAPSHOT/maven-metadata.xml (1.0 kB at 1.0 kB/s)
[INFO] Uploading to apache.snapshots.https: https://repository.apache.org/content/repositories/snapshots/org/apache/wss4j/wss4j-parent/maven-metadata.xml
[INFO] Uploaded to apache.snapshots.https: https://repository.apache.org/content/repositories/snapshots/org/apache/wss4j/wss4j-parent/maven-metadata.xml (597 B at 535 B/s)
[INFO]
[INFO] ------------------< org.apache.wss4j:wss4j-bindings >-------------------
[INFO] Building Apache WSS4J WS-Security Bindings 4.0.0-SNAPSHOT [3/10]
[INFO] from bindings/pom.xml
[INFO] --------------------------------[ jar ]---------------------------------
[WARNING] Parameter 'sourceEncoding' is unknown for plugin 'maven-pmd-plugin:3.19.0:check (validate)'
[WARNING] Parameter 'sourceEncoding' is unknown for plugin 'maven-pmd-plugin:3.19.0:pmd (pmd)'
[WARNING] Parameter 'encoding' is unknown for plugin 'maven-checkstyle-plugin:3.4.0:check (validate)'
[INFO]
[INFO] --- clean:3.4.0:clean (default-clean) @ wss4j-bindings ---
[INFO]
[INFO] --- enforcer:3.5.0:enforce (enforce-maven-version) @ wss4j-bindings ---
[INFO]
[INFO] --- enforcer:3.5.0:enforce (enforce-java-version) @ wss4j-bindings ---
[INFO]
[INFO] >>> pmd:3.19.0:check (validate) > :pmd @ wss4j-bindings >>>
[INFO]
[INFO] --- pmd:3.19.0:pmd (pmd) @ wss4j-bindings ---
[INFO] PMD version: 6.49.0
[WARNING] Removed misconfigured rule: LoosePackageCoupling cause: No packages or classes specified
[INFO] Rendering content with org.apache.maven.skins:maven-default-skin:jar:1.3 skin.
[INFO]
[INFO] <<< pmd:3.19.0:check (validate) < :pmd @ wss4j-bindings <<<
[INFO]
[INFO]
[INFO] --- pmd:3.19.0:check (validate) @ wss4j-bindings ---
[INFO] PMD version: 6.49.0
[INFO]
[INFO]
[INFO] --- checkstyle:3.4.0:check (validate) @ wss4j-bindings ---
[INFO]
[INFO] --- bundle:5.1.9:cleanVersions (versions) @ wss4j-bindings ---
[INFO]
[INFO] --- remote-resources:3.2.0:process (process-resource-bundles) @ wss4j-bindings ---
[INFO] Preparing remote bundle org.apache.apache.resources:apache-jar-resource-bundle:1.5
[INFO] Copying 3 resources from 1 bundle.
[INFO]
[INFO] --- resources:3.3.1:resources (default-resources) @ wss4j-bindings ---
[INFO] Copying 0 resource from src/main/java to target/classes
[INFO] skip non existing resourceDirectory <https://ci-builds.apache.org/job/webservices/job/Apache%20WSS4J%20-%20master%20JDK11/ws/bindings/src/main/resources>
[INFO] skip non existing resourceDirectory <https://ci-builds.apache.org/job/webservices/job/Apache%20WSS4J%20-%20master%20JDK11/ws/bindings/src/main/resources-filtered>
[INFO] skip non existing resourceDirectory <https://ci-builds.apache.org/job/webservices/job/Apache%20WSS4J%20-%20master%20JDK11/ws/bindings/target/generated/src/main/resources>
[INFO] Copying 3 resources from target/maven-shared-archive-resources to target/classes
[INFO]
[INFO] --- compiler:3.13.0:compile (default-compile) @ wss4j-bindings ---
[INFO] Recompiling the module because of changed source code.
[INFO] Compiling 36 source files with javac [debug release 17] to target/classes
[INFO] ------------------------------------------------------------------------
[INFO] Reactor Summary for Apache WSS4J 4.0.0-SNAPSHOT:
[INFO]
[INFO] Apache WSS4J ....................................... SUCCESS [01:01 min]
[INFO] Apache WSS4J parent ................................ SUCCESS [ 13.179 s]
[INFO] Apache WSS4J WS-Security Bindings .................. FAILURE [ 7.479 s]
[INFO] Apache WSS4J WS-SecurityPolicy model ............... SKIPPED
[INFO] Apache WSS4J WS-Security Common .................... SKIPPED
[INFO] Apache WSS4J DOM WS-Security ....................... SKIPPED
[INFO] Apache WSS4J Streaming WS-Security ................. SKIPPED
[INFO] Apache WSS4J Web WS-Security ....................... SKIPPED
[INFO] Apache WSS4J WS-Security Integration ............... SKIPPED
[INFO] Apache WSS4J Streaming WS-SecurityPolicy ........... SKIPPED
[INFO] ------------------------------------------------------------------------
[INFO] BUILD FAILURE
[INFO] ------------------------------------------------------------------------
[INFO] Total time: 01:49 min
[INFO] Finished at: 2024-07-18T11:22:19Z
[INFO] ------------------------------------------------------------------------
Waiting for Jenkins to finish collecting data
[ERROR] Failed to execute goal org.apache.maven.plugins:maven-compiler-plugin:3.13.0:compile (default-compile) on project wss4j-bindings: Fatal error compiling: error: release version 17 not supported -> [Help 1]
[ERROR]
[ERROR] To see the full stack trace of the errors, re-run Maven with the -e switch.
[ERROR] Re-run Maven using the -X switch to enable full debug logging.
[ERROR]
[ERROR] For more information about the errors and possible solutions, please read the following articles:
[ERROR] [Help 1] http://cwiki.apache.org/confluence/display/MAVEN/MojoExecutionException
[ERROR]
[ERROR] After correcting the problems, you can resume the build with the command
[ERROR] mvn <goals> -rf :wss4j-bindings
[JENKINS] Archiving <https://ci-builds.apache.org/job/webservices/job/Apache%20WSS4J%20-%20master%20JDK11/ws/bindings/pom.xml> to org.apache.wss4j/wss4j-bindings/4.0.0-SNAPSHOT/wss4j-bindings-4.0.0-SNAPSHOT.pom
[JENKINS] Archiving <https://ci-builds.apache.org/job/webservices/job/Apache%20WSS4J%20-%20master%20JDK11/ws/ws-security-policy-stax/pom.xml> to org.apache.wss4j/wss4j-ws-security-policy-stax/4.0.0-SNAPSHOT/wss4j-ws-security-policy-stax-4.0.0-SNAPSHOT.pom
[JENKINS] Archiving <https://ci-builds.apache.org/job/webservices/job/Apache%20WSS4J%20-%20master%20JDK11/ws/ws-security-common/pom.xml> to org.apache.wss4j/wss4j-ws-security-common/4.0.0-SNAPSHOT/wss4j-ws-security-common-4.0.0-SNAPSHOT.pom
[JENKINS] Archiving <https://ci-builds.apache.org/job/webservices/job/Apache%20WSS4J%20-%20master%20JDK11/ws/ws-security-dom/pom.xml> to org.apache.wss4j/wss4j-ws-security-dom/4.0.0-SNAPSHOT/wss4j-ws-security-dom-4.0.0-SNAPSHOT.pom
[JENKINS] Archiving <https://ci-builds.apache.org/job/webservices/job/Apache%20WSS4J%20-%20master%20JDK11/ws/policy/pom.xml> to org.apache.wss4j/wss4j-policy/4.0.0-SNAPSHOT/wss4j-policy-4.0.0-SNAPSHOT.pom
[JENKINS] Archiving <https://ci-builds.apache.org/job/webservices/job/Apache%20WSS4J%20-%20master%20JDK11/ws/integration/pom.xml> to org.apache.wss4j/wss4j-integration/4.0.0-SNAPSHOT/wss4j-integration-4.0.0-SNAPSHOT.pom
[JENKINS] Archiving <https://ci-builds.apache.org/job/webservices/job/Apache%20WSS4J%20-%20master%20JDK11/ws/ws-security-stax/pom.xml> to org.apache.wss4j/wss4j-ws-security-stax/4.0.0-SNAPSHOT/wss4j-ws-security-stax-4.0.0-SNAPSHOT.pom
[JENKINS] Archiving <https://ci-builds.apache.org/job/webservices/job/Apache%20WSS4J%20-%20master%20JDK11/ws/parent/pom.xml> to org.apache.wss4j/wss4j-parent/4.0.0-SNAPSHOT/wss4j-parent-4.0.0-SNAPSHOT.pom
[JENKINS] Archiving <https://ci-builds.apache.org/job/webservices/job/Apache%20WSS4J%20-%20master%20JDK11/ws/parent/target/wss4j-parent-4.0.0-SNAPSHOT-bom.xml> to org.apache.wss4j/wss4j-parent/4.0.0-SNAPSHOT/wss4j-parent-4.0.0-SNAPSHOT-cyclonedx.xml
[JENKINS] Archiving <https://ci-builds.apache.org/job/webservices/job/Apache%20WSS4J%20-%20master%20JDK11/ws/parent/target/wss4j-parent-4.0.0-SNAPSHOT-bom.json> to org.apache.wss4j/wss4j-parent/4.0.0-SNAPSHOT/wss4j-parent-4.0.0-SNAPSHOT-cyclonedx.json
[JENKINS] Archiving <https://ci-builds.apache.org/job/webservices/job/Apache%20WSS4J%20-%20master%20JDK11/ws/pom.xml> to org.apache.wss4j/wss4j/4.0.0-SNAPSHOT/wss4j-4.0.0-SNAPSHOT.pom
[JENKINS] Archiving <https://ci-builds.apache.org/job/webservices/job/Apache%20WSS4J%20-%20master%20JDK11/ws/target/wss4j-4.0.0-SNAPSHOT-source-release.zip> to org.apache.wss4j/wss4j/4.0.0-SNAPSHOT/wss4j-4.0.0-SNAPSHOT-source-release.zip
[JENKINS] Archiving <https://ci-builds.apache.org/job/webservices/job/Apache%20WSS4J%20-%20master%20JDK11/ws/target/wss4j-4.0.0-SNAPSHOT-bom.xml> to org.apache.wss4j/wss4j/4.0.0-SNAPSHOT/wss4j-4.0.0-SNAPSHOT-cyclonedx.xml
[JENKINS] Archiving <https://ci-builds.apache.org/job/webservices/job/Apache%20WSS4J%20-%20master%20JDK11/ws/target/wss4j-4.0.0-SNAPSHOT-bom.json> to org.apache.wss4j/wss4j/4.0.0-SNAPSHOT/wss4j-4.0.0-SNAPSHOT-cyclonedx.json
[JENKINS] Archiving <https://ci-builds.apache.org/job/webservices/job/Apache%20WSS4J%20-%20master%20JDK11/ws/target/wss4j-4.0.0-SNAPSHOT-source-release.zip.sha512> to org.apache.wss4j/wss4j/4.0.0-SNAPSHOT/wss4j-4.0.0-SNAPSHOT-source-release.zip.sha512
[JENKINS] Archiving <https://ci-builds.apache.org/job/webservices/job/Apache%20WSS4J%20-%20master%20JDK11/ws/ws-security-web/pom.xml> to org.apache.wss4j/wss4j-ws-security-web/4.0.0-SNAPSHOT/wss4j-ws-security-web-4.0.0-SNAPSHOT.pom
Sending e-mails to: dev@ws.apache.org
No mail will be sent out, as 'webservices » Apache WSS4J - master JDK11 » Apache WSS4J Streaming WS-SecurityPolicy #111' does not have a result yet. Please make sure you set a proper result in case of pipeline/build scripts.
No mail will be sent out, as 'webservices » Apache WSS4J - master JDK11 » Apache WSS4J WS-Security Common #111' does not have a result yet. Please make sure you set a proper result in case of pipeline/build scripts.
No mail will be sent out, as 'webservices » Apache WSS4J - master JDK11 » Apache WSS4J DOM WS-Security #111' does not have a result yet. Please make sure you set a proper result in case of pipeline/build scripts.
No mail will be sent out, as 'webservices » Apache WSS4J - master JDK11 » Apache WSS4J WS-SecurityPolicy model #111' does not have a result yet. Please make sure you set a proper result in case of pipeline/build scripts.
No mail will be sent out, as 'webservices » Apache WSS4J - master JDK11 » Apache WSS4J WS-Security Integration #111' does not have a result yet. Please make sure you set a proper result in case of pipeline/build scripts.
No mail will be sent out, as 'webservices » Apache WSS4J - master JDK11 » Apache WSS4J Streaming WS-Security #111' does not have a result yet. Please make sure you set a proper result in case of pipeline/build scripts.
No mail will be sent out, as 'webservices » Apache WSS4J - master JDK11 » Apache WSS4J Web WS-Security #111' does not have a result yet. Please make sure you set a proper result in case of pipeline/build scripts.
channel stopped
---------------------------------------------------------------------
To unsubscribe, e-mail: dev-unsubscribe@ws.apache.org
For additional commands, e-mail: dev-help@ws.apache.org
Build failed in Jenkins: webservices » Apache WSS4J - master JDK11 #110
Posted by Apache Jenkins Server <je...@builds.apache.org>.
See <https://ci-builds.apache.org/job/webservices/job/Apache%20WSS4J%20-%20master%20JDK11/110/display/redirect?page=changes>
Changes:
[Colm O hEigeartaigh] Temp downgrade to get PR to pass
[github] [WSS-710] Implementation of the configurations for KeyDerivation functions (#298)
[Colm O hEigeartaigh] Revert "Temp downgrade to get PR to pass"
[github] Bump github/codeql-action from 3.25.11 to 3.25.12 (#356)
[github] Bump org.apache.maven.plugins:maven-surefire-plugin from 3.3.0 to 3.3.1 (#355)
[github] Bump org.apache.maven.plugins:maven-project-info-reports-plugin (#354)
[github] Bump org.apache:apache from 32 to 33 (#353)
[Colm O hEigeartaigh] WSS-710 Some cleanup
------------------------------------------
[...truncated 11.87 KB...]
[INFO] Downloading from Nexus: https://repository.apache.org/snapshots/org/apache/wss4j/wss4j-bindings/4.0.0-SNAPSHOT/wss4j-bindings-4.0.0-20240715.161054-58.jar
[INFO] Downloaded from Nexus: https://repository.apache.org/snapshots/org/apache/wss4j/wss4j-bindings/4.0.0-SNAPSHOT/wss4j-bindings-4.0.0-20240715.161054-58.jar (44 kB at 235 kB/s)
[INFO] Downloading from Nexus: https://repository.apache.org/snapshots/org/apache/wss4j/wss4j-ws-security-dom/4.0.0-SNAPSHOT/wss4j-ws-security-dom-4.0.0-20240715.161054-58.jar
[INFO] Downloaded from Nexus: https://repository.apache.org/snapshots/org/apache/wss4j/wss4j-ws-security-dom/4.0.0-SNAPSHOT/wss4j-ws-security-dom-4.0.0-20240715.161054-58.jar (349 kB at 958 kB/s)
[INFO] Downloading from Nexus: https://repository.apache.org/snapshots/org/apache/wss4j/wss4j-ws-security-dom/4.0.0-SNAPSHOT/wss4j-ws-security-dom-4.0.0-20240715.161054-58-tests.jar
[INFO] Downloaded from Nexus: https://repository.apache.org/snapshots/org/apache/wss4j/wss4j-ws-security-dom/4.0.0-SNAPSHOT/wss4j-ws-security-dom-4.0.0-20240715.161054-58-tests.jar (425 kB at 1.6 MB/s)
[INFO] Downloading from A_maven.central: https://repo1.maven.org/maven2/org/apache/wss4j/wss4j-ws-security-dom/4.0.0-SNAPSHOT/wss4j-ws-security-dom-4.0.0-20240715.161054-58.pom
[INFO] Downloading from B_shibboleth: https://build.shibboleth.net/nexus/content/groups/public/org/apache/wss4j/wss4j-ws-security-dom/4.0.0-SNAPSHOT/wss4j-ws-security-dom-4.0.0-20240715.161054-58.pom
[INFO] Downloading from Nexus: https://repository.apache.org/snapshots/org/apache/wss4j/wss4j-ws-security-dom/4.0.0-SNAPSHOT/wss4j-ws-security-dom-4.0.0-20240715.161054-58.pom
[INFO] Downloaded from Nexus: https://repository.apache.org/snapshots/org/apache/wss4j/wss4j-ws-security-dom/4.0.0-SNAPSHOT/wss4j-ws-security-dom-4.0.0-20240715.161054-58.pom (5.2 kB at 29 kB/s)
[INFO] Downloading from A_maven.central: https://repo1.maven.org/maven2/org/apache/wss4j/wss4j-ws-security-stax/4.0.0-SNAPSHOT/maven-metadata.xml
[INFO] Downloading from Nexus: https://repository.apache.org/snapshots/org/apache/wss4j/wss4j-ws-security-stax/4.0.0-SNAPSHOT/maven-metadata.xml
[INFO] Downloading from B_shibboleth: https://build.shibboleth.net/nexus/content/groups/public/org/apache/wss4j/wss4j-ws-security-stax/4.0.0-SNAPSHOT/maven-metadata.xml
[INFO] Downloaded from Nexus: https://repository.apache.org/snapshots/org/apache/wss4j/wss4j-ws-security-stax/4.0.0-SNAPSHOT/maven-metadata.xml (1.9 kB at 5.1 kB/s)
[INFO] Downloading from Nexus: https://repository.apache.org/snapshots/org/apache/wss4j/wss4j-ws-security-stax/4.0.0-SNAPSHOT/wss4j-ws-security-stax-4.0.0-20240715.161054-58.jar
[INFO] Downloaded from Nexus: https://repository.apache.org/snapshots/org/apache/wss4j/wss4j-ws-security-stax/4.0.0-SNAPSHOT/wss4j-ws-security-stax-4.0.0-20240715.161054-58.jar (417 kB at 569 kB/s)
[INFO] Downloading from Nexus: https://repository.apache.org/snapshots/org/apache/wss4j/wss4j-ws-security-stax/4.0.0-SNAPSHOT/wss4j-ws-security-stax-4.0.0-20240715.161054-58-tests.jar
[INFO] Downloaded from Nexus: https://repository.apache.org/snapshots/org/apache/wss4j/wss4j-ws-security-stax/4.0.0-SNAPSHOT/wss4j-ws-security-stax-4.0.0-20240715.161054-58-tests.jar (364 kB at 1.4 MB/s)
[INFO] Downloading from A_maven.central: https://repo1.maven.org/maven2/org/apache/wss4j/wss4j-ws-security-stax/4.0.0-SNAPSHOT/wss4j-ws-security-stax-4.0.0-20240715.161054-58.pom
[INFO] Downloading from B_shibboleth: https://build.shibboleth.net/nexus/content/groups/public/org/apache/wss4j/wss4j-ws-security-stax/4.0.0-SNAPSHOT/wss4j-ws-security-stax-4.0.0-20240715.161054-58.pom
[INFO] Downloading from Nexus: https://repository.apache.org/snapshots/org/apache/wss4j/wss4j-ws-security-stax/4.0.0-SNAPSHOT/wss4j-ws-security-stax-4.0.0-20240715.161054-58.pom
[INFO] Downloaded from Nexus: https://repository.apache.org/snapshots/org/apache/wss4j/wss4j-ws-security-stax/4.0.0-SNAPSHOT/wss4j-ws-security-stax-4.0.0-20240715.161054-58.pom (5.6 kB at 29 kB/s)
[INFO] Downloading from A_maven.central: https://repo1.maven.org/maven2/org/apache/wss4j/wss4j-policy/4.0.0-SNAPSHOT/maven-metadata.xml
[INFO] Downloading from B_shibboleth: https://build.shibboleth.net/nexus/content/groups/public/org/apache/wss4j/wss4j-policy/4.0.0-SNAPSHOT/maven-metadata.xml
[INFO] Downloading from Nexus: https://repository.apache.org/snapshots/org/apache/wss4j/wss4j-policy/4.0.0-SNAPSHOT/maven-metadata.xml
[INFO] Downloaded from Nexus: https://repository.apache.org/snapshots/org/apache/wss4j/wss4j-policy/4.0.0-SNAPSHOT/maven-metadata.xml (1.6 kB at 2.9 kB/s)
[INFO] Downloading from Nexus: https://repository.apache.org/snapshots/org/apache/wss4j/wss4j-policy/4.0.0-SNAPSHOT/wss4j-policy-4.0.0-20240715.161054-58.jar
[INFO] Downloaded from Nexus: https://repository.apache.org/snapshots/org/apache/wss4j/wss4j-policy/4.0.0-SNAPSHOT/wss4j-policy-4.0.0-20240715.161054-58.jar (216 kB at 406 kB/s)
[INFO] CycloneDX: Creating BOM version 1.5 with 62 component(s)
[INFO] CycloneDX: Writing and validating BOM (XML): <https://ci-builds.apache.org/job/webservices/job/Apache%20WSS4J%20-%20master%20JDK11/ws/target/wss4j-4.0.0-SNAPSHOT-bom.xml>
[INFO] attaching as wss4j-4.0.0-SNAPSHOT-cyclonedx.xml
[INFO] CycloneDX: Writing and validating BOM (JSON): <https://ci-builds.apache.org/job/webservices/job/Apache%20WSS4J%20-%20master%20JDK11/ws/target/wss4j-4.0.0-SNAPSHOT-bom.json>
[INFO] attaching as wss4j-4.0.0-SNAPSHOT-cyclonedx.json
[INFO]
[INFO] --- checksum:1.11:artifacts (source-release-checksum) @ wss4j ---
[INFO] wss4j-4.0.0-SNAPSHOT-source-release.zip - SHA-512 : 302236daf64f39d1285ce9af9dc1707a94f14309a5f330766e3dc077892a0cc7e5e3f1daafad84020f6ed96b57d61ab3d3930d2c828db10e64d0a8312a77cf3a
[INFO]
[INFO] --- gpg:3.2.4:sign (sign-release-artifacts) @ wss4j ---
[INFO]
[INFO] --- install:3.1.2:install (default-install) @ wss4j ---
[INFO] Installing <https://ci-builds.apache.org/job/webservices/job/Apache%20WSS4J%20-%20master%20JDK11/ws/pom.xml> to /home/jenkins/.m2/repository/org/apache/wss4j/wss4j/4.0.0-SNAPSHOT/wss4j-4.0.0-SNAPSHOT.pom
[INFO] Installing <https://ci-builds.apache.org/job/webservices/job/Apache%20WSS4J%20-%20master%20JDK11/ws/target/wss4j-4.0.0-SNAPSHOT-source-release.zip> to /home/jenkins/.m2/repository/org/apache/wss4j/wss4j/4.0.0-SNAPSHOT/wss4j-4.0.0-SNAPSHOT-source-release.zip
[INFO] Installing <https://ci-builds.apache.org/job/webservices/job/Apache%20WSS4J%20-%20master%20JDK11/ws/target/wss4j-4.0.0-SNAPSHOT-bom.xml> to /home/jenkins/.m2/repository/org/apache/wss4j/wss4j/4.0.0-SNAPSHOT/wss4j-4.0.0-SNAPSHOT-cyclonedx.xml
[INFO] Installing <https://ci-builds.apache.org/job/webservices/job/Apache%20WSS4J%20-%20master%20JDK11/ws/target/wss4j-4.0.0-SNAPSHOT-bom.json> to /home/jenkins/.m2/repository/org/apache/wss4j/wss4j/4.0.0-SNAPSHOT/wss4j-4.0.0-SNAPSHOT-cyclonedx.json
[INFO] Installing <https://ci-builds.apache.org/job/webservices/job/Apache%20WSS4J%20-%20master%20JDK11/ws/target/wss4j-4.0.0-SNAPSHOT-source-release.zip.sha512> to /home/jenkins/.m2/repository/org/apache/wss4j/wss4j/4.0.0-SNAPSHOT/wss4j-4.0.0-SNAPSHOT-source-release.zip.sha512
[INFO]
[INFO] --- deploy:3.1.2:deploy (default-deploy) @ wss4j ---
[INFO] Downloading from apache.snapshots.https: https://repository.apache.org/content/repositories/snapshots/org/apache/wss4j/wss4j/4.0.0-SNAPSHOT/maven-metadata.xml
[INFO] Downloaded from apache.snapshots.https: https://repository.apache.org/content/repositories/snapshots/org/apache/wss4j/wss4j/4.0.0-SNAPSHOT/maven-metadata.xml (1.5 kB at 8.3 kB/s)
[INFO] Uploading to apache.snapshots.https: https://repository.apache.org/content/repositories/snapshots/org/apache/wss4j/wss4j/4.0.0-SNAPSHOT/wss4j-4.0.0-20240716.012545-65.pom
[INFO] Uploaded to apache.snapshots.https: https://repository.apache.org/content/repositories/snapshots/org/apache/wss4j/wss4j/4.0.0-SNAPSHOT/wss4j-4.0.0-20240716.012545-65.pom (22 kB at 16 kB/s)
[INFO] Uploading to apache.snapshots.https: https://repository.apache.org/content/repositories/snapshots/org/apache/wss4j/wss4j/4.0.0-SNAPSHOT/wss4j-4.0.0-20240716.012545-65-source-release.zip
[INFO] Uploading to apache.snapshots.https: https://repository.apache.org/content/repositories/snapshots/org/apache/wss4j/wss4j/4.0.0-SNAPSHOT/wss4j-4.0.0-20240716.012545-65-cyclonedx.xml
[INFO] Uploading to apache.snapshots.https: https://repository.apache.org/content/repositories/snapshots/org/apache/wss4j/wss4j/4.0.0-SNAPSHOT/wss4j-4.0.0-20240716.012545-65-cyclonedx.json
[INFO] Uploading to apache.snapshots.https: https://repository.apache.org/content/repositories/snapshots/org/apache/wss4j/wss4j/4.0.0-SNAPSHOT/wss4j-4.0.0-20240716.012545-65-source-release.zip.sha512
[INFO] Uploaded to apache.snapshots.https: https://repository.apache.org/content/repositories/snapshots/org/apache/wss4j/wss4j/4.0.0-SNAPSHOT/wss4j-4.0.0-20240716.012545-65-source-release.zip.sha512 (128 B at 175 B/s)
[INFO] Uploaded to apache.snapshots.https: https://repository.apache.org/content/repositories/snapshots/org/apache/wss4j/wss4j/4.0.0-SNAPSHOT/wss4j-4.0.0-20240716.012545-65-cyclonedx.xml (147 kB at 76 kB/s)
[INFO] Uploaded to apache.snapshots.https: https://repository.apache.org/content/repositories/snapshots/org/apache/wss4j/wss4j/4.0.0-SNAPSHOT/wss4j-4.0.0-20240716.012545-65-source-release.zip (2.1 MB at 1.1 MB/s)
[INFO] Uploaded to apache.snapshots.https: https://repository.apache.org/content/repositories/snapshots/org/apache/wss4j/wss4j/4.0.0-SNAPSHOT/wss4j-4.0.0-20240716.012545-65-cyclonedx.json (168 kB at 85 kB/s)
[INFO] Downloading from apache.snapshots.https: https://repository.apache.org/content/repositories/snapshots/org/apache/wss4j/wss4j/maven-metadata.xml
[INFO] Downloaded from apache.snapshots.https: https://repository.apache.org/content/repositories/snapshots/org/apache/wss4j/wss4j/maven-metadata.xml (590 B at 3.2 kB/s)
[INFO] Uploading to apache.snapshots.https: https://repository.apache.org/content/repositories/snapshots/org/apache/wss4j/wss4j/4.0.0-SNAPSHOT/maven-metadata.xml
[INFO] Uploaded to apache.snapshots.https: https://repository.apache.org/content/repositories/snapshots/org/apache/wss4j/wss4j/4.0.0-SNAPSHOT/maven-metadata.xml (1.5 kB at 1.3 kB/s)
[INFO] Uploading to apache.snapshots.https: https://repository.apache.org/content/repositories/snapshots/org/apache/wss4j/wss4j/maven-metadata.xml
[INFO] Uploaded to apache.snapshots.https: https://repository.apache.org/content/repositories/snapshots/org/apache/wss4j/wss4j/maven-metadata.xml (590 B at 556 B/s)
[WARNING] Attempt to (de-)serialize anonymous class org.jfrog.hudson.maven2.MavenDependenciesRecorder$1; see: https://jenkins.io/redirect/serialization-of-anonymous-classes/
[INFO]
[INFO] -------------------< org.apache.wss4j:wss4j-parent >--------------------
[INFO] Building Apache WSS4J parent 4.0.0-SNAPSHOT [2/10]
[INFO] from parent/pom.xml
[INFO] --------------------------------[ pom ]---------------------------------
[WARNING] Parameter 'sourceEncoding' is unknown for plugin 'maven-pmd-plugin:3.19.0:check (validate)'
[WARNING] Parameter 'sourceEncoding' is unknown for plugin 'maven-pmd-plugin:3.19.0:pmd (pmd)'
[WARNING] Parameter 'encoding' is unknown for plugin 'maven-checkstyle-plugin:3.4.0:check (validate)'
[INFO]
[INFO] --- clean:3.4.0:clean (default-clean) @ wss4j-parent ---
[INFO] Deleting <https://ci-builds.apache.org/job/webservices/job/Apache%20WSS4J%20-%20master%20JDK11/ws/parent/target>
[INFO]
[INFO] --- enforcer:3.5.0:enforce (enforce-maven-version) @ wss4j-parent ---
[INFO]
[INFO] --- enforcer:3.5.0:enforce (enforce-java-version) @ wss4j-parent ---
[INFO]
[INFO] >>> pmd:3.19.0:check (validate) > :pmd @ wss4j-parent >>>
[INFO]
[INFO] --- pmd:3.19.0:pmd (pmd) @ wss4j-parent ---
[INFO]
[INFO] <<< pmd:3.19.0:check (validate) < :pmd @ wss4j-parent <<<
[INFO]
[INFO]
[INFO] --- pmd:3.19.0:check (validate) @ wss4j-parent ---
[INFO]
[INFO] --- checkstyle:3.4.0:check (validate) @ wss4j-parent ---
[INFO] You have 0 Checkstyle violations.
[INFO]
[INFO] --- bundle:5.1.9:cleanVersions (versions) @ wss4j-parent ---
[INFO]
[INFO] --- remote-resources:3.2.0:process (process-resource-bundles) @ wss4j-parent ---
[INFO] Preparing remote bundle org.apache.apache.resources:apache-jar-resource-bundle:1.5
[INFO] Copying 3 resources from 1 bundle.
[INFO]
[INFO] --- bundle:5.1.9:manifest (bundle-manifest) @ wss4j-parent ---
[WARNING] Ignoring project type pom - supportedProjectTypes = [jar, bundle]
[INFO]
[INFO] --- assembly:3.7.1:single (source-release-assembly) @ wss4j-parent ---
[INFO] Skipping the assembly in this project because it's not the Execution Root
[INFO]
[INFO] --- source:3.3.1:jar-no-fork (attach-sources) @ wss4j-parent ---
[INFO]
[INFO] --- javadoc:3.7.0:jar (default) @ wss4j-parent ---
[INFO] Not executing Javadoc as the project is not a Java classpath-capable package
[INFO]
[INFO] --- javadoc:3.7.0:jar (attach-javadocs) @ wss4j-parent ---
[INFO] Not executing Javadoc as the project is not a Java classpath-capable package
[INFO]
[INFO] --- cyclonedx:2.8.0:makeAggregateBom (make-bom) @ wss4j-parent ---
[INFO] CycloneDX: Resolving Dependencies
[INFO] CycloneDX: Creating BOM version 1.5 with 0 component(s)
[INFO] CycloneDX: Writing and validating BOM (XML): <https://ci-builds.apache.org/job/webservices/job/Apache%20WSS4J%20-%20master%20JDK11/ws/parent/target/wss4j-parent-4.0.0-SNAPSHOT-bom.xml>
[INFO] attaching as wss4j-parent-4.0.0-SNAPSHOT-cyclonedx.xml
[INFO] CycloneDX: Writing and validating BOM (JSON): <https://ci-builds.apache.org/job/webservices/job/Apache%20WSS4J%20-%20master%20JDK11/ws/parent/target/wss4j-parent-4.0.0-SNAPSHOT-bom.json>
[INFO] attaching as wss4j-parent-4.0.0-SNAPSHOT-cyclonedx.json
[INFO]
[INFO] --- checksum:1.11:artifacts (source-release-checksum) @ wss4j-parent ---
[INFO]
[INFO] --- gpg:3.2.4:sign (sign-release-artifacts) @ wss4j-parent ---
[INFO]
[INFO] --- install:3.1.2:install (default-install) @ wss4j-parent ---
[INFO] Installing <https://ci-builds.apache.org/job/webservices/job/Apache%20WSS4J%20-%20master%20JDK11/ws/parent/pom.xml> to /home/jenkins/.m2/repository/org/apache/wss4j/wss4j-parent/4.0.0-SNAPSHOT/wss4j-parent-4.0.0-SNAPSHOT.pom
[INFO] Installing <https://ci-builds.apache.org/job/webservices/job/Apache%20WSS4J%20-%20master%20JDK11/ws/parent/target/wss4j-parent-4.0.0-SNAPSHOT-bom.xml> to /home/jenkins/.m2/repository/org/apache/wss4j/wss4j-parent/4.0.0-SNAPSHOT/wss4j-parent-4.0.0-SNAPSHOT-cyclonedx.xml
[INFO] Installing <https://ci-builds.apache.org/job/webservices/job/Apache%20WSS4J%20-%20master%20JDK11/ws/parent/target/wss4j-parent-4.0.0-SNAPSHOT-bom.json> to /home/jenkins/.m2/repository/org/apache/wss4j/wss4j-parent/4.0.0-SNAPSHOT/wss4j-parent-4.0.0-SNAPSHOT-cyclonedx.json
[INFO]
[INFO] --- deploy:3.1.2:deploy (default-deploy) @ wss4j-parent ---
[INFO] Downloading from apache.snapshots.https: https://repository.apache.org/content/repositories/snapshots/org/apache/wss4j/wss4j-parent/4.0.0-SNAPSHOT/maven-metadata.xml
[INFO] Downloaded from apache.snapshots.https: https://repository.apache.org/content/repositories/snapshots/org/apache/wss4j/wss4j-parent/4.0.0-SNAPSHOT/maven-metadata.xml (1.0 kB at 1.9 kB/s)
[INFO] Uploading to apache.snapshots.https: https://repository.apache.org/content/repositories/snapshots/org/apache/wss4j/wss4j-parent/4.0.0-SNAPSHOT/wss4j-parent-4.0.0-20240716.012545-65.pom
[INFO] Uploaded to apache.snapshots.https: https://repository.apache.org/content/repositories/snapshots/org/apache/wss4j/wss4j-parent/4.0.0-SNAPSHOT/wss4j-parent-4.0.0-20240716.012545-65.pom (16 kB at 13 kB/s)
[INFO] Uploading to apache.snapshots.https: https://repository.apache.org/content/repositories/snapshots/org/apache/wss4j/wss4j-parent/4.0.0-SNAPSHOT/wss4j-parent-4.0.0-20240716.012545-65-cyclonedx.xml
[INFO] Uploading to apache.snapshots.https: https://repository.apache.org/content/repositories/snapshots/org/apache/wss4j/wss4j-parent/4.0.0-SNAPSHOT/wss4j-parent-4.0.0-20240716.012545-65-cyclonedx.json
[INFO] Uploaded to apache.snapshots.https: https://repository.apache.org/content/repositories/snapshots/org/apache/wss4j/wss4j-parent/4.0.0-SNAPSHOT/wss4j-parent-4.0.0-20240716.012545-65-cyclonedx.xml (3.0 kB at 2.7 kB/s)
[INFO] Uploaded to apache.snapshots.https: https://repository.apache.org/content/repositories/snapshots/org/apache/wss4j/wss4j-parent/4.0.0-SNAPSHOT/wss4j-parent-4.0.0-20240716.012545-65-cyclonedx.json (3.4 kB at 2.5 kB/s)
[INFO] Downloading from apache.snapshots.https: https://repository.apache.org/content/repositories/snapshots/org/apache/wss4j/wss4j-parent/maven-metadata.xml
[INFO] Downloaded from apache.snapshots.https: https://repository.apache.org/content/repositories/snapshots/org/apache/wss4j/wss4j-parent/maven-metadata.xml (597 B at 3.3 kB/s)
[INFO] Uploading to apache.snapshots.https: https://repository.apache.org/content/repositories/snapshots/org/apache/wss4j/wss4j-parent/4.0.0-SNAPSHOT/maven-metadata.xml
[INFO] Uploaded to apache.snapshots.https: https://repository.apache.org/content/repositories/snapshots/org/apache/wss4j/wss4j-parent/4.0.0-SNAPSHOT/maven-metadata.xml (1.0 kB at 948 B/s)
[INFO] Uploading to apache.snapshots.https: https://repository.apache.org/content/repositories/snapshots/org/apache/wss4j/wss4j-parent/maven-metadata.xml
[INFO] Uploaded to apache.snapshots.https: https://repository.apache.org/content/repositories/snapshots/org/apache/wss4j/wss4j-parent/maven-metadata.xml (597 B at 575 B/s)
[INFO]
[INFO] ------------------< org.apache.wss4j:wss4j-bindings >-------------------
[INFO] Building Apache WSS4J WS-Security Bindings 4.0.0-SNAPSHOT [3/10]
[INFO] from bindings/pom.xml
[INFO] --------------------------------[ jar ]---------------------------------
[WARNING] Parameter 'sourceEncoding' is unknown for plugin 'maven-pmd-plugin:3.19.0:check (validate)'
[WARNING] Parameter 'sourceEncoding' is unknown for plugin 'maven-pmd-plugin:3.19.0:pmd (pmd)'
[WARNING] Parameter 'encoding' is unknown for plugin 'maven-checkstyle-plugin:3.4.0:check (validate)'
[INFO]
[INFO] --- clean:3.4.0:clean (default-clean) @ wss4j-bindings ---
[INFO] Deleting <https://ci-builds.apache.org/job/webservices/job/Apache%20WSS4J%20-%20master%20JDK11/ws/bindings/target>
[INFO]
[INFO] --- enforcer:3.5.0:enforce (enforce-maven-version) @ wss4j-bindings ---
[INFO]
[INFO] --- enforcer:3.5.0:enforce (enforce-java-version) @ wss4j-bindings ---
[INFO]
[INFO] >>> pmd:3.19.0:check (validate) > :pmd @ wss4j-bindings >>>
[INFO]
[INFO] --- pmd:3.19.0:pmd (pmd) @ wss4j-bindings ---
[INFO] PMD version: 6.49.0
[WARNING] Removed misconfigured rule: LoosePackageCoupling cause: No packages or classes specified
[INFO] Rendering content with org.apache.maven.skins:maven-default-skin:jar:1.3 skin.
[INFO]
[INFO] <<< pmd:3.19.0:check (validate) < :pmd @ wss4j-bindings <<<
[INFO]
[INFO]
[INFO] --- pmd:3.19.0:check (validate) @ wss4j-bindings ---
[INFO] PMD version: 6.49.0
[INFO]
[INFO]
[INFO] --- checkstyle:3.4.0:check (validate) @ wss4j-bindings ---
[INFO]
[INFO] --- bundle:5.1.9:cleanVersions (versions) @ wss4j-bindings ---
[INFO]
[INFO] --- remote-resources:3.2.0:process (process-resource-bundles) @ wss4j-bindings ---
[INFO] Preparing remote bundle org.apache.apache.resources:apache-jar-resource-bundle:1.5
[INFO] Copying 3 resources from 1 bundle.
[INFO]
[INFO] --- resources:3.3.1:resources (default-resources) @ wss4j-bindings ---
[INFO] Copying 0 resource from src/main/java to target/classes
[INFO] skip non existing resourceDirectory <https://ci-builds.apache.org/job/webservices/job/Apache%20WSS4J%20-%20master%20JDK11/ws/bindings/src/main/resources>
[INFO] skip non existing resourceDirectory <https://ci-builds.apache.org/job/webservices/job/Apache%20WSS4J%20-%20master%20JDK11/ws/bindings/src/main/resources-filtered>
[INFO] skip non existing resourceDirectory <https://ci-builds.apache.org/job/webservices/job/Apache%20WSS4J%20-%20master%20JDK11/ws/bindings/target/generated/src/main/resources>
[INFO] Copying 3 resources from target/maven-shared-archive-resources to target/classes
[INFO]
[INFO] --- compiler:3.13.0:compile (default-compile) @ wss4j-bindings ---
[INFO] Recompiling the module because of changed source code.
[INFO] Compiling 36 source files with javac [debug release 17] to target/classes
[INFO] ------------------------------------------------------------------------
[INFO] Reactor Summary for Apache WSS4J 4.0.0-SNAPSHOT:
[INFO]
[INFO] Apache WSS4J ....................................... SUCCESS [ 45.919 s]
[INFO] Apache WSS4J parent ................................ SUCCESS [ 13.659 s]
[INFO] Apache WSS4J WS-Security Bindings .................. FAILURE [ 7.748 s]
[INFO] Apache WSS4J WS-SecurityPolicy model ............... SKIPPED
[INFO] Apache WSS4J WS-Security Common .................... SKIPPED
[INFO] Apache WSS4J DOM WS-Security ....................... SKIPPED
[INFO] Apache WSS4J Streaming WS-Security ................. SKIPPED
[INFO] Apache WSS4J Web WS-Security ....................... SKIPPED
[INFO] Apache WSS4J WS-Security Integration ............... SKIPPED
[INFO] Apache WSS4J Streaming WS-SecurityPolicy ........... SKIPPED
[INFO] ------------------------------------------------------------------------
[INFO] BUILD FAILURE
[INFO] ------------------------------------------------------------------------
[INFO] Total time: 01:35 min
[INFO] Finished at: 2024-07-16T01:27:21Z
[INFO] ------------------------------------------------------------------------
Waiting for Jenkins to finish collecting data
[ERROR] Failed to execute goal org.apache.maven.plugins:maven-compiler-plugin:3.13.0:compile (default-compile) on project wss4j-bindings: Fatal error compiling: error: release version 17 not supported -> [Help 1]
[ERROR]
[ERROR] To see the full stack trace of the errors, re-run Maven with the -e switch.
[ERROR] Re-run Maven using the -X switch to enable full debug logging.
[ERROR]
[ERROR] For more information about the errors and possible solutions, please read the following articles:
[ERROR] [Help 1] http://cwiki.apache.org/confluence/display/MAVEN/MojoExecutionException
[ERROR]
[ERROR] After correcting the problems, you can resume the build with the command
[ERROR] mvn <goals> -rf :wss4j-bindings
[JENKINS] Archiving <https://ci-builds.apache.org/job/webservices/job/Apache%20WSS4J%20-%20master%20JDK11/ws/bindings/pom.xml> to org.apache.wss4j/wss4j-bindings/4.0.0-SNAPSHOT/wss4j-bindings-4.0.0-SNAPSHOT.pom
[JENKINS] Archiving <https://ci-builds.apache.org/job/webservices/job/Apache%20WSS4J%20-%20master%20JDK11/ws/ws-security-policy-stax/pom.xml> to org.apache.wss4j/wss4j-ws-security-policy-stax/4.0.0-SNAPSHOT/wss4j-ws-security-policy-stax-4.0.0-SNAPSHOT.pom
[JENKINS] Archiving <https://ci-builds.apache.org/job/webservices/job/Apache%20WSS4J%20-%20master%20JDK11/ws/ws-security-common/pom.xml> to org.apache.wss4j/wss4j-ws-security-common/4.0.0-SNAPSHOT/wss4j-ws-security-common-4.0.0-SNAPSHOT.pom
[JENKINS] Archiving <https://ci-builds.apache.org/job/webservices/job/Apache%20WSS4J%20-%20master%20JDK11/ws/ws-security-dom/pom.xml> to org.apache.wss4j/wss4j-ws-security-dom/4.0.0-SNAPSHOT/wss4j-ws-security-dom-4.0.0-SNAPSHOT.pom
[JENKINS] Archiving <https://ci-builds.apache.org/job/webservices/job/Apache%20WSS4J%20-%20master%20JDK11/ws/policy/pom.xml> to org.apache.wss4j/wss4j-policy/4.0.0-SNAPSHOT/wss4j-policy-4.0.0-SNAPSHOT.pom
[JENKINS] Archiving <https://ci-builds.apache.org/job/webservices/job/Apache%20WSS4J%20-%20master%20JDK11/ws/integration/pom.xml> to org.apache.wss4j/wss4j-integration/4.0.0-SNAPSHOT/wss4j-integration-4.0.0-SNAPSHOT.pom
[JENKINS] Archiving <https://ci-builds.apache.org/job/webservices/job/Apache%20WSS4J%20-%20master%20JDK11/ws/ws-security-stax/pom.xml> to org.apache.wss4j/wss4j-ws-security-stax/4.0.0-SNAPSHOT/wss4j-ws-security-stax-4.0.0-SNAPSHOT.pom
[JENKINS] Archiving <https://ci-builds.apache.org/job/webservices/job/Apache%20WSS4J%20-%20master%20JDK11/ws/parent/pom.xml> to org.apache.wss4j/wss4j-parent/4.0.0-SNAPSHOT/wss4j-parent-4.0.0-SNAPSHOT.pom
[JENKINS] Archiving <https://ci-builds.apache.org/job/webservices/job/Apache%20WSS4J%20-%20master%20JDK11/ws/parent/target/wss4j-parent-4.0.0-SNAPSHOT-bom.xml> to org.apache.wss4j/wss4j-parent/4.0.0-SNAPSHOT/wss4j-parent-4.0.0-SNAPSHOT-cyclonedx.xml
[JENKINS] Archiving <https://ci-builds.apache.org/job/webservices/job/Apache%20WSS4J%20-%20master%20JDK11/ws/parent/target/wss4j-parent-4.0.0-SNAPSHOT-bom.json> to org.apache.wss4j/wss4j-parent/4.0.0-SNAPSHOT/wss4j-parent-4.0.0-SNAPSHOT-cyclonedx.json
[JENKINS] Archiving <https://ci-builds.apache.org/job/webservices/job/Apache%20WSS4J%20-%20master%20JDK11/ws/pom.xml> to org.apache.wss4j/wss4j/4.0.0-SNAPSHOT/wss4j-4.0.0-SNAPSHOT.pom
[JENKINS] Archiving <https://ci-builds.apache.org/job/webservices/job/Apache%20WSS4J%20-%20master%20JDK11/ws/target/wss4j-4.0.0-SNAPSHOT-source-release.zip> to org.apache.wss4j/wss4j/4.0.0-SNAPSHOT/wss4j-4.0.0-SNAPSHOT-source-release.zip
[JENKINS] Archiving <https://ci-builds.apache.org/job/webservices/job/Apache%20WSS4J%20-%20master%20JDK11/ws/target/wss4j-4.0.0-SNAPSHOT-bom.xml> to org.apache.wss4j/wss4j/4.0.0-SNAPSHOT/wss4j-4.0.0-SNAPSHOT-cyclonedx.xml
[JENKINS] Archiving <https://ci-builds.apache.org/job/webservices/job/Apache%20WSS4J%20-%20master%20JDK11/ws/target/wss4j-4.0.0-SNAPSHOT-bom.json> to org.apache.wss4j/wss4j/4.0.0-SNAPSHOT/wss4j-4.0.0-SNAPSHOT-cyclonedx.json
[JENKINS] Archiving <https://ci-builds.apache.org/job/webservices/job/Apache%20WSS4J%20-%20master%20JDK11/ws/target/wss4j-4.0.0-SNAPSHOT-source-release.zip.sha512> to org.apache.wss4j/wss4j/4.0.0-SNAPSHOT/wss4j-4.0.0-SNAPSHOT-source-release.zip.sha512
[JENKINS] Archiving <https://ci-builds.apache.org/job/webservices/job/Apache%20WSS4J%20-%20master%20JDK11/ws/ws-security-web/pom.xml> to org.apache.wss4j/wss4j-ws-security-web/4.0.0-SNAPSHOT/wss4j-ws-security-web-4.0.0-SNAPSHOT.pom
Sending e-mails to: dev@ws.apache.org
No mail will be sent out, as 'webservices » Apache WSS4J - master JDK11 » Apache WSS4J Streaming WS-SecurityPolicy #110' does not have a result yet. Please make sure you set a proper result in case of pipeline/build scripts.
No mail will be sent out, as 'webservices » Apache WSS4J - master JDK11 » Apache WSS4J WS-Security Common #110' does not have a result yet. Please make sure you set a proper result in case of pipeline/build scripts.
No mail will be sent out, as 'webservices » Apache WSS4J - master JDK11 » Apache WSS4J DOM WS-Security #110' does not have a result yet. Please make sure you set a proper result in case of pipeline/build scripts.
No mail will be sent out, as 'webservices » Apache WSS4J - master JDK11 » Apache WSS4J WS-SecurityPolicy model #110' does not have a result yet. Please make sure you set a proper result in case of pipeline/build scripts.
No mail will be sent out, as 'webservices » Apache WSS4J - master JDK11 » Apache WSS4J WS-Security Integration #110' does not have a result yet. Please make sure you set a proper result in case of pipeline/build scripts.
No mail will be sent out, as 'webservices » Apache WSS4J - master JDK11 » Apache WSS4J Streaming WS-Security #110' does not have a result yet. Please make sure you set a proper result in case of pipeline/build scripts.
No mail will be sent out, as 'webservices » Apache WSS4J - master JDK11 » Apache WSS4J Web WS-Security #110' does not have a result yet. Please make sure you set a proper result in case of pipeline/build scripts.
channel stopped
---------------------------------------------------------------------
To unsubscribe, e-mail: dev-unsubscribe@ws.apache.org
For additional commands, e-mail: dev-help@ws.apache.org
Build failed in Jenkins: webservices » Apache WSS4J - master JDK11 #109
Posted by Apache Jenkins Server <je...@builds.apache.org>.
See <https://ci-builds.apache.org/job/webservices/job/Apache%20WSS4J%20-%20master%20JDK11/109/display/redirect?page=changes>
Changes:
[github] Bump org.apache.maven.plugins:maven-project-info-reports-plugin (#346)
[github] Bump junit.version from 5.10.2 to 5.10.3 (#347)
[github] Bump github/codeql-action from 3.25.10 to 3.25.11 (#348)
[github] Bump actions/upload-artifact from 4.3.3 to 4.3.4 (#351)
[github] Bump org.owasp:dependency-check-maven from 9.2.0 to 10.0.2 (#352)
------------------------------------------
[...truncated 9.97 KB...]
[INFO] Downloaded from Nexus: https://repository.apache.org/snapshots/org/apache/wss4j/wss4j-bindings/4.0.0-SNAPSHOT/wss4j-bindings-4.0.0-20240712.161346-57.jar (44 kB at 233 kB/s)
[INFO] Downloading from Nexus: https://repository.apache.org/snapshots/org/apache/wss4j/wss4j-ws-security-dom/4.0.0-SNAPSHOT/wss4j-ws-security-dom-4.0.0-20240712.161346-57.jar
[INFO] Downloaded from Nexus: https://repository.apache.org/snapshots/org/apache/wss4j/wss4j-ws-security-dom/4.0.0-SNAPSHOT/wss4j-ws-security-dom-4.0.0-20240712.161346-57.jar (347 kB at 944 kB/s)
[INFO] Downloading from Nexus: https://repository.apache.org/snapshots/org/apache/wss4j/wss4j-ws-security-dom/4.0.0-SNAPSHOT/wss4j-ws-security-dom-4.0.0-20240712.161346-57-tests.jar
[INFO] Downloaded from Nexus: https://repository.apache.org/snapshots/org/apache/wss4j/wss4j-ws-security-dom/4.0.0-SNAPSHOT/wss4j-ws-security-dom-4.0.0-20240712.161346-57-tests.jar (424 kB at 1.3 MB/s)
[INFO] Downloading from A_maven.central: https://repo1.maven.org/maven2/org/apache/wss4j/wss4j-ws-security-dom/4.0.0-SNAPSHOT/wss4j-ws-security-dom-4.0.0-20240712.161346-57.pom
[INFO] Downloading from B_shibboleth: https://build.shibboleth.net/nexus/content/groups/public/org/apache/wss4j/wss4j-ws-security-dom/4.0.0-SNAPSHOT/wss4j-ws-security-dom-4.0.0-20240712.161346-57.pom
[INFO] Downloading from Nexus: https://repository.apache.org/snapshots/org/apache/wss4j/wss4j-ws-security-dom/4.0.0-SNAPSHOT/wss4j-ws-security-dom-4.0.0-20240712.161346-57.pom
[INFO] Downloaded from Nexus: https://repository.apache.org/snapshots/org/apache/wss4j/wss4j-ws-security-dom/4.0.0-SNAPSHOT/wss4j-ws-security-dom-4.0.0-20240712.161346-57.pom (5.2 kB at 29 kB/s)
[INFO] Downloading from A_maven.central: https://repo1.maven.org/maven2/org/apache/wss4j/wss4j-ws-security-stax/4.0.0-SNAPSHOT/maven-metadata.xml
[INFO] Downloading from Nexus: https://repository.apache.org/snapshots/org/apache/wss4j/wss4j-ws-security-stax/4.0.0-SNAPSHOT/maven-metadata.xml
[INFO] Downloading from B_shibboleth: https://build.shibboleth.net/nexus/content/groups/public/org/apache/wss4j/wss4j-ws-security-stax/4.0.0-SNAPSHOT/maven-metadata.xml
[INFO] Downloaded from Nexus: https://repository.apache.org/snapshots/org/apache/wss4j/wss4j-ws-security-stax/4.0.0-SNAPSHOT/maven-metadata.xml (1.9 kB at 2.9 kB/s)
[INFO] Downloading from Nexus: https://repository.apache.org/snapshots/org/apache/wss4j/wss4j-ws-security-stax/4.0.0-SNAPSHOT/wss4j-ws-security-stax-4.0.0-20240712.161346-57.jar
[INFO] Downloaded from Nexus: https://repository.apache.org/snapshots/org/apache/wss4j/wss4j-ws-security-stax/4.0.0-SNAPSHOT/wss4j-ws-security-stax-4.0.0-20240712.161346-57.jar (417 kB at 451 kB/s)
[INFO] Downloading from Nexus: https://repository.apache.org/snapshots/org/apache/wss4j/wss4j-ws-security-stax/4.0.0-SNAPSHOT/wss4j-ws-security-stax-4.0.0-20240712.161346-57-tests.jar
[INFO] Downloaded from Nexus: https://repository.apache.org/snapshots/org/apache/wss4j/wss4j-ws-security-stax/4.0.0-SNAPSHOT/wss4j-ws-security-stax-4.0.0-20240712.161346-57-tests.jar (364 kB at 1.4 MB/s)
[INFO] Downloading from A_maven.central: https://repo1.maven.org/maven2/org/apache/wss4j/wss4j-ws-security-stax/4.0.0-SNAPSHOT/wss4j-ws-security-stax-4.0.0-20240712.161346-57.pom
[INFO] Downloading from B_shibboleth: https://build.shibboleth.net/nexus/content/groups/public/org/apache/wss4j/wss4j-ws-security-stax/4.0.0-SNAPSHOT/wss4j-ws-security-stax-4.0.0-20240712.161346-57.pom
[INFO] Downloading from Nexus: https://repository.apache.org/snapshots/org/apache/wss4j/wss4j-ws-security-stax/4.0.0-SNAPSHOT/wss4j-ws-security-stax-4.0.0-20240712.161346-57.pom
[INFO] Downloaded from Nexus: https://repository.apache.org/snapshots/org/apache/wss4j/wss4j-ws-security-stax/4.0.0-SNAPSHOT/wss4j-ws-security-stax-4.0.0-20240712.161346-57.pom (5.6 kB at 25 kB/s)
[INFO] Downloading from A_maven.central: https://repo1.maven.org/maven2/org/apache/wss4j/wss4j-policy/4.0.0-SNAPSHOT/maven-metadata.xml
[INFO] Downloading from B_shibboleth: https://build.shibboleth.net/nexus/content/groups/public/org/apache/wss4j/wss4j-policy/4.0.0-SNAPSHOT/maven-metadata.xml
[INFO] Downloading from Nexus: https://repository.apache.org/snapshots/org/apache/wss4j/wss4j-policy/4.0.0-SNAPSHOT/maven-metadata.xml
[INFO] Downloaded from Nexus: https://repository.apache.org/snapshots/org/apache/wss4j/wss4j-policy/4.0.0-SNAPSHOT/maven-metadata.xml (1.6 kB at 3.0 kB/s)
[INFO] Downloading from Nexus: https://repository.apache.org/snapshots/org/apache/wss4j/wss4j-policy/4.0.0-SNAPSHOT/wss4j-policy-4.0.0-20240712.161346-57.jar
[INFO] Downloaded from Nexus: https://repository.apache.org/snapshots/org/apache/wss4j/wss4j-policy/4.0.0-SNAPSHOT/wss4j-policy-4.0.0-20240712.161346-57.jar (216 kB at 589 kB/s)
[WARNING] BOM dependency listed but is not depended upon: pkg:maven/commons-codec/commons-codec@1.17.0?type=jar
[INFO] CycloneDX: Creating BOM version 1.5 with 63 component(s)
[INFO] CycloneDX: Writing and validating BOM (XML): <https://ci-builds.apache.org/job/webservices/job/Apache%20WSS4J%20-%20master%20JDK11/ws/target/wss4j-4.0.0-SNAPSHOT-bom.xml>
[INFO] attaching as wss4j-4.0.0-SNAPSHOT-cyclonedx.xml
[INFO] CycloneDX: Writing and validating BOM (JSON): <https://ci-builds.apache.org/job/webservices/job/Apache%20WSS4J%20-%20master%20JDK11/ws/target/wss4j-4.0.0-SNAPSHOT-bom.json>
[INFO] attaching as wss4j-4.0.0-SNAPSHOT-cyclonedx.json
[INFO]
[INFO] --- checksum:1.11:artifacts (source-release-checksum) @ wss4j ---
[INFO] wss4j-4.0.0-SNAPSHOT-source-release.zip - SHA-512 : 5755a951bd9f9eafc251e52c50c80a7d7fe2f0f20e80cfe8749ca253f812ac5d4f680b68f845af4373f13123b1f81ac27bec505294680af7c0af1d0577262bf7
[INFO]
[INFO] --- gpg:3.2.3:sign (sign-release-artifacts) @ wss4j ---
[INFO]
[INFO] --- install:3.1.1:install (default-install) @ wss4j ---
[INFO] Installing <https://ci-builds.apache.org/job/webservices/job/Apache%20WSS4J%20-%20master%20JDK11/ws/pom.xml> to /home/jenkins/.m2/repository/org/apache/wss4j/wss4j/4.0.0-SNAPSHOT/wss4j-4.0.0-SNAPSHOT.pom
[INFO] Installing <https://ci-builds.apache.org/job/webservices/job/Apache%20WSS4J%20-%20master%20JDK11/ws/target/wss4j-4.0.0-SNAPSHOT-source-release.zip> to /home/jenkins/.m2/repository/org/apache/wss4j/wss4j/4.0.0-SNAPSHOT/wss4j-4.0.0-SNAPSHOT-source-release.zip
[INFO] Installing <https://ci-builds.apache.org/job/webservices/job/Apache%20WSS4J%20-%20master%20JDK11/ws/target/wss4j-4.0.0-SNAPSHOT-bom.xml> to /home/jenkins/.m2/repository/org/apache/wss4j/wss4j/4.0.0-SNAPSHOT/wss4j-4.0.0-SNAPSHOT-cyclonedx.xml
[INFO] Installing <https://ci-builds.apache.org/job/webservices/job/Apache%20WSS4J%20-%20master%20JDK11/ws/target/wss4j-4.0.0-SNAPSHOT-bom.json> to /home/jenkins/.m2/repository/org/apache/wss4j/wss4j/4.0.0-SNAPSHOT/wss4j-4.0.0-SNAPSHOT-cyclonedx.json
[INFO] Installing <https://ci-builds.apache.org/job/webservices/job/Apache%20WSS4J%20-%20master%20JDK11/ws/target/wss4j-4.0.0-SNAPSHOT-source-release.zip.sha512> to /home/jenkins/.m2/repository/org/apache/wss4j/wss4j/4.0.0-SNAPSHOT/wss4j-4.0.0-SNAPSHOT-source-release.zip.sha512
[INFO]
[INFO] --- deploy:3.1.1:deploy (default-deploy) @ wss4j ---
[INFO] Downloading from apache.snapshots.https: https://repository.apache.org/content/repositories/snapshots/org/apache/wss4j/wss4j/4.0.0-SNAPSHOT/maven-metadata.xml
[INFO] Downloaded from apache.snapshots.https: https://repository.apache.org/content/repositories/snapshots/org/apache/wss4j/wss4j/4.0.0-SNAPSHOT/maven-metadata.xml (1.5 kB at 8.2 kB/s)
[INFO] Uploading to apache.snapshots.https: https://repository.apache.org/content/repositories/snapshots/org/apache/wss4j/wss4j/4.0.0-SNAPSHOT/wss4j-4.0.0-20240713.012549-63.pom
[INFO] Uploaded to apache.snapshots.https: https://repository.apache.org/content/repositories/snapshots/org/apache/wss4j/wss4j/4.0.0-SNAPSHOT/wss4j-4.0.0-20240713.012549-63.pom (22 kB at 14 kB/s)
[INFO] Uploading to apache.snapshots.https: https://repository.apache.org/content/repositories/snapshots/org/apache/wss4j/wss4j/4.0.0-SNAPSHOT/wss4j-4.0.0-20240713.012549-63-source-release.zip
[INFO] Uploading to apache.snapshots.https: https://repository.apache.org/content/repositories/snapshots/org/apache/wss4j/wss4j/4.0.0-SNAPSHOT/wss4j-4.0.0-20240713.012549-63-cyclonedx.xml
[INFO] Uploading to apache.snapshots.https: https://repository.apache.org/content/repositories/snapshots/org/apache/wss4j/wss4j/4.0.0-SNAPSHOT/wss4j-4.0.0-20240713.012549-63-cyclonedx.json
[INFO] Uploading to apache.snapshots.https: https://repository.apache.org/content/repositories/snapshots/org/apache/wss4j/wss4j/4.0.0-SNAPSHOT/wss4j-4.0.0-20240713.012549-63-source-release.zip.sha512
[INFO] Uploaded to apache.snapshots.https: https://repository.apache.org/content/repositories/snapshots/org/apache/wss4j/wss4j/4.0.0-SNAPSHOT/wss4j-4.0.0-20240713.012549-63-source-release.zip.sha512 (128 B at 163 B/s)
[INFO] Uploaded to apache.snapshots.https: https://repository.apache.org/content/repositories/snapshots/org/apache/wss4j/wss4j/4.0.0-SNAPSHOT/wss4j-4.0.0-20240713.012549-63-cyclonedx.xml (150 kB at 75 kB/s)
[INFO] Uploaded to apache.snapshots.https: https://repository.apache.org/content/repositories/snapshots/org/apache/wss4j/wss4j/4.0.0-SNAPSHOT/wss4j-4.0.0-20240713.012549-63-cyclonedx.json (171 kB at 84 kB/s)
[INFO] Uploaded to apache.snapshots.https: https://repository.apache.org/content/repositories/snapshots/org/apache/wss4j/wss4j/4.0.0-SNAPSHOT/wss4j-4.0.0-20240713.012549-63-source-release.zip (2.1 MB at 984 kB/s)
[INFO] Downloading from apache.snapshots.https: https://repository.apache.org/content/repositories/snapshots/org/apache/wss4j/wss4j/maven-metadata.xml
[INFO] Downloaded from apache.snapshots.https: https://repository.apache.org/content/repositories/snapshots/org/apache/wss4j/wss4j/maven-metadata.xml (590 B at 3.1 kB/s)
[INFO] Uploading to apache.snapshots.https: https://repository.apache.org/content/repositories/snapshots/org/apache/wss4j/wss4j/4.0.0-SNAPSHOT/maven-metadata.xml
[INFO] Uploaded to apache.snapshots.https: https://repository.apache.org/content/repositories/snapshots/org/apache/wss4j/wss4j/4.0.0-SNAPSHOT/maven-metadata.xml (1.5 kB at 1.3 kB/s)
[INFO] Uploading to apache.snapshots.https: https://repository.apache.org/content/repositories/snapshots/org/apache/wss4j/wss4j/maven-metadata.xml
[INFO] Uploaded to apache.snapshots.https: https://repository.apache.org/content/repositories/snapshots/org/apache/wss4j/wss4j/maven-metadata.xml (590 B at 526 B/s)
[WARNING] Attempt to (de-)serialize anonymous class org.jfrog.hudson.maven2.MavenDependenciesRecorder$1; see: https://jenkins.io/redirect/serialization-of-anonymous-classes/
[INFO]
[INFO] -------------------< org.apache.wss4j:wss4j-parent >--------------------
[INFO] Building Apache WSS4J parent 4.0.0-SNAPSHOT [2/10]
[INFO] from parent/pom.xml
[INFO] --------------------------------[ pom ]---------------------------------
[WARNING] Parameter 'sourceEncoding' is unknown for plugin 'maven-pmd-plugin:3.19.0:check (validate)'
[WARNING] Parameter 'sourceEncoding' is unknown for plugin 'maven-pmd-plugin:3.19.0:pmd (pmd)'
[WARNING] Parameter 'encoding' is unknown for plugin 'maven-checkstyle-plugin:3.4.0:check (validate)'
[INFO]
[INFO] --- clean:3.3.2:clean (default-clean) @ wss4j-parent ---
[INFO] Deleting <https://ci-builds.apache.org/job/webservices/job/Apache%20WSS4J%20-%20master%20JDK11/ws/parent/target>
[INFO]
[INFO] --- enforcer:3.5.0:enforce (enforce-maven-version) @ wss4j-parent ---
[INFO]
[INFO] --- enforcer:3.5.0:enforce (enforce-java-version) @ wss4j-parent ---
[INFO]
[INFO] >>> pmd:3.19.0:check (validate) > :pmd @ wss4j-parent >>>
[INFO]
[INFO] --- pmd:3.19.0:pmd (pmd) @ wss4j-parent ---
[INFO]
[INFO] <<< pmd:3.19.0:check (validate) < :pmd @ wss4j-parent <<<
[INFO]
[INFO]
[INFO] --- pmd:3.19.0:check (validate) @ wss4j-parent ---
[INFO]
[INFO] --- checkstyle:3.4.0:check (validate) @ wss4j-parent ---
[INFO] You have 0 Checkstyle violations.
[INFO]
[INFO] --- bundle:5.1.9:cleanVersions (versions) @ wss4j-parent ---
[INFO]
[INFO] --- remote-resources:3.2.0:process (process-resource-bundles) @ wss4j-parent ---
[INFO] Preparing remote bundle org.apache.apache.resources:apache-jar-resource-bundle:1.5
[INFO] Copying 3 resources from 1 bundle.
[INFO]
[INFO] --- bundle:5.1.9:manifest (bundle-manifest) @ wss4j-parent ---
[WARNING] Ignoring project type pom - supportedProjectTypes = [jar, bundle]
[INFO]
[INFO] --- assembly:3.7.1:single (source-release-assembly) @ wss4j-parent ---
[INFO] Skipping the assembly in this project because it's not the Execution Root
[INFO]
[INFO] --- source:3.3.1:jar-no-fork (attach-sources) @ wss4j-parent ---
[INFO]
[INFO] --- javadoc:3.7.0:jar (default) @ wss4j-parent ---
[INFO] Not executing Javadoc as the project is not a Java classpath-capable package
[INFO]
[INFO] --- javadoc:3.7.0:jar (attach-javadocs) @ wss4j-parent ---
[INFO] Not executing Javadoc as the project is not a Java classpath-capable package
[INFO]
[INFO] --- cyclonedx:2.8.0:makeAggregateBom (make-bom) @ wss4j-parent ---
[INFO] CycloneDX: Resolving Dependencies
[INFO] CycloneDX: Creating BOM version 1.5 with 0 component(s)
[INFO] CycloneDX: Writing and validating BOM (XML): <https://ci-builds.apache.org/job/webservices/job/Apache%20WSS4J%20-%20master%20JDK11/ws/parent/target/wss4j-parent-4.0.0-SNAPSHOT-bom.xml>
[INFO] attaching as wss4j-parent-4.0.0-SNAPSHOT-cyclonedx.xml
[INFO] CycloneDX: Writing and validating BOM (JSON): <https://ci-builds.apache.org/job/webservices/job/Apache%20WSS4J%20-%20master%20JDK11/ws/parent/target/wss4j-parent-4.0.0-SNAPSHOT-bom.json>
[INFO] attaching as wss4j-parent-4.0.0-SNAPSHOT-cyclonedx.json
[INFO]
[INFO] --- checksum:1.11:artifacts (source-release-checksum) @ wss4j-parent ---
[INFO]
[INFO] --- gpg:3.2.3:sign (sign-release-artifacts) @ wss4j-parent ---
[INFO]
[INFO] --- install:3.1.1:install (default-install) @ wss4j-parent ---
[INFO] Installing <https://ci-builds.apache.org/job/webservices/job/Apache%20WSS4J%20-%20master%20JDK11/ws/parent/pom.xml> to /home/jenkins/.m2/repository/org/apache/wss4j/wss4j-parent/4.0.0-SNAPSHOT/wss4j-parent-4.0.0-SNAPSHOT.pom
[INFO] Installing <https://ci-builds.apache.org/job/webservices/job/Apache%20WSS4J%20-%20master%20JDK11/ws/parent/target/wss4j-parent-4.0.0-SNAPSHOT-bom.xml> to /home/jenkins/.m2/repository/org/apache/wss4j/wss4j-parent/4.0.0-SNAPSHOT/wss4j-parent-4.0.0-SNAPSHOT-cyclonedx.xml
[INFO] Installing <https://ci-builds.apache.org/job/webservices/job/Apache%20WSS4J%20-%20master%20JDK11/ws/parent/target/wss4j-parent-4.0.0-SNAPSHOT-bom.json> to /home/jenkins/.m2/repository/org/apache/wss4j/wss4j-parent/4.0.0-SNAPSHOT/wss4j-parent-4.0.0-SNAPSHOT-cyclonedx.json
[INFO]
[INFO] --- deploy:3.1.1:deploy (default-deploy) @ wss4j-parent ---
[INFO] Downloading from apache.snapshots.https: https://repository.apache.org/content/repositories/snapshots/org/apache/wss4j/wss4j-parent/4.0.0-SNAPSHOT/maven-metadata.xml
[INFO] Downloaded from apache.snapshots.https: https://repository.apache.org/content/repositories/snapshots/org/apache/wss4j/wss4j-parent/4.0.0-SNAPSHOT/maven-metadata.xml (1.0 kB at 1.8 kB/s)
[INFO] Uploading to apache.snapshots.https: https://repository.apache.org/content/repositories/snapshots/org/apache/wss4j/wss4j-parent/4.0.0-SNAPSHOT/wss4j-parent-4.0.0-20240713.012549-63.pom
[INFO] Uploaded to apache.snapshots.https: https://repository.apache.org/content/repositories/snapshots/org/apache/wss4j/wss4j-parent/4.0.0-SNAPSHOT/wss4j-parent-4.0.0-20240713.012549-63.pom (16 kB at 13 kB/s)
[INFO] Uploading to apache.snapshots.https: https://repository.apache.org/content/repositories/snapshots/org/apache/wss4j/wss4j-parent/4.0.0-SNAPSHOT/wss4j-parent-4.0.0-20240713.012549-63-cyclonedx.xml
[INFO] Uploading to apache.snapshots.https: https://repository.apache.org/content/repositories/snapshots/org/apache/wss4j/wss4j-parent/4.0.0-SNAPSHOT/wss4j-parent-4.0.0-20240713.012549-63-cyclonedx.json
[INFO] Uploaded to apache.snapshots.https: https://repository.apache.org/content/repositories/snapshots/org/apache/wss4j/wss4j-parent/4.0.0-SNAPSHOT/wss4j-parent-4.0.0-20240713.012549-63-cyclonedx.xml (3.0 kB at 2.8 kB/s)
[INFO] Uploaded to apache.snapshots.https: https://repository.apache.org/content/repositories/snapshots/org/apache/wss4j/wss4j-parent/4.0.0-SNAPSHOT/wss4j-parent-4.0.0-20240713.012549-63-cyclonedx.json (3.4 kB at 2.4 kB/s)
[INFO] Downloading from apache.snapshots.https: https://repository.apache.org/content/repositories/snapshots/org/apache/wss4j/wss4j-parent/maven-metadata.xml
[INFO] Downloaded from apache.snapshots.https: https://repository.apache.org/content/repositories/snapshots/org/apache/wss4j/wss4j-parent/maven-metadata.xml (597 B at 3.0 kB/s)
[INFO] Uploading to apache.snapshots.https: https://repository.apache.org/content/repositories/snapshots/org/apache/wss4j/wss4j-parent/4.0.0-SNAPSHOT/maven-metadata.xml
[INFO] Uploaded to apache.snapshots.https: https://repository.apache.org/content/repositories/snapshots/org/apache/wss4j/wss4j-parent/4.0.0-SNAPSHOT/maven-metadata.xml (1.0 kB at 959 B/s)
[INFO] Uploading to apache.snapshots.https: https://repository.apache.org/content/repositories/snapshots/org/apache/wss4j/wss4j-parent/maven-metadata.xml
[INFO] Uploaded to apache.snapshots.https: https://repository.apache.org/content/repositories/snapshots/org/apache/wss4j/wss4j-parent/maven-metadata.xml (597 B at 507 B/s)
[INFO]
[INFO] ------------------< org.apache.wss4j:wss4j-bindings >-------------------
[INFO] Building Apache WSS4J WS-Security Bindings 4.0.0-SNAPSHOT [3/10]
[INFO] from bindings/pom.xml
[INFO] --------------------------------[ jar ]---------------------------------
[WARNING] Parameter 'sourceEncoding' is unknown for plugin 'maven-pmd-plugin:3.19.0:check (validate)'
[WARNING] Parameter 'sourceEncoding' is unknown for plugin 'maven-pmd-plugin:3.19.0:pmd (pmd)'
[WARNING] Parameter 'encoding' is unknown for plugin 'maven-checkstyle-plugin:3.4.0:check (validate)'
[INFO]
[INFO] --- clean:3.3.2:clean (default-clean) @ wss4j-bindings ---
[INFO] Deleting <https://ci-builds.apache.org/job/webservices/job/Apache%20WSS4J%20-%20master%20JDK11/ws/bindings/target>
[INFO]
[INFO] --- enforcer:3.5.0:enforce (enforce-maven-version) @ wss4j-bindings ---
[INFO]
[INFO] --- enforcer:3.5.0:enforce (enforce-java-version) @ wss4j-bindings ---
[INFO]
[INFO] >>> pmd:3.19.0:check (validate) > :pmd @ wss4j-bindings >>>
[INFO]
[INFO] --- pmd:3.19.0:pmd (pmd) @ wss4j-bindings ---
[INFO] PMD version: 6.49.0
[WARNING] Removed misconfigured rule: LoosePackageCoupling cause: No packages or classes specified
[INFO] Rendering content with org.apache.maven.skins:maven-default-skin:jar:1.3 skin.
[INFO]
[INFO] <<< pmd:3.19.0:check (validate) < :pmd @ wss4j-bindings <<<
[INFO]
[INFO]
[INFO] --- pmd:3.19.0:check (validate) @ wss4j-bindings ---
[INFO] PMD version: 6.49.0
[INFO]
[INFO]
[INFO] --- checkstyle:3.4.0:check (validate) @ wss4j-bindings ---
[INFO]
[INFO] --- bundle:5.1.9:cleanVersions (versions) @ wss4j-bindings ---
[INFO]
[INFO] --- remote-resources:3.2.0:process (process-resource-bundles) @ wss4j-bindings ---
[INFO] Preparing remote bundle org.apache.apache.resources:apache-jar-resource-bundle:1.5
[INFO] Copying 3 resources from 1 bundle.
[INFO]
[INFO] --- resources:3.3.1:resources (default-resources) @ wss4j-bindings ---
[INFO] Copying 0 resource from src/main/java to target/classes
[INFO] skip non existing resourceDirectory <https://ci-builds.apache.org/job/webservices/job/Apache%20WSS4J%20-%20master%20JDK11/ws/bindings/src/main/resources>
[INFO] skip non existing resourceDirectory <https://ci-builds.apache.org/job/webservices/job/Apache%20WSS4J%20-%20master%20JDK11/ws/bindings/src/main/resources-filtered>
[INFO] skip non existing resourceDirectory <https://ci-builds.apache.org/job/webservices/job/Apache%20WSS4J%20-%20master%20JDK11/ws/bindings/target/generated/src/main/resources>
[INFO] Copying 3 resources from target/maven-shared-archive-resources to target/classes
[INFO]
[INFO] --- compiler:3.13.0:compile (default-compile) @ wss4j-bindings ---
[INFO] Recompiling the module because of changed source code.
[INFO] Compiling 36 source files with javac [debug release 17] to target/classes
[INFO] ------------------------------------------------------------------------
[INFO] Reactor Summary for Apache WSS4J 4.0.0-SNAPSHOT:
[INFO]
[INFO] Apache WSS4J ....................................... SUCCESS [ 45.973 s]
[INFO] Apache WSS4J parent ................................ SUCCESS [ 13.932 s]
[INFO] Apache WSS4J WS-Security Bindings .................. FAILURE [ 8.302 s]
[INFO] Apache WSS4J WS-SecurityPolicy model ............... SKIPPED
[INFO] Apache WSS4J WS-Security Common .................... SKIPPED
[INFO] Apache WSS4J DOM WS-Security ....................... SKIPPED
[INFO] Apache WSS4J Streaming WS-Security ................. SKIPPED
[INFO] Apache WSS4J Web WS-Security ....................... SKIPPED
[INFO] Apache WSS4J WS-Security Integration ............... SKIPPED
[INFO] Apache WSS4J Streaming WS-SecurityPolicy ........... SKIPPED
[INFO] ------------------------------------------------------------------------
[INFO] BUILD FAILURE
[INFO] ------------------------------------------------------------------------
[INFO] Total time: 01:36 min
[INFO] Finished at: 2024-07-13T01:27:25Z
[INFO] ------------------------------------------------------------------------
Waiting for Jenkins to finish collecting data
[ERROR] Failed to execute goal org.apache.maven.plugins:maven-compiler-plugin:3.13.0:compile (default-compile) on project wss4j-bindings: Fatal error compiling: error: release version 17 not supported -> [Help 1]
[ERROR]
[ERROR] To see the full stack trace of the errors, re-run Maven with the -e switch.
[ERROR] Re-run Maven using the -X switch to enable full debug logging.
[ERROR]
[ERROR] For more information about the errors and possible solutions, please read the following articles:
[ERROR] [Help 1] http://cwiki.apache.org/confluence/display/MAVEN/MojoExecutionException
[ERROR]
[ERROR] After correcting the problems, you can resume the build with the command
[ERROR] mvn <goals> -rf :wss4j-bindings
[JENKINS] Archiving <https://ci-builds.apache.org/job/webservices/job/Apache%20WSS4J%20-%20master%20JDK11/ws/bindings/pom.xml> to org.apache.wss4j/wss4j-bindings/4.0.0-SNAPSHOT/wss4j-bindings-4.0.0-SNAPSHOT.pom
[JENKINS] Archiving <https://ci-builds.apache.org/job/webservices/job/Apache%20WSS4J%20-%20master%20JDK11/ws/ws-security-policy-stax/pom.xml> to org.apache.wss4j/wss4j-ws-security-policy-stax/4.0.0-SNAPSHOT/wss4j-ws-security-policy-stax-4.0.0-SNAPSHOT.pom
[JENKINS] Archiving <https://ci-builds.apache.org/job/webservices/job/Apache%20WSS4J%20-%20master%20JDK11/ws/ws-security-common/pom.xml> to org.apache.wss4j/wss4j-ws-security-common/4.0.0-SNAPSHOT/wss4j-ws-security-common-4.0.0-SNAPSHOT.pom
[JENKINS] Archiving <https://ci-builds.apache.org/job/webservices/job/Apache%20WSS4J%20-%20master%20JDK11/ws/ws-security-dom/pom.xml> to org.apache.wss4j/wss4j-ws-security-dom/4.0.0-SNAPSHOT/wss4j-ws-security-dom-4.0.0-SNAPSHOT.pom
[JENKINS] Archiving <https://ci-builds.apache.org/job/webservices/job/Apache%20WSS4J%20-%20master%20JDK11/ws/policy/pom.xml> to org.apache.wss4j/wss4j-policy/4.0.0-SNAPSHOT/wss4j-policy-4.0.0-SNAPSHOT.pom
[JENKINS] Archiving <https://ci-builds.apache.org/job/webservices/job/Apache%20WSS4J%20-%20master%20JDK11/ws/integration/pom.xml> to org.apache.wss4j/wss4j-integration/4.0.0-SNAPSHOT/wss4j-integration-4.0.0-SNAPSHOT.pom
[JENKINS] Archiving <https://ci-builds.apache.org/job/webservices/job/Apache%20WSS4J%20-%20master%20JDK11/ws/ws-security-stax/pom.xml> to org.apache.wss4j/wss4j-ws-security-stax/4.0.0-SNAPSHOT/wss4j-ws-security-stax-4.0.0-SNAPSHOT.pom
[JENKINS] Archiving <https://ci-builds.apache.org/job/webservices/job/Apache%20WSS4J%20-%20master%20JDK11/ws/parent/pom.xml> to org.apache.wss4j/wss4j-parent/4.0.0-SNAPSHOT/wss4j-parent-4.0.0-SNAPSHOT.pom
[JENKINS] Archiving <https://ci-builds.apache.org/job/webservices/job/Apache%20WSS4J%20-%20master%20JDK11/ws/parent/target/wss4j-parent-4.0.0-SNAPSHOT-bom.xml> to org.apache.wss4j/wss4j-parent/4.0.0-SNAPSHOT/wss4j-parent-4.0.0-SNAPSHOT-cyclonedx.xml
[JENKINS] Archiving <https://ci-builds.apache.org/job/webservices/job/Apache%20WSS4J%20-%20master%20JDK11/ws/parent/target/wss4j-parent-4.0.0-SNAPSHOT-bom.json> to org.apache.wss4j/wss4j-parent/4.0.0-SNAPSHOT/wss4j-parent-4.0.0-SNAPSHOT-cyclonedx.json
[JENKINS] Archiving <https://ci-builds.apache.org/job/webservices/job/Apache%20WSS4J%20-%20master%20JDK11/ws/pom.xml> to org.apache.wss4j/wss4j/4.0.0-SNAPSHOT/wss4j-4.0.0-SNAPSHOT.pom
[JENKINS] Archiving <https://ci-builds.apache.org/job/webservices/job/Apache%20WSS4J%20-%20master%20JDK11/ws/target/wss4j-4.0.0-SNAPSHOT-source-release.zip> to org.apache.wss4j/wss4j/4.0.0-SNAPSHOT/wss4j-4.0.0-SNAPSHOT-source-release.zip
[JENKINS] Archiving <https://ci-builds.apache.org/job/webservices/job/Apache%20WSS4J%20-%20master%20JDK11/ws/target/wss4j-4.0.0-SNAPSHOT-bom.xml> to org.apache.wss4j/wss4j/4.0.0-SNAPSHOT/wss4j-4.0.0-SNAPSHOT-cyclonedx.xml
[JENKINS] Archiving <https://ci-builds.apache.org/job/webservices/job/Apache%20WSS4J%20-%20master%20JDK11/ws/target/wss4j-4.0.0-SNAPSHOT-bom.json> to org.apache.wss4j/wss4j/4.0.0-SNAPSHOT/wss4j-4.0.0-SNAPSHOT-cyclonedx.json
[JENKINS] Archiving <https://ci-builds.apache.org/job/webservices/job/Apache%20WSS4J%20-%20master%20JDK11/ws/target/wss4j-4.0.0-SNAPSHOT-source-release.zip.sha512> to org.apache.wss4j/wss4j/4.0.0-SNAPSHOT/wss4j-4.0.0-SNAPSHOT-source-release.zip.sha512
[JENKINS] Archiving <https://ci-builds.apache.org/job/webservices/job/Apache%20WSS4J%20-%20master%20JDK11/ws/ws-security-web/pom.xml> to org.apache.wss4j/wss4j-ws-security-web/4.0.0-SNAPSHOT/wss4j-ws-security-web-4.0.0-SNAPSHOT.pom
Sending e-mails to: dev@ws.apache.org
No mail will be sent out, as 'webservices » Apache WSS4J - master JDK11 » Apache WSS4J Streaming WS-SecurityPolicy #109' does not have a result yet. Please make sure you set a proper result in case of pipeline/build scripts.
No mail will be sent out, as 'webservices » Apache WSS4J - master JDK11 » Apache WSS4J WS-Security Common #109' does not have a result yet. Please make sure you set a proper result in case of pipeline/build scripts.
No mail will be sent out, as 'webservices » Apache WSS4J - master JDK11 » Apache WSS4J DOM WS-Security #109' does not have a result yet. Please make sure you set a proper result in case of pipeline/build scripts.
No mail will be sent out, as 'webservices » Apache WSS4J - master JDK11 » Apache WSS4J WS-SecurityPolicy model #109' does not have a result yet. Please make sure you set a proper result in case of pipeline/build scripts.
No mail will be sent out, as 'webservices » Apache WSS4J - master JDK11 » Apache WSS4J WS-Security Integration #109' does not have a result yet. Please make sure you set a proper result in case of pipeline/build scripts.
No mail will be sent out, as 'webservices » Apache WSS4J - master JDK11 » Apache WSS4J Streaming WS-Security #109' does not have a result yet. Please make sure you set a proper result in case of pipeline/build scripts.
No mail will be sent out, as 'webservices » Apache WSS4J - master JDK11 » Apache WSS4J Web WS-Security #109' does not have a result yet. Please make sure you set a proper result in case of pipeline/build scripts.
channel stopped
---------------------------------------------------------------------
To unsubscribe, e-mail: dev-unsubscribe@ws.apache.org
For additional commands, e-mail: dev-help@ws.apache.org
Build failed in Jenkins: webservices » Apache WSS4J - master JDK11 #108
Posted by Apache Jenkins Server <je...@builds.apache.org>.
See <https://ci-builds.apache.org/job/webservices/job/Apache%20WSS4J%20-%20master%20JDK11/108/display/redirect?page=changes>
Changes:
[github] Bump org.apache.maven.plugins:maven-jar-plugin from 3.4.1 to 3.4.2 (#344)
------------------------------------------
[...truncated 46.41 KB...]
[INFO] Downloading from central: https://repo.maven.apache.org/maven2/com/kohlschutter/junixsocket/junixsocket-native-common/2.9.1/junixsocket-native-common-2.9.1.jar
[INFO] Downloaded from central: https://repo.maven.apache.org/maven2/com/kohlschutter/junixsocket/junixsocket-native-common/2.9.1/junixsocket-native-common-2.9.1.jar (723 kB at 14 MB/s)
[INFO] Downloading from central: https://repo.maven.apache.org/maven2/com/kohlschutter/junixsocket/junixsocket-common/2.9.1/junixsocket-common-2.9.1.jar
[INFO] Downloaded from central: https://repo.maven.apache.org/maven2/com/kohlschutter/junixsocket/junixsocket-common/2.9.1/junixsocket-common-2.9.1.jar (1.4 MB at 10 MB/s)
[INFO]
[INFO] --- install:3.1.1:install (default-install) @ wss4j ---
[INFO] Installing <https://ci-builds.apache.org/job/webservices/job/Apache%20WSS4J%20-%20master%20JDK11/ws/pom.xml> to /home/jenkins/.m2/repository/org/apache/wss4j/wss4j/4.0.0-SNAPSHOT/wss4j-4.0.0-SNAPSHOT.pom
[INFO] Installing <https://ci-builds.apache.org/job/webservices/job/Apache%20WSS4J%20-%20master%20JDK11/ws/target/wss4j-4.0.0-SNAPSHOT-source-release.zip> to /home/jenkins/.m2/repository/org/apache/wss4j/wss4j/4.0.0-SNAPSHOT/wss4j-4.0.0-SNAPSHOT-source-release.zip
[INFO] Installing <https://ci-builds.apache.org/job/webservices/job/Apache%20WSS4J%20-%20master%20JDK11/ws/target/wss4j-4.0.0-SNAPSHOT-bom.xml> to /home/jenkins/.m2/repository/org/apache/wss4j/wss4j/4.0.0-SNAPSHOT/wss4j-4.0.0-SNAPSHOT-cyclonedx.xml
[INFO] Installing <https://ci-builds.apache.org/job/webservices/job/Apache%20WSS4J%20-%20master%20JDK11/ws/target/wss4j-4.0.0-SNAPSHOT-bom.json> to /home/jenkins/.m2/repository/org/apache/wss4j/wss4j/4.0.0-SNAPSHOT/wss4j-4.0.0-SNAPSHOT-cyclonedx.json
[INFO] Installing <https://ci-builds.apache.org/job/webservices/job/Apache%20WSS4J%20-%20master%20JDK11/ws/target/wss4j-4.0.0-SNAPSHOT-source-release.zip.sha512> to /home/jenkins/.m2/repository/org/apache/wss4j/wss4j/4.0.0-SNAPSHOT/wss4j-4.0.0-SNAPSHOT-source-release.zip.sha512
[INFO]
[INFO] --- deploy:3.1.1:deploy (default-deploy) @ wss4j ---
[INFO] Downloading from apache.snapshots.https: https://repository.apache.org/content/repositories/snapshots/org/apache/wss4j/wss4j/4.0.0-SNAPSHOT/maven-metadata.xml
[INFO] Downloaded from apache.snapshots.https: https://repository.apache.org/content/repositories/snapshots/org/apache/wss4j/wss4j/4.0.0-SNAPSHOT/maven-metadata.xml (1.5 kB at 7.1 kB/s)
[INFO] Uploading to apache.snapshots.https: https://repository.apache.org/content/repositories/snapshots/org/apache/wss4j/wss4j/4.0.0-SNAPSHOT/wss4j-4.0.0-20240622.012557-61.pom
[INFO] Uploaded to apache.snapshots.https: https://repository.apache.org/content/repositories/snapshots/org/apache/wss4j/wss4j/4.0.0-SNAPSHOT/wss4j-4.0.0-20240622.012557-61.pom (22 kB at 18 kB/s)
[INFO] Uploading to apache.snapshots.https: https://repository.apache.org/content/repositories/snapshots/org/apache/wss4j/wss4j/4.0.0-SNAPSHOT/wss4j-4.0.0-20240622.012557-61-source-release.zip
[INFO] Uploading to apache.snapshots.https: https://repository.apache.org/content/repositories/snapshots/org/apache/wss4j/wss4j/4.0.0-SNAPSHOT/wss4j-4.0.0-20240622.012557-61-cyclonedx.xml
[INFO] Uploading to apache.snapshots.https: https://repository.apache.org/content/repositories/snapshots/org/apache/wss4j/wss4j/4.0.0-SNAPSHOT/wss4j-4.0.0-20240622.012557-61-cyclonedx.json
[INFO] Uploading to apache.snapshots.https: https://repository.apache.org/content/repositories/snapshots/org/apache/wss4j/wss4j/4.0.0-SNAPSHOT/wss4j-4.0.0-20240622.012557-61-source-release.zip.sha512
[INFO] Uploaded to apache.snapshots.https: https://repository.apache.org/content/repositories/snapshots/org/apache/wss4j/wss4j/4.0.0-SNAPSHOT/wss4j-4.0.0-20240622.012557-61-source-release.zip.sha512 (128 B at 167 B/s)
[INFO] Uploaded to apache.snapshots.https: https://repository.apache.org/content/repositories/snapshots/org/apache/wss4j/wss4j/4.0.0-SNAPSHOT/wss4j-4.0.0-20240622.012557-61-cyclonedx.xml (150 kB at 78 kB/s)
[INFO] Uploaded to apache.snapshots.https: https://repository.apache.org/content/repositories/snapshots/org/apache/wss4j/wss4j/4.0.0-SNAPSHOT/wss4j-4.0.0-20240622.012557-61-cyclonedx.json (171 kB at 87 kB/s)
[INFO] Uploaded to apache.snapshots.https: https://repository.apache.org/content/repositories/snapshots/org/apache/wss4j/wss4j/4.0.0-SNAPSHOT/wss4j-4.0.0-20240622.012557-61-source-release.zip (2.1 MB at 1.0 MB/s)
[INFO] Downloading from apache.snapshots.https: https://repository.apache.org/content/repositories/snapshots/org/apache/wss4j/wss4j/maven-metadata.xml
[INFO] Downloaded from apache.snapshots.https: https://repository.apache.org/content/repositories/snapshots/org/apache/wss4j/wss4j/maven-metadata.xml (590 B at 3.4 kB/s)
[INFO] Uploading to apache.snapshots.https: https://repository.apache.org/content/repositories/snapshots/org/apache/wss4j/wss4j/4.0.0-SNAPSHOT/maven-metadata.xml
[INFO] Uploaded to apache.snapshots.https: https://repository.apache.org/content/repositories/snapshots/org/apache/wss4j/wss4j/4.0.0-SNAPSHOT/maven-metadata.xml (1.5 kB at 1.4 kB/s)
[INFO] Uploading to apache.snapshots.https: https://repository.apache.org/content/repositories/snapshots/org/apache/wss4j/wss4j/maven-metadata.xml
[INFO] Uploaded to apache.snapshots.https: https://repository.apache.org/content/repositories/snapshots/org/apache/wss4j/wss4j/maven-metadata.xml (590 B at 511 B/s)
[WARNING] Attempt to (de-)serialize anonymous class org.jfrog.hudson.maven2.MavenDependenciesRecorder$1; see: https://jenkins.io/redirect/serialization-of-anonymous-classes/
[INFO]
[INFO] -------------------< org.apache.wss4j:wss4j-parent >--------------------
[INFO] Building Apache WSS4J parent 4.0.0-SNAPSHOT [2/10]
[INFO] from parent/pom.xml
[INFO] --------------------------------[ pom ]---------------------------------
[WARNING] Parameter 'sourceEncoding' is unknown for plugin 'maven-pmd-plugin:3.19.0:check (validate)'
[WARNING] Parameter 'sourceEncoding' is unknown for plugin 'maven-pmd-plugin:3.19.0:pmd (pmd)'
[WARNING] Parameter 'encoding' is unknown for plugin 'maven-checkstyle-plugin:3.4.0:check (validate)'
[INFO]
[INFO] --- clean:3.3.2:clean (default-clean) @ wss4j-parent ---
[INFO]
[INFO] --- enforcer:3.5.0:enforce (enforce-maven-version) @ wss4j-parent ---
[INFO]
[INFO] --- enforcer:3.5.0:enforce (enforce-java-version) @ wss4j-parent ---
[INFO]
[INFO] >>> pmd:3.19.0:check (validate) > :pmd @ wss4j-parent >>>
[INFO]
[INFO] --- pmd:3.19.0:pmd (pmd) @ wss4j-parent ---
[INFO]
[INFO] <<< pmd:3.19.0:check (validate) < :pmd @ wss4j-parent <<<
[INFO]
[INFO]
[INFO] --- pmd:3.19.0:check (validate) @ wss4j-parent ---
[INFO]
[INFO] --- checkstyle:3.4.0:check (validate) @ wss4j-parent ---
[INFO] You have 0 Checkstyle violations.
[INFO]
[INFO] --- bundle:5.1.9:cleanVersions (versions) @ wss4j-parent ---
[INFO]
[INFO] --- remote-resources:3.2.0:process (process-resource-bundles) @ wss4j-parent ---
[INFO] Preparing remote bundle org.apache.apache.resources:apache-jar-resource-bundle:1.5
[INFO] Copying 3 resources from 1 bundle.
[INFO]
[INFO] --- bundle:5.1.9:manifest (bundle-manifest) @ wss4j-parent ---
[WARNING] Ignoring project type pom - supportedProjectTypes = [jar, bundle]
[INFO]
[INFO] --- assembly:3.7.1:single (source-release-assembly) @ wss4j-parent ---
[INFO] Skipping the assembly in this project because it's not the Execution Root
[INFO]
[INFO] --- source:3.3.1:jar-no-fork (attach-sources) @ wss4j-parent ---
[INFO]
[INFO] --- javadoc:3.7.0:jar (default) @ wss4j-parent ---
[INFO] Not executing Javadoc as the project is not a Java classpath-capable package
[INFO]
[INFO] --- javadoc:3.7.0:jar (attach-javadocs) @ wss4j-parent ---
[INFO] Not executing Javadoc as the project is not a Java classpath-capable package
[INFO]
[INFO] --- cyclonedx:2.8.0:makeAggregateBom (make-bom) @ wss4j-parent ---
[INFO] CycloneDX: Resolving Dependencies
[INFO] CycloneDX: Creating BOM version 1.5 with 0 component(s)
[INFO] CycloneDX: Writing and validating BOM (XML): <https://ci-builds.apache.org/job/webservices/job/Apache%20WSS4J%20-%20master%20JDK11/ws/parent/target/wss4j-parent-4.0.0-SNAPSHOT-bom.xml>
[INFO] attaching as wss4j-parent-4.0.0-SNAPSHOT-cyclonedx.xml
[INFO] CycloneDX: Writing and validating BOM (JSON): <https://ci-builds.apache.org/job/webservices/job/Apache%20WSS4J%20-%20master%20JDK11/ws/parent/target/wss4j-parent-4.0.0-SNAPSHOT-bom.json>
[INFO] attaching as wss4j-parent-4.0.0-SNAPSHOT-cyclonedx.json
[INFO]
[INFO] --- checksum:1.11:artifacts (source-release-checksum) @ wss4j-parent ---
[INFO]
[INFO] --- gpg:3.2.3:sign (sign-release-artifacts) @ wss4j-parent ---
[INFO]
[INFO] --- install:3.1.1:install (default-install) @ wss4j-parent ---
[INFO] Installing <https://ci-builds.apache.org/job/webservices/job/Apache%20WSS4J%20-%20master%20JDK11/ws/parent/pom.xml> to /home/jenkins/.m2/repository/org/apache/wss4j/wss4j-parent/4.0.0-SNAPSHOT/wss4j-parent-4.0.0-SNAPSHOT.pom
[INFO] Installing <https://ci-builds.apache.org/job/webservices/job/Apache%20WSS4J%20-%20master%20JDK11/ws/parent/target/wss4j-parent-4.0.0-SNAPSHOT-bom.xml> to /home/jenkins/.m2/repository/org/apache/wss4j/wss4j-parent/4.0.0-SNAPSHOT/wss4j-parent-4.0.0-SNAPSHOT-cyclonedx.xml
[INFO] Installing <https://ci-builds.apache.org/job/webservices/job/Apache%20WSS4J%20-%20master%20JDK11/ws/parent/target/wss4j-parent-4.0.0-SNAPSHOT-bom.json> to /home/jenkins/.m2/repository/org/apache/wss4j/wss4j-parent/4.0.0-SNAPSHOT/wss4j-parent-4.0.0-SNAPSHOT-cyclonedx.json
[INFO]
[INFO] --- deploy:3.1.1:deploy (default-deploy) @ wss4j-parent ---
[INFO] Downloading from apache.snapshots.https: https://repository.apache.org/content/repositories/snapshots/org/apache/wss4j/wss4j-parent/4.0.0-SNAPSHOT/maven-metadata.xml
[INFO] Downloaded from apache.snapshots.https: https://repository.apache.org/content/repositories/snapshots/org/apache/wss4j/wss4j-parent/4.0.0-SNAPSHOT/maven-metadata.xml (1.0 kB at 1.8 kB/s)
[INFO] Uploading to apache.snapshots.https: https://repository.apache.org/content/repositories/snapshots/org/apache/wss4j/wss4j-parent/4.0.0-SNAPSHOT/wss4j-parent-4.0.0-20240622.012557-61.pom
[INFO] Uploaded to apache.snapshots.https: https://repository.apache.org/content/repositories/snapshots/org/apache/wss4j/wss4j-parent/4.0.0-SNAPSHOT/wss4j-parent-4.0.0-20240622.012557-61.pom (16 kB at 12 kB/s)
[INFO] Uploading to apache.snapshots.https: https://repository.apache.org/content/repositories/snapshots/org/apache/wss4j/wss4j-parent/4.0.0-SNAPSHOT/wss4j-parent-4.0.0-20240622.012557-61-cyclonedx.xml
[INFO] Uploading to apache.snapshots.https: https://repository.apache.org/content/repositories/snapshots/org/apache/wss4j/wss4j-parent/4.0.0-SNAPSHOT/wss4j-parent-4.0.0-20240622.012557-61-cyclonedx.json
[INFO] Uploaded to apache.snapshots.https: https://repository.apache.org/content/repositories/snapshots/org/apache/wss4j/wss4j-parent/4.0.0-SNAPSHOT/wss4j-parent-4.0.0-20240622.012557-61-cyclonedx.xml (3.0 kB at 2.0 kB/s)
[INFO] Uploaded to apache.snapshots.https: https://repository.apache.org/content/repositories/snapshots/org/apache/wss4j/wss4j-parent/4.0.0-SNAPSHOT/wss4j-parent-4.0.0-20240622.012557-61-cyclonedx.json (3.4 kB at 1.8 kB/s)
[INFO] Downloading from apache.snapshots.https: https://repository.apache.org/content/repositories/snapshots/org/apache/wss4j/wss4j-parent/maven-metadata.xml
[INFO] Downloaded from apache.snapshots.https: https://repository.apache.org/content/repositories/snapshots/org/apache/wss4j/wss4j-parent/maven-metadata.xml (597 B at 3.4 kB/s)
[INFO] Uploading to apache.snapshots.https: https://repository.apache.org/content/repositories/snapshots/org/apache/wss4j/wss4j-parent/4.0.0-SNAPSHOT/maven-metadata.xml
[INFO] Uploaded to apache.snapshots.https: https://repository.apache.org/content/repositories/snapshots/org/apache/wss4j/wss4j-parent/4.0.0-SNAPSHOT/maven-metadata.xml (1.0 kB at 841 B/s)
[INFO] Uploading to apache.snapshots.https: https://repository.apache.org/content/repositories/snapshots/org/apache/wss4j/wss4j-parent/maven-metadata.xml
[INFO] Uploaded to apache.snapshots.https: https://repository.apache.org/content/repositories/snapshots/org/apache/wss4j/wss4j-parent/maven-metadata.xml (597 B at 271 B/s)
[INFO]
[INFO] ------------------< org.apache.wss4j:wss4j-bindings >-------------------
[INFO] Building Apache WSS4J WS-Security Bindings 4.0.0-SNAPSHOT [3/10]
[INFO] from bindings/pom.xml
[INFO] --------------------------------[ jar ]---------------------------------
[WARNING] Parameter 'sourceEncoding' is unknown for plugin 'maven-pmd-plugin:3.19.0:check (validate)'
[WARNING] Parameter 'sourceEncoding' is unknown for plugin 'maven-pmd-plugin:3.19.0:pmd (pmd)'
[WARNING] Parameter 'encoding' is unknown for plugin 'maven-checkstyle-plugin:3.4.0:check (validate)'
[INFO]
[INFO] --- clean:3.3.2:clean (default-clean) @ wss4j-bindings ---
[INFO]
[INFO] --- enforcer:3.5.0:enforce (enforce-maven-version) @ wss4j-bindings ---
[INFO]
[INFO] --- enforcer:3.5.0:enforce (enforce-java-version) @ wss4j-bindings ---
[INFO]
[INFO] >>> pmd:3.19.0:check (validate) > :pmd @ wss4j-bindings >>>
[INFO]
[INFO] --- pmd:3.19.0:pmd (pmd) @ wss4j-bindings ---
[INFO] PMD version: 6.49.0
[WARNING] Removed misconfigured rule: LoosePackageCoupling cause: No packages or classes specified
[INFO] Rendering content with org.apache.maven.skins:maven-default-skin:jar:1.3 skin.
[INFO]
[INFO] <<< pmd:3.19.0:check (validate) < :pmd @ wss4j-bindings <<<
[INFO]
[INFO]
[INFO] --- pmd:3.19.0:check (validate) @ wss4j-bindings ---
[INFO] PMD version: 6.49.0
[INFO]
[INFO]
[INFO] --- checkstyle:3.4.0:check (validate) @ wss4j-bindings ---
[INFO]
[INFO] --- bundle:5.1.9:cleanVersions (versions) @ wss4j-bindings ---
[INFO]
[INFO] --- remote-resources:3.2.0:process (process-resource-bundles) @ wss4j-bindings ---
[INFO] Preparing remote bundle org.apache.apache.resources:apache-jar-resource-bundle:1.5
[INFO] Copying 3 resources from 1 bundle.
[INFO]
[INFO] --- resources:3.3.1:resources (default-resources) @ wss4j-bindings ---
[INFO] Copying 0 resource from src/main/java to target/classes
[INFO] skip non existing resourceDirectory <https://ci-builds.apache.org/job/webservices/job/Apache%20WSS4J%20-%20master%20JDK11/ws/bindings/src/main/resources>
[INFO] skip non existing resourceDirectory <https://ci-builds.apache.org/job/webservices/job/Apache%20WSS4J%20-%20master%20JDK11/ws/bindings/src/main/resources-filtered>
[INFO] skip non existing resourceDirectory <https://ci-builds.apache.org/job/webservices/job/Apache%20WSS4J%20-%20master%20JDK11/ws/bindings/target/generated/src/main/resources>
[INFO] Copying 3 resources from target/maven-shared-archive-resources to target/classes
[INFO]
[INFO] --- compiler:3.13.0:compile (default-compile) @ wss4j-bindings ---
[INFO] Downloading from A_maven.central: https://repo1.maven.org/maven2/com/google/errorprone/error_prone_core/2.28.0/error_prone_core-2.28.0.pom
[INFO] Downloaded from A_maven.central: https://repo1.maven.org/maven2/com/google/errorprone/error_prone_core/2.28.0/error_prone_core-2.28.0.pom (17 kB at 467 kB/s)
[INFO] Downloading from A_maven.central: https://repo1.maven.org/maven2/com/google/errorprone/error_prone_annotation/2.28.0/error_prone_annotation-2.28.0.pom
[INFO] Downloaded from A_maven.central: https://repo1.maven.org/maven2/com/google/errorprone/error_prone_annotation/2.28.0/error_prone_annotation-2.28.0.pom (1.8 kB at 62 kB/s)
[INFO] Downloading from A_maven.central: https://repo1.maven.org/maven2/com/google/errorprone/error_prone_type_annotations/2.28.0/error_prone_type_annotations-2.28.0.pom
[INFO] Downloaded from A_maven.central: https://repo1.maven.org/maven2/com/google/errorprone/error_prone_type_annotations/2.28.0/error_prone_type_annotations-2.28.0.pom (1.9 kB at 64 kB/s)
[INFO] Downloading from A_maven.central: https://repo1.maven.org/maven2/com/google/errorprone/error_prone_check_api/2.28.0/error_prone_check_api-2.28.0.pom
[INFO] Downloaded from A_maven.central: https://repo1.maven.org/maven2/com/google/errorprone/error_prone_check_api/2.28.0/error_prone_check_api-2.28.0.pom (5.5 kB at 182 kB/s)
[INFO] Downloading from A_maven.central: https://repo1.maven.org/maven2/io/github/eisop/dataflow-errorprone/3.41.0-eisop1/dataflow-errorprone-3.41.0-eisop1.pom
[INFO] Downloaded from A_maven.central: https://repo1.maven.org/maven2/io/github/eisop/dataflow-errorprone/3.41.0-eisop1/dataflow-errorprone-3.41.0-eisop1.pom (2.3 kB at 77 kB/s)
[INFO] Downloading from A_maven.central: https://repo1.maven.org/maven2/com/github/kevinstern/software-and-algorithms/1.0/software-and-algorithms-1.0.pom
[INFO] Downloaded from A_maven.central: https://repo1.maven.org/maven2/com/github/kevinstern/software-and-algorithms/1.0/software-and-algorithms-1.0.pom (3.4 kB at 114 kB/s)
[INFO] Downloading from A_maven.central: https://repo1.maven.org/maven2/com/github/ben-manes/caffeine/caffeine/3.0.5/caffeine-3.0.5.pom
[INFO] Downloaded from A_maven.central: https://repo1.maven.org/maven2/com/github/ben-manes/caffeine/caffeine/3.0.5/caffeine-3.0.5.pom (2.4 kB at 65 kB/s)
[INFO] Downloading from A_maven.central: https://repo1.maven.org/maven2/org/pcollections/pcollections/4.0.1/pcollections-4.0.1.pom
[INFO] Downloaded from A_maven.central: https://repo1.maven.org/maven2/org/pcollections/pcollections/4.0.1/pcollections-4.0.1.pom (1.5 kB at 28 kB/s)
[INFO] Downloading from A_maven.central: https://repo1.maven.org/maven2/com/google/auto/auto-common/1.2.2/auto-common-1.2.2.pom
[INFO] Downloaded from A_maven.central: https://repo1.maven.org/maven2/com/google/auto/auto-common/1.2.2/auto-common-1.2.2.pom (5.2 kB at 62 kB/s)
[INFO] Downloading from A_maven.central: https://repo1.maven.org/maven2/com/google/errorprone/error_prone_core/2.28.0/error_prone_core-2.28.0.jar
[INFO] Downloaded from A_maven.central: https://repo1.maven.org/maven2/com/google/errorprone/error_prone_core/2.28.0/error_prone_core-2.28.0.jar (4.5 MB at 31 MB/s)
[INFO] Downloading from A_maven.central: https://repo1.maven.org/maven2/com/google/errorprone/error_prone_annotation/2.28.0/error_prone_annotation-2.28.0.jar
[INFO] Downloading from A_maven.central: https://repo1.maven.org/maven2/com/google/errorprone/error_prone_type_annotations/2.28.0/error_prone_type_annotations-2.28.0.jar
[INFO] Downloading from A_maven.central: https://repo1.maven.org/maven2/com/google/errorprone/error_prone_check_api/2.28.0/error_prone_check_api-2.28.0.jar
[INFO] Downloading from A_maven.central: https://repo1.maven.org/maven2/com/github/kevinstern/software-and-algorithms/1.0/software-and-algorithms-1.0.jar
[INFO] Downloading from A_maven.central: https://repo1.maven.org/maven2/com/github/ben-manes/caffeine/caffeine/3.0.5/caffeine-3.0.5.jar
[INFO] Downloaded from A_maven.central: https://repo1.maven.org/maven2/com/google/errorprone/error_prone_annotation/2.28.0/error_prone_annotation-2.28.0.jar (8.2 kB at 265 kB/s)
[INFO] Downloading from A_maven.central: https://repo1.maven.org/maven2/org/pcollections/pcollections/4.0.1/pcollections-4.0.1.jar
[INFO] Downloaded from A_maven.central: https://repo1.maven.org/maven2/org/pcollections/pcollections/4.0.1/pcollections-4.0.1.jar (74 kB at 1.2 MB/s)
[INFO] Downloading from A_maven.central: https://repo1.maven.org/maven2/com/google/auto/auto-common/1.2.2/auto-common-1.2.2.jar
[INFO] Downloaded from A_maven.central: https://repo1.maven.org/maven2/com/google/auto/auto-common/1.2.2/auto-common-1.2.2.jar (112 kB at 1.2 MB/s)
[INFO] Downloading from A_maven.central: https://repo1.maven.org/maven2/io/github/eisop/dataflow-errorprone/3.41.0-eisop1/dataflow-errorprone-3.41.0-eisop1.jar
[INFO] Downloaded from A_maven.central: https://repo1.maven.org/maven2/com/google/errorprone/error_prone_type_annotations/2.28.0/error_prone_type_annotations-2.28.0.jar (3.5 kB at 32 kB/s)
[INFO] Downloaded from A_maven.central: https://repo1.maven.org/maven2/com/github/kevinstern/software-and-algorithms/1.0/software-and-algorithms-1.0.jar (64 kB at 481 kB/s)
[INFO] Downloaded from A_maven.central: https://repo1.maven.org/maven2/com/google/errorprone/error_prone_check_api/2.28.0/error_prone_check_api-2.28.0.jar (706 kB at 3.3 MB/s)
[INFO] Downloaded from A_maven.central: https://repo1.maven.org/maven2/com/github/ben-manes/caffeine/caffeine/3.0.5/caffeine-3.0.5.jar (714 kB at 3.2 MB/s)
[INFO] Downloaded from A_maven.central: https://repo1.maven.org/maven2/io/github/eisop/dataflow-errorprone/3.41.0-eisop1/dataflow-errorprone-3.41.0-eisop1.jar (5.3 MB at 19 MB/s)
[INFO] Recompiling the module because of changed source code.
[INFO] Compiling 36 source files with javac [debug release 17] to target/classes
[INFO] ------------------------------------------------------------------------
[INFO] Reactor Summary for Apache WSS4J 4.0.0-SNAPSHOT:
[INFO]
[INFO] Apache WSS4J ....................................... SUCCESS [01:03 min]
[INFO] Apache WSS4J parent ................................ SUCCESS [ 14.927 s]
[INFO] Apache WSS4J WS-Security Bindings .................. FAILURE [ 8.697 s]
[INFO] Apache WSS4J WS-SecurityPolicy model ............... SKIPPED
[INFO] Apache WSS4J WS-Security Common .................... SKIPPED
[INFO] Apache WSS4J DOM WS-Security ....................... SKIPPED
[INFO] Apache WSS4J Streaming WS-Security ................. SKIPPED
[INFO] Apache WSS4J Web WS-Security ....................... SKIPPED
[INFO] Apache WSS4J WS-Security Integration ............... SKIPPED
[INFO] Apache WSS4J Streaming WS-SecurityPolicy ........... SKIPPED
[INFO] ------------------------------------------------------------------------
[INFO] BUILD FAILURE
[INFO] ------------------------------------------------------------------------
[INFO] Total time: 01:53 min
[INFO] Finished at: 2024-06-22T01:27:51Z
[INFO] ------------------------------------------------------------------------
Waiting for Jenkins to finish collecting data
[ERROR] Failed to execute goal org.apache.maven.plugins:maven-compiler-plugin:3.13.0:compile (default-compile) on project wss4j-bindings: Fatal error compiling: error: release version 17 not supported -> [Help 1]
[ERROR]
[ERROR] To see the full stack trace of the errors, re-run Maven with the -e switch.
[ERROR] Re-run Maven using the -X switch to enable full debug logging.
[ERROR]
[ERROR] For more information about the errors and possible solutions, please read the following articles:
[ERROR] [Help 1] http://cwiki.apache.org/confluence/display/MAVEN/MojoExecutionException
[ERROR]
[ERROR] After correcting the problems, you can resume the build with the command
[ERROR] mvn <goals> -rf :wss4j-bindings
[JENKINS] Archiving <https://ci-builds.apache.org/job/webservices/job/Apache%20WSS4J%20-%20master%20JDK11/ws/bindings/pom.xml> to org.apache.wss4j/wss4j-bindings/4.0.0-SNAPSHOT/wss4j-bindings-4.0.0-SNAPSHOT.pom
[JENKINS] Archiving <https://ci-builds.apache.org/job/webservices/job/Apache%20WSS4J%20-%20master%20JDK11/ws/ws-security-policy-stax/pom.xml> to org.apache.wss4j/wss4j-ws-security-policy-stax/4.0.0-SNAPSHOT/wss4j-ws-security-policy-stax-4.0.0-SNAPSHOT.pom
[JENKINS] Archiving <https://ci-builds.apache.org/job/webservices/job/Apache%20WSS4J%20-%20master%20JDK11/ws/ws-security-common/pom.xml> to org.apache.wss4j/wss4j-ws-security-common/4.0.0-SNAPSHOT/wss4j-ws-security-common-4.0.0-SNAPSHOT.pom
[JENKINS] Archiving <https://ci-builds.apache.org/job/webservices/job/Apache%20WSS4J%20-%20master%20JDK11/ws/ws-security-dom/pom.xml> to org.apache.wss4j/wss4j-ws-security-dom/4.0.0-SNAPSHOT/wss4j-ws-security-dom-4.0.0-SNAPSHOT.pom
[JENKINS] Archiving <https://ci-builds.apache.org/job/webservices/job/Apache%20WSS4J%20-%20master%20JDK11/ws/policy/pom.xml> to org.apache.wss4j/wss4j-policy/4.0.0-SNAPSHOT/wss4j-policy-4.0.0-SNAPSHOT.pom
[JENKINS] Archiving <https://ci-builds.apache.org/job/webservices/job/Apache%20WSS4J%20-%20master%20JDK11/ws/integration/pom.xml> to org.apache.wss4j/wss4j-integration/4.0.0-SNAPSHOT/wss4j-integration-4.0.0-SNAPSHOT.pom
[JENKINS] Archiving <https://ci-builds.apache.org/job/webservices/job/Apache%20WSS4J%20-%20master%20JDK11/ws/ws-security-stax/pom.xml> to org.apache.wss4j/wss4j-ws-security-stax/4.0.0-SNAPSHOT/wss4j-ws-security-stax-4.0.0-SNAPSHOT.pom
[JENKINS] Archiving <https://ci-builds.apache.org/job/webservices/job/Apache%20WSS4J%20-%20master%20JDK11/ws/parent/pom.xml> to org.apache.wss4j/wss4j-parent/4.0.0-SNAPSHOT/wss4j-parent-4.0.0-SNAPSHOT.pom
[JENKINS] Archiving <https://ci-builds.apache.org/job/webservices/job/Apache%20WSS4J%20-%20master%20JDK11/ws/parent/target/wss4j-parent-4.0.0-SNAPSHOT-bom.xml> to org.apache.wss4j/wss4j-parent/4.0.0-SNAPSHOT/wss4j-parent-4.0.0-SNAPSHOT-cyclonedx.xml
[JENKINS] Archiving <https://ci-builds.apache.org/job/webservices/job/Apache%20WSS4J%20-%20master%20JDK11/ws/parent/target/wss4j-parent-4.0.0-SNAPSHOT-bom.json> to org.apache.wss4j/wss4j-parent/4.0.0-SNAPSHOT/wss4j-parent-4.0.0-SNAPSHOT-cyclonedx.json
[JENKINS] Archiving <https://ci-builds.apache.org/job/webservices/job/Apache%20WSS4J%20-%20master%20JDK11/ws/pom.xml> to org.apache.wss4j/wss4j/4.0.0-SNAPSHOT/wss4j-4.0.0-SNAPSHOT.pom
[JENKINS] Archiving <https://ci-builds.apache.org/job/webservices/job/Apache%20WSS4J%20-%20master%20JDK11/ws/target/wss4j-4.0.0-SNAPSHOT-source-release.zip> to org.apache.wss4j/wss4j/4.0.0-SNAPSHOT/wss4j-4.0.0-SNAPSHOT-source-release.zip
[JENKINS] Archiving <https://ci-builds.apache.org/job/webservices/job/Apache%20WSS4J%20-%20master%20JDK11/ws/target/wss4j-4.0.0-SNAPSHOT-bom.xml> to org.apache.wss4j/wss4j/4.0.0-SNAPSHOT/wss4j-4.0.0-SNAPSHOT-cyclonedx.xml
[JENKINS] Archiving <https://ci-builds.apache.org/job/webservices/job/Apache%20WSS4J%20-%20master%20JDK11/ws/target/wss4j-4.0.0-SNAPSHOT-bom.json> to org.apache.wss4j/wss4j/4.0.0-SNAPSHOT/wss4j-4.0.0-SNAPSHOT-cyclonedx.json
[JENKINS] Archiving <https://ci-builds.apache.org/job/webservices/job/Apache%20WSS4J%20-%20master%20JDK11/ws/target/wss4j-4.0.0-SNAPSHOT-source-release.zip.sha512> to org.apache.wss4j/wss4j/4.0.0-SNAPSHOT/wss4j-4.0.0-SNAPSHOT-source-release.zip.sha512
[JENKINS] Archiving <https://ci-builds.apache.org/job/webservices/job/Apache%20WSS4J%20-%20master%20JDK11/ws/ws-security-web/pom.xml> to org.apache.wss4j/wss4j-ws-security-web/4.0.0-SNAPSHOT/wss4j-ws-security-web-4.0.0-SNAPSHOT.pom
Sending e-mails to: dev@ws.apache.org
No mail will be sent out, as 'webservices » Apache WSS4J - master JDK11 » Apache WSS4J Streaming WS-SecurityPolicy #108' does not have a result yet. Please make sure you set a proper result in case of pipeline/build scripts.
No mail will be sent out, as 'webservices » Apache WSS4J - master JDK11 » Apache WSS4J WS-Security Common #108' does not have a result yet. Please make sure you set a proper result in case of pipeline/build scripts.
No mail will be sent out, as 'webservices » Apache WSS4J - master JDK11 » Apache WSS4J DOM WS-Security #108' does not have a result yet. Please make sure you set a proper result in case of pipeline/build scripts.
No mail will be sent out, as 'webservices » Apache WSS4J - master JDK11 » Apache WSS4J WS-SecurityPolicy model #108' does not have a result yet. Please make sure you set a proper result in case of pipeline/build scripts.
No mail will be sent out, as 'webservices » Apache WSS4J - master JDK11 » Apache WSS4J WS-Security Integration #108' does not have a result yet. Please make sure you set a proper result in case of pipeline/build scripts.
No mail will be sent out, as 'webservices » Apache WSS4J - master JDK11 » Apache WSS4J Streaming WS-Security #108' does not have a result yet. Please make sure you set a proper result in case of pipeline/build scripts.
No mail will be sent out, as 'webservices » Apache WSS4J - master JDK11 » Apache WSS4J Web WS-Security #108' does not have a result yet. Please make sure you set a proper result in case of pipeline/build scripts.
channel stopped
---------------------------------------------------------------------
To unsubscribe, e-mail: dev-unsubscribe@ws.apache.org
For additional commands, e-mail: dev-help@ws.apache.org
Build failed in Jenkins: webservices » Apache WSS4J - master JDK11 #107
Posted by Apache Jenkins Server <je...@builds.apache.org>.
See <https://ci-builds.apache.org/job/webservices/job/Apache%20WSS4J%20-%20master%20JDK11/107/display/redirect?page=changes>
Changes:
[github] Bump org.apache.maven.plugins:maven-surefire-plugin from 3.2.5 to 3.3.0 (#340)
[github] Bump org.apache.maven.plugins:maven-checkstyle-plugin (#341)
[github] Bump org.apache.maven.plugins:maven-project-info-reports-plugin (#342)
[github] Bump org.apache.maven.plugins:maven-jxr-plugin from 3.3.2 to 3.4.0 (#343)
------------------------------------------
[...truncated 10.67 KB...]
[INFO] Downloaded from Nexus: https://repository.apache.org/snapshots/org/apache/wss4j/wss4j-ws-security-dom/4.0.0-SNAPSHOT/wss4j-ws-security-dom-4.0.0-20240619.163846-55-tests.jar (424 kB at 589 kB/s)
[INFO] Downloading from A_maven.central: https://repo1.maven.org/maven2/org/apache/wss4j/wss4j-ws-security-dom/4.0.0-SNAPSHOT/wss4j-ws-security-dom-4.0.0-20240619.163846-55.pom
[INFO] Downloading from B_shibboleth: https://build.shibboleth.net/nexus/content/groups/public/org/apache/wss4j/wss4j-ws-security-dom/4.0.0-SNAPSHOT/wss4j-ws-security-dom-4.0.0-20240619.163846-55.pom
[INFO] Downloading from Nexus: https://repository.apache.org/snapshots/org/apache/wss4j/wss4j-ws-security-dom/4.0.0-SNAPSHOT/wss4j-ws-security-dom-4.0.0-20240619.163846-55.pom
[INFO] Downloaded from Nexus: https://repository.apache.org/snapshots/org/apache/wss4j/wss4j-ws-security-dom/4.0.0-SNAPSHOT/wss4j-ws-security-dom-4.0.0-20240619.163846-55.pom (5.2 kB at 30 kB/s)
[INFO] Downloading from B_shibboleth: https://build.shibboleth.net/nexus/content/groups/public/org/apache/wss4j/wss4j-ws-security-stax/4.0.0-SNAPSHOT/maven-metadata.xml
[INFO] Downloading from A_maven.central: https://repo1.maven.org/maven2/org/apache/wss4j/wss4j-ws-security-stax/4.0.0-SNAPSHOT/maven-metadata.xml
[INFO] Downloading from Nexus: https://repository.apache.org/snapshots/org/apache/wss4j/wss4j-ws-security-stax/4.0.0-SNAPSHOT/maven-metadata.xml
[INFO] Downloaded from Nexus: https://repository.apache.org/snapshots/org/apache/wss4j/wss4j-ws-security-stax/4.0.0-SNAPSHOT/maven-metadata.xml (1.9 kB at 1.3 kB/s)
[INFO] Downloading from Nexus: https://repository.apache.org/snapshots/org/apache/wss4j/wss4j-ws-security-stax/4.0.0-SNAPSHOT/wss4j-ws-security-stax-4.0.0-20240619.163846-55.jar
[INFO] Downloaded from Nexus: https://repository.apache.org/snapshots/org/apache/wss4j/wss4j-ws-security-stax/4.0.0-SNAPSHOT/wss4j-ws-security-stax-4.0.0-20240619.163846-55.jar (417 kB at 402 kB/s)
[INFO] Downloading from Nexus: https://repository.apache.org/snapshots/org/apache/wss4j/wss4j-ws-security-stax/4.0.0-SNAPSHOT/wss4j-ws-security-stax-4.0.0-20240619.163846-55-tests.jar
[INFO] Downloaded from Nexus: https://repository.apache.org/snapshots/org/apache/wss4j/wss4j-ws-security-stax/4.0.0-SNAPSHOT/wss4j-ws-security-stax-4.0.0-20240619.163846-55-tests.jar (364 kB at 1.3 MB/s)
[INFO] Downloading from A_maven.central: https://repo1.maven.org/maven2/org/apache/wss4j/wss4j-ws-security-stax/4.0.0-SNAPSHOT/wss4j-ws-security-stax-4.0.0-20240619.163846-55.pom
[INFO] Downloading from B_shibboleth: https://build.shibboleth.net/nexus/content/groups/public/org/apache/wss4j/wss4j-ws-security-stax/4.0.0-SNAPSHOT/wss4j-ws-security-stax-4.0.0-20240619.163846-55.pom
[INFO] Downloading from Nexus: https://repository.apache.org/snapshots/org/apache/wss4j/wss4j-ws-security-stax/4.0.0-SNAPSHOT/wss4j-ws-security-stax-4.0.0-20240619.163846-55.pom
[INFO] Downloaded from Nexus: https://repository.apache.org/snapshots/org/apache/wss4j/wss4j-ws-security-stax/4.0.0-SNAPSHOT/wss4j-ws-security-stax-4.0.0-20240619.163846-55.pom (5.6 kB at 23 kB/s)
[INFO] Downloading from A_maven.central: https://repo1.maven.org/maven2/org/apache/wss4j/wss4j-policy/4.0.0-SNAPSHOT/maven-metadata.xml
[INFO] Downloading from B_shibboleth: https://build.shibboleth.net/nexus/content/groups/public/org/apache/wss4j/wss4j-policy/4.0.0-SNAPSHOT/maven-metadata.xml
[INFO] Downloading from Nexus: https://repository.apache.org/snapshots/org/apache/wss4j/wss4j-policy/4.0.0-SNAPSHOT/maven-metadata.xml
[INFO] Downloaded from Nexus: https://repository.apache.org/snapshots/org/apache/wss4j/wss4j-policy/4.0.0-SNAPSHOT/maven-metadata.xml (1.6 kB at 1.5 kB/s)
[INFO] Downloading from Nexus: https://repository.apache.org/snapshots/org/apache/wss4j/wss4j-policy/4.0.0-SNAPSHOT/wss4j-policy-4.0.0-20240619.163846-55.jar
[INFO] Downloaded from Nexus: https://repository.apache.org/snapshots/org/apache/wss4j/wss4j-policy/4.0.0-SNAPSHOT/wss4j-policy-4.0.0-20240619.163846-55.jar (216 kB at 207 kB/s)
[WARNING] BOM dependency listed but is not depended upon: pkg:maven/commons-codec/commons-codec@1.17.0?type=jar
[INFO] CycloneDX: Creating BOM version 1.5 with 63 component(s)
[INFO] CycloneDX: Writing and validating BOM (XML): <https://ci-builds.apache.org/job/webservices/job/Apache%20WSS4J%20-%20master%20JDK11/ws/target/wss4j-4.0.0-SNAPSHOT-bom.xml>
[INFO] attaching as wss4j-4.0.0-SNAPSHOT-cyclonedx.xml
[INFO] CycloneDX: Writing and validating BOM (JSON): <https://ci-builds.apache.org/job/webservices/job/Apache%20WSS4J%20-%20master%20JDK11/ws/target/wss4j-4.0.0-SNAPSHOT-bom.json>
[INFO] attaching as wss4j-4.0.0-SNAPSHOT-cyclonedx.json
[INFO]
[INFO] --- checksum:1.11:artifacts (source-release-checksum) @ wss4j ---
[INFO] wss4j-4.0.0-SNAPSHOT-source-release.zip - SHA-512 : 6de186de60d7c21cd8b7e7fbcd66970e3b54beb4ef773262c30ea488463113b0236c3f07b9fbdfcc875c87729857c8b20976e836853338fd84b6cdeab5b02890
[INFO]
[INFO] --- gpg:3.2.3:sign (sign-release-artifacts) @ wss4j ---
[INFO]
[INFO] --- install:3.1.1:install (default-install) @ wss4j ---
[INFO] Installing <https://ci-builds.apache.org/job/webservices/job/Apache%20WSS4J%20-%20master%20JDK11/ws/pom.xml> to /home/jenkins/.m2/repository/org/apache/wss4j/wss4j/4.0.0-SNAPSHOT/wss4j-4.0.0-SNAPSHOT.pom
[INFO] Installing <https://ci-builds.apache.org/job/webservices/job/Apache%20WSS4J%20-%20master%20JDK11/ws/target/wss4j-4.0.0-SNAPSHOT-source-release.zip> to /home/jenkins/.m2/repository/org/apache/wss4j/wss4j/4.0.0-SNAPSHOT/wss4j-4.0.0-SNAPSHOT-source-release.zip
[INFO] Installing <https://ci-builds.apache.org/job/webservices/job/Apache%20WSS4J%20-%20master%20JDK11/ws/target/wss4j-4.0.0-SNAPSHOT-bom.xml> to /home/jenkins/.m2/repository/org/apache/wss4j/wss4j/4.0.0-SNAPSHOT/wss4j-4.0.0-SNAPSHOT-cyclonedx.xml
[INFO] Installing <https://ci-builds.apache.org/job/webservices/job/Apache%20WSS4J%20-%20master%20JDK11/ws/target/wss4j-4.0.0-SNAPSHOT-bom.json> to /home/jenkins/.m2/repository/org/apache/wss4j/wss4j/4.0.0-SNAPSHOT/wss4j-4.0.0-SNAPSHOT-cyclonedx.json
[INFO] Installing <https://ci-builds.apache.org/job/webservices/job/Apache%20WSS4J%20-%20master%20JDK11/ws/target/wss4j-4.0.0-SNAPSHOT-source-release.zip.sha512> to /home/jenkins/.m2/repository/org/apache/wss4j/wss4j/4.0.0-SNAPSHOT/wss4j-4.0.0-SNAPSHOT-source-release.zip.sha512
[INFO]
[INFO] --- deploy:3.1.1:deploy (default-deploy) @ wss4j ---
[INFO] Downloading from apache.snapshots.https: https://repository.apache.org/content/repositories/snapshots/org/apache/wss4j/wss4j/4.0.0-SNAPSHOT/maven-metadata.xml
[INFO] Downloaded from apache.snapshots.https: https://repository.apache.org/content/repositories/snapshots/org/apache/wss4j/wss4j/4.0.0-SNAPSHOT/maven-metadata.xml (1.5 kB at 6.5 kB/s)
[INFO] Uploading to apache.snapshots.https: https://repository.apache.org/content/repositories/snapshots/org/apache/wss4j/wss4j/4.0.0-SNAPSHOT/wss4j-4.0.0-20240620.012547-59.pom
[INFO] Uploaded to apache.snapshots.https: https://repository.apache.org/content/repositories/snapshots/org/apache/wss4j/wss4j/4.0.0-SNAPSHOT/wss4j-4.0.0-20240620.012547-59.pom (22 kB at 12 kB/s)
[INFO] Uploading to apache.snapshots.https: https://repository.apache.org/content/repositories/snapshots/org/apache/wss4j/wss4j/4.0.0-SNAPSHOT/wss4j-4.0.0-20240620.012547-59-source-release.zip
[INFO] Uploading to apache.snapshots.https: https://repository.apache.org/content/repositories/snapshots/org/apache/wss4j/wss4j/4.0.0-SNAPSHOT/wss4j-4.0.0-20240620.012547-59-cyclonedx.xml
[INFO] Uploading to apache.snapshots.https: https://repository.apache.org/content/repositories/snapshots/org/apache/wss4j/wss4j/4.0.0-SNAPSHOT/wss4j-4.0.0-20240620.012547-59-cyclonedx.json
[INFO] Uploading to apache.snapshots.https: https://repository.apache.org/content/repositories/snapshots/org/apache/wss4j/wss4j/4.0.0-SNAPSHOT/wss4j-4.0.0-20240620.012547-59-source-release.zip.sha512
[INFO] Uploaded to apache.snapshots.https: https://repository.apache.org/content/repositories/snapshots/org/apache/wss4j/wss4j/4.0.0-SNAPSHOT/wss4j-4.0.0-20240620.012547-59-source-release.zip.sha512 (128 B at 171 B/s)
[INFO] Uploaded to apache.snapshots.https: https://repository.apache.org/content/repositories/snapshots/org/apache/wss4j/wss4j/4.0.0-SNAPSHOT/wss4j-4.0.0-20240620.012547-59-cyclonedx.xml (150 kB at 75 kB/s)
[INFO] Uploaded to apache.snapshots.https: https://repository.apache.org/content/repositories/snapshots/org/apache/wss4j/wss4j/4.0.0-SNAPSHOT/wss4j-4.0.0-20240620.012547-59-cyclonedx.json (171 kB at 80 kB/s)
[INFO] Uploaded to apache.snapshots.https: https://repository.apache.org/content/repositories/snapshots/org/apache/wss4j/wss4j/4.0.0-SNAPSHOT/wss4j-4.0.0-20240620.012547-59-source-release.zip (2.1 MB at 988 kB/s)
[INFO] Downloading from apache.snapshots.https: https://repository.apache.org/content/repositories/snapshots/org/apache/wss4j/wss4j/maven-metadata.xml
[INFO] Downloaded from apache.snapshots.https: https://repository.apache.org/content/repositories/snapshots/org/apache/wss4j/wss4j/maven-metadata.xml (590 B at 3.4 kB/s)
[INFO] Uploading to apache.snapshots.https: https://repository.apache.org/content/repositories/snapshots/org/apache/wss4j/wss4j/4.0.0-SNAPSHOT/maven-metadata.xml
[INFO] Uploaded to apache.snapshots.https: https://repository.apache.org/content/repositories/snapshots/org/apache/wss4j/wss4j/4.0.0-SNAPSHOT/maven-metadata.xml (1.5 kB at 1.1 kB/s)
[INFO] Uploading to apache.snapshots.https: https://repository.apache.org/content/repositories/snapshots/org/apache/wss4j/wss4j/maven-metadata.xml
[INFO] Uploaded to apache.snapshots.https: https://repository.apache.org/content/repositories/snapshots/org/apache/wss4j/wss4j/maven-metadata.xml (590 B at 186 B/s)
[WARNING] Attempt to (de-)serialize anonymous class org.jfrog.hudson.maven2.MavenDependenciesRecorder$1; see: https://jenkins.io/redirect/serialization-of-anonymous-classes/
[INFO]
[INFO] -------------------< org.apache.wss4j:wss4j-parent >--------------------
[INFO] Building Apache WSS4J parent 4.0.0-SNAPSHOT [2/10]
[INFO] from parent/pom.xml
[INFO] --------------------------------[ pom ]---------------------------------
[WARNING] Parameter 'sourceEncoding' is unknown for plugin 'maven-pmd-plugin:3.19.0:check (validate)'
[WARNING] Parameter 'sourceEncoding' is unknown for plugin 'maven-pmd-plugin:3.19.0:pmd (pmd)'
[WARNING] Parameter 'encoding' is unknown for plugin 'maven-checkstyle-plugin:3.4.0:check (validate)'
[INFO]
[INFO] --- clean:3.3.2:clean (default-clean) @ wss4j-parent ---
[INFO] Deleting <https://ci-builds.apache.org/job/webservices/job/Apache%20WSS4J%20-%20master%20JDK11/ws/parent/target>
[INFO]
[INFO] --- enforcer:3.5.0:enforce (enforce-maven-version) @ wss4j-parent ---
[INFO]
[INFO] --- enforcer:3.5.0:enforce (enforce-java-version) @ wss4j-parent ---
[INFO]
[INFO] >>> pmd:3.19.0:check (validate) > :pmd @ wss4j-parent >>>
[INFO]
[INFO] --- pmd:3.19.0:pmd (pmd) @ wss4j-parent ---
[INFO]
[INFO] <<< pmd:3.19.0:check (validate) < :pmd @ wss4j-parent <<<
[INFO]
[INFO]
[INFO] --- pmd:3.19.0:check (validate) @ wss4j-parent ---
[INFO]
[INFO] --- checkstyle:3.4.0:check (validate) @ wss4j-parent ---
[INFO] You have 0 Checkstyle violations.
[INFO]
[INFO] --- bundle:5.1.9:cleanVersions (versions) @ wss4j-parent ---
[INFO]
[INFO] --- remote-resources:3.2.0:process (process-resource-bundles) @ wss4j-parent ---
[INFO] Preparing remote bundle org.apache.apache.resources:apache-jar-resource-bundle:1.5
[INFO] Copying 3 resources from 1 bundle.
[INFO]
[INFO] --- bundle:5.1.9:manifest (bundle-manifest) @ wss4j-parent ---
[WARNING] Ignoring project type pom - supportedProjectTypes = [jar, bundle]
[INFO]
[INFO] --- assembly:3.7.1:single (source-release-assembly) @ wss4j-parent ---
[INFO] Skipping the assembly in this project because it's not the Execution Root
[INFO]
[INFO] --- source:3.3.1:jar-no-fork (attach-sources) @ wss4j-parent ---
[INFO]
[INFO] --- javadoc:3.7.0:jar (default) @ wss4j-parent ---
[INFO] Not executing Javadoc as the project is not a Java classpath-capable package
[INFO]
[INFO] --- javadoc:3.7.0:jar (attach-javadocs) @ wss4j-parent ---
[INFO] Not executing Javadoc as the project is not a Java classpath-capable package
[INFO]
[INFO] --- cyclonedx:2.8.0:makeAggregateBom (make-bom) @ wss4j-parent ---
[INFO] CycloneDX: Resolving Dependencies
[INFO] CycloneDX: Creating BOM version 1.5 with 0 component(s)
[INFO] CycloneDX: Writing and validating BOM (XML): <https://ci-builds.apache.org/job/webservices/job/Apache%20WSS4J%20-%20master%20JDK11/ws/parent/target/wss4j-parent-4.0.0-SNAPSHOT-bom.xml>
[INFO] attaching as wss4j-parent-4.0.0-SNAPSHOT-cyclonedx.xml
[INFO] CycloneDX: Writing and validating BOM (JSON): <https://ci-builds.apache.org/job/webservices/job/Apache%20WSS4J%20-%20master%20JDK11/ws/parent/target/wss4j-parent-4.0.0-SNAPSHOT-bom.json>
[INFO] attaching as wss4j-parent-4.0.0-SNAPSHOT-cyclonedx.json
[INFO]
[INFO] --- checksum:1.11:artifacts (source-release-checksum) @ wss4j-parent ---
[INFO]
[INFO] --- gpg:3.2.3:sign (sign-release-artifacts) @ wss4j-parent ---
[INFO]
[INFO] --- install:3.1.1:install (default-install) @ wss4j-parent ---
[INFO] Installing <https://ci-builds.apache.org/job/webservices/job/Apache%20WSS4J%20-%20master%20JDK11/ws/parent/pom.xml> to /home/jenkins/.m2/repository/org/apache/wss4j/wss4j-parent/4.0.0-SNAPSHOT/wss4j-parent-4.0.0-SNAPSHOT.pom
[INFO] Installing <https://ci-builds.apache.org/job/webservices/job/Apache%20WSS4J%20-%20master%20JDK11/ws/parent/target/wss4j-parent-4.0.0-SNAPSHOT-bom.xml> to /home/jenkins/.m2/repository/org/apache/wss4j/wss4j-parent/4.0.0-SNAPSHOT/wss4j-parent-4.0.0-SNAPSHOT-cyclonedx.xml
[INFO] Installing <https://ci-builds.apache.org/job/webservices/job/Apache%20WSS4J%20-%20master%20JDK11/ws/parent/target/wss4j-parent-4.0.0-SNAPSHOT-bom.json> to /home/jenkins/.m2/repository/org/apache/wss4j/wss4j-parent/4.0.0-SNAPSHOT/wss4j-parent-4.0.0-SNAPSHOT-cyclonedx.json
[INFO]
[INFO] --- deploy:3.1.1:deploy (default-deploy) @ wss4j-parent ---
[INFO] Downloading from apache.snapshots.https: https://repository.apache.org/content/repositories/snapshots/org/apache/wss4j/wss4j-parent/4.0.0-SNAPSHOT/maven-metadata.xml
[INFO] Downloaded from apache.snapshots.https: https://repository.apache.org/content/repositories/snapshots/org/apache/wss4j/wss4j-parent/4.0.0-SNAPSHOT/maven-metadata.xml (1.0 kB at 1.7 kB/s)
[INFO] Uploading to apache.snapshots.https: https://repository.apache.org/content/repositories/snapshots/org/apache/wss4j/wss4j-parent/4.0.0-SNAPSHOT/wss4j-parent-4.0.0-20240620.012547-59.pom
[INFO] Uploaded to apache.snapshots.https: https://repository.apache.org/content/repositories/snapshots/org/apache/wss4j/wss4j-parent/4.0.0-SNAPSHOT/wss4j-parent-4.0.0-20240620.012547-59.pom (16 kB at 13 kB/s)
[INFO] Uploading to apache.snapshots.https: https://repository.apache.org/content/repositories/snapshots/org/apache/wss4j/wss4j-parent/4.0.0-SNAPSHOT/wss4j-parent-4.0.0-20240620.012547-59-cyclonedx.xml
[INFO] Uploading to apache.snapshots.https: https://repository.apache.org/content/repositories/snapshots/org/apache/wss4j/wss4j-parent/4.0.0-SNAPSHOT/wss4j-parent-4.0.0-20240620.012547-59-cyclonedx.json
[INFO] Uploaded to apache.snapshots.https: https://repository.apache.org/content/repositories/snapshots/org/apache/wss4j/wss4j-parent/4.0.0-SNAPSHOT/wss4j-parent-4.0.0-20240620.012547-59-cyclonedx.xml (3.0 kB at 2.9 kB/s)
[INFO] Uploaded to apache.snapshots.https: https://repository.apache.org/content/repositories/snapshots/org/apache/wss4j/wss4j-parent/4.0.0-SNAPSHOT/wss4j-parent-4.0.0-20240620.012547-59-cyclonedx.json (3.4 kB at 2.4 kB/s)
[INFO] Downloading from apache.snapshots.https: https://repository.apache.org/content/repositories/snapshots/org/apache/wss4j/wss4j-parent/maven-metadata.xml
[INFO] Downloaded from apache.snapshots.https: https://repository.apache.org/content/repositories/snapshots/org/apache/wss4j/wss4j-parent/maven-metadata.xml (597 B at 3.3 kB/s)
[INFO] Uploading to apache.snapshots.https: https://repository.apache.org/content/repositories/snapshots/org/apache/wss4j/wss4j-parent/4.0.0-SNAPSHOT/maven-metadata.xml
[INFO] Uploaded to apache.snapshots.https: https://repository.apache.org/content/repositories/snapshots/org/apache/wss4j/wss4j-parent/4.0.0-SNAPSHOT/maven-metadata.xml (1.0 kB at 949 B/s)
[INFO] Uploading to apache.snapshots.https: https://repository.apache.org/content/repositories/snapshots/org/apache/wss4j/wss4j-parent/maven-metadata.xml
[INFO] Uploaded to apache.snapshots.https: https://repository.apache.org/content/repositories/snapshots/org/apache/wss4j/wss4j-parent/maven-metadata.xml (597 B at 569 B/s)
[INFO]
[INFO] ------------------< org.apache.wss4j:wss4j-bindings >-------------------
[INFO] Building Apache WSS4J WS-Security Bindings 4.0.0-SNAPSHOT [3/10]
[INFO] from bindings/pom.xml
[INFO] --------------------------------[ jar ]---------------------------------
[WARNING] Parameter 'sourceEncoding' is unknown for plugin 'maven-pmd-plugin:3.19.0:check (validate)'
[WARNING] Parameter 'sourceEncoding' is unknown for plugin 'maven-pmd-plugin:3.19.0:pmd (pmd)'
[WARNING] Parameter 'encoding' is unknown for plugin 'maven-checkstyle-plugin:3.4.0:check (validate)'
[INFO] Downloading from central: https://repo.maven.apache.org/maven2/org/apache/maven/plugins/maven-surefire-plugin/3.3.0/maven-surefire-plugin-3.3.0.pom
[INFO] Downloaded from central: https://repo.maven.apache.org/maven2/org/apache/maven/plugins/maven-surefire-plugin/3.3.0/maven-surefire-plugin-3.3.0.pom (5.7 kB at 34 kB/s)
[INFO] Downloading from central: https://repo.maven.apache.org/maven2/org/apache/maven/plugins/maven-surefire-plugin/3.3.0/maven-surefire-plugin-3.3.0.jar
[INFO] Downloaded from central: https://repo.maven.apache.org/maven2/org/apache/maven/plugins/maven-surefire-plugin/3.3.0/maven-surefire-plugin-3.3.0.jar (45 kB at 798 kB/s)
[INFO]
[INFO] --- clean:3.3.2:clean (default-clean) @ wss4j-bindings ---
[INFO] Deleting <https://ci-builds.apache.org/job/webservices/job/Apache%20WSS4J%20-%20master%20JDK11/ws/bindings/target>
[INFO]
[INFO] --- enforcer:3.5.0:enforce (enforce-maven-version) @ wss4j-bindings ---
[INFO]
[INFO] --- enforcer:3.5.0:enforce (enforce-java-version) @ wss4j-bindings ---
[INFO]
[INFO] >>> pmd:3.19.0:check (validate) > :pmd @ wss4j-bindings >>>
[INFO]
[INFO] --- pmd:3.19.0:pmd (pmd) @ wss4j-bindings ---
[INFO] PMD version: 6.49.0
[WARNING] Removed misconfigured rule: LoosePackageCoupling cause: No packages or classes specified
[INFO] Rendering content with org.apache.maven.skins:maven-default-skin:jar:1.3 skin.
[INFO]
[INFO] <<< pmd:3.19.0:check (validate) < :pmd @ wss4j-bindings <<<
[INFO]
[INFO]
[INFO] --- pmd:3.19.0:check (validate) @ wss4j-bindings ---
[INFO] PMD version: 6.49.0
[INFO]
[INFO]
[INFO] --- checkstyle:3.4.0:check (validate) @ wss4j-bindings ---
[INFO]
[INFO] --- bundle:5.1.9:cleanVersions (versions) @ wss4j-bindings ---
[INFO]
[INFO] --- remote-resources:3.2.0:process (process-resource-bundles) @ wss4j-bindings ---
[INFO] Preparing remote bundle org.apache.apache.resources:apache-jar-resource-bundle:1.5
[INFO] Copying 3 resources from 1 bundle.
[INFO]
[INFO] --- resources:3.3.1:resources (default-resources) @ wss4j-bindings ---
[INFO] Copying 0 resource from src/main/java to target/classes
[INFO] skip non existing resourceDirectory <https://ci-builds.apache.org/job/webservices/job/Apache%20WSS4J%20-%20master%20JDK11/ws/bindings/src/main/resources>
[INFO] skip non existing resourceDirectory <https://ci-builds.apache.org/job/webservices/job/Apache%20WSS4J%20-%20master%20JDK11/ws/bindings/src/main/resources-filtered>
[INFO] skip non existing resourceDirectory <https://ci-builds.apache.org/job/webservices/job/Apache%20WSS4J%20-%20master%20JDK11/ws/bindings/target/generated/src/main/resources>
[INFO] Copying 3 resources from target/maven-shared-archive-resources to target/classes
[INFO]
[INFO] --- compiler:3.13.0:compile (default-compile) @ wss4j-bindings ---
[INFO] Recompiling the module because of changed source code.
[INFO] Compiling 36 source files with javac [debug release 17] to target/classes
[INFO] ------------------------------------------------------------------------
[INFO] Reactor Summary for Apache WSS4J 4.0.0-SNAPSHOT:
[INFO]
[INFO] Apache WSS4J ....................................... SUCCESS [ 56.437 s]
[INFO] Apache WSS4J parent ................................ SUCCESS [ 13.676 s]
[INFO] Apache WSS4J WS-Security Bindings .................. FAILURE [ 8.567 s]
[INFO] Apache WSS4J WS-SecurityPolicy model ............... SKIPPED
[INFO] Apache WSS4J WS-Security Common .................... SKIPPED
[INFO] Apache WSS4J DOM WS-Security ....................... SKIPPED
[INFO] Apache WSS4J Streaming WS-Security ................. SKIPPED
[INFO] Apache WSS4J Web WS-Security ....................... SKIPPED
[INFO] Apache WSS4J WS-Security Integration ............... SKIPPED
[INFO] Apache WSS4J Streaming WS-SecurityPolicy ........... SKIPPED
[INFO] ------------------------------------------------------------------------
[INFO] BUILD FAILURE
[INFO] ------------------------------------------------------------------------
[INFO] Total time: 01:43 min
[INFO] Finished at: 2024-06-20T01:27:31Z
[INFO] ------------------------------------------------------------------------
Waiting for Jenkins to finish collecting data
[ERROR] Failed to execute goal org.apache.maven.plugins:maven-compiler-plugin:3.13.0:compile (default-compile) on project wss4j-bindings: Fatal error compiling: error: release version 17 not supported -> [Help 1]
[ERROR]
[ERROR] To see the full stack trace of the errors, re-run Maven with the -e switch.
[ERROR] Re-run Maven using the -X switch to enable full debug logging.
[ERROR]
[ERROR] For more information about the errors and possible solutions, please read the following articles:
[ERROR] [Help 1] http://cwiki.apache.org/confluence/display/MAVEN/MojoExecutionException
[ERROR]
[ERROR] After correcting the problems, you can resume the build with the command
[ERROR] mvn <goals> -rf :wss4j-bindings
[JENKINS] Archiving <https://ci-builds.apache.org/job/webservices/job/Apache%20WSS4J%20-%20master%20JDK11/ws/bindings/pom.xml> to org.apache.wss4j/wss4j-bindings/4.0.0-SNAPSHOT/wss4j-bindings-4.0.0-SNAPSHOT.pom
[JENKINS] Archiving <https://ci-builds.apache.org/job/webservices/job/Apache%20WSS4J%20-%20master%20JDK11/ws/ws-security-policy-stax/pom.xml> to org.apache.wss4j/wss4j-ws-security-policy-stax/4.0.0-SNAPSHOT/wss4j-ws-security-policy-stax-4.0.0-SNAPSHOT.pom
[JENKINS] Archiving <https://ci-builds.apache.org/job/webservices/job/Apache%20WSS4J%20-%20master%20JDK11/ws/ws-security-common/pom.xml> to org.apache.wss4j/wss4j-ws-security-common/4.0.0-SNAPSHOT/wss4j-ws-security-common-4.0.0-SNAPSHOT.pom
[JENKINS] Archiving <https://ci-builds.apache.org/job/webservices/job/Apache%20WSS4J%20-%20master%20JDK11/ws/ws-security-dom/pom.xml> to org.apache.wss4j/wss4j-ws-security-dom/4.0.0-SNAPSHOT/wss4j-ws-security-dom-4.0.0-SNAPSHOT.pom
[JENKINS] Archiving <https://ci-builds.apache.org/job/webservices/job/Apache%20WSS4J%20-%20master%20JDK11/ws/policy/pom.xml> to org.apache.wss4j/wss4j-policy/4.0.0-SNAPSHOT/wss4j-policy-4.0.0-SNAPSHOT.pom
[JENKINS] Archiving <https://ci-builds.apache.org/job/webservices/job/Apache%20WSS4J%20-%20master%20JDK11/ws/integration/pom.xml> to org.apache.wss4j/wss4j-integration/4.0.0-SNAPSHOT/wss4j-integration-4.0.0-SNAPSHOT.pom
[JENKINS] Archiving <https://ci-builds.apache.org/job/webservices/job/Apache%20WSS4J%20-%20master%20JDK11/ws/ws-security-stax/pom.xml> to org.apache.wss4j/wss4j-ws-security-stax/4.0.0-SNAPSHOT/wss4j-ws-security-stax-4.0.0-SNAPSHOT.pom
[JENKINS] Archiving <https://ci-builds.apache.org/job/webservices/job/Apache%20WSS4J%20-%20master%20JDK11/ws/parent/pom.xml> to org.apache.wss4j/wss4j-parent/4.0.0-SNAPSHOT/wss4j-parent-4.0.0-SNAPSHOT.pom
[JENKINS] Archiving <https://ci-builds.apache.org/job/webservices/job/Apache%20WSS4J%20-%20master%20JDK11/ws/parent/target/wss4j-parent-4.0.0-SNAPSHOT-bom.xml> to org.apache.wss4j/wss4j-parent/4.0.0-SNAPSHOT/wss4j-parent-4.0.0-SNAPSHOT-cyclonedx.xml
[JENKINS] Archiving <https://ci-builds.apache.org/job/webservices/job/Apache%20WSS4J%20-%20master%20JDK11/ws/parent/target/wss4j-parent-4.0.0-SNAPSHOT-bom.json> to org.apache.wss4j/wss4j-parent/4.0.0-SNAPSHOT/wss4j-parent-4.0.0-SNAPSHOT-cyclonedx.json
[JENKINS] Archiving <https://ci-builds.apache.org/job/webservices/job/Apache%20WSS4J%20-%20master%20JDK11/ws/pom.xml> to org.apache.wss4j/wss4j/4.0.0-SNAPSHOT/wss4j-4.0.0-SNAPSHOT.pom
[JENKINS] Archiving <https://ci-builds.apache.org/job/webservices/job/Apache%20WSS4J%20-%20master%20JDK11/ws/target/wss4j-4.0.0-SNAPSHOT-source-release.zip> to org.apache.wss4j/wss4j/4.0.0-SNAPSHOT/wss4j-4.0.0-SNAPSHOT-source-release.zip
[JENKINS] Archiving <https://ci-builds.apache.org/job/webservices/job/Apache%20WSS4J%20-%20master%20JDK11/ws/target/wss4j-4.0.0-SNAPSHOT-bom.xml> to org.apache.wss4j/wss4j/4.0.0-SNAPSHOT/wss4j-4.0.0-SNAPSHOT-cyclonedx.xml
[JENKINS] Archiving <https://ci-builds.apache.org/job/webservices/job/Apache%20WSS4J%20-%20master%20JDK11/ws/target/wss4j-4.0.0-SNAPSHOT-bom.json> to org.apache.wss4j/wss4j/4.0.0-SNAPSHOT/wss4j-4.0.0-SNAPSHOT-cyclonedx.json
[JENKINS] Archiving <https://ci-builds.apache.org/job/webservices/job/Apache%20WSS4J%20-%20master%20JDK11/ws/target/wss4j-4.0.0-SNAPSHOT-source-release.zip.sha512> to org.apache.wss4j/wss4j/4.0.0-SNAPSHOT/wss4j-4.0.0-SNAPSHOT-source-release.zip.sha512
[JENKINS] Archiving <https://ci-builds.apache.org/job/webservices/job/Apache%20WSS4J%20-%20master%20JDK11/ws/ws-security-web/pom.xml> to org.apache.wss4j/wss4j-ws-security-web/4.0.0-SNAPSHOT/wss4j-ws-security-web-4.0.0-SNAPSHOT.pom
Sending e-mails to: dev@ws.apache.org
No mail will be sent out, as 'webservices » Apache WSS4J - master JDK11 » Apache WSS4J Streaming WS-SecurityPolicy #107' does not have a result yet. Please make sure you set a proper result in case of pipeline/build scripts.
No mail will be sent out, as 'webservices » Apache WSS4J - master JDK11 » Apache WSS4J WS-Security Common #107' does not have a result yet. Please make sure you set a proper result in case of pipeline/build scripts.
No mail will be sent out, as 'webservices » Apache WSS4J - master JDK11 » Apache WSS4J DOM WS-Security #107' does not have a result yet. Please make sure you set a proper result in case of pipeline/build scripts.
No mail will be sent out, as 'webservices » Apache WSS4J - master JDK11 » Apache WSS4J WS-SecurityPolicy model #107' does not have a result yet. Please make sure you set a proper result in case of pipeline/build scripts.
No mail will be sent out, as 'webservices » Apache WSS4J - master JDK11 » Apache WSS4J WS-Security Integration #107' does not have a result yet. Please make sure you set a proper result in case of pipeline/build scripts.
No mail will be sent out, as 'webservices » Apache WSS4J - master JDK11 » Apache WSS4J Streaming WS-Security #107' does not have a result yet. Please make sure you set a proper result in case of pipeline/build scripts.
No mail will be sent out, as 'webservices » Apache WSS4J - master JDK11 » Apache WSS4J Web WS-Security #107' does not have a result yet. Please make sure you set a proper result in case of pipeline/build scripts.
channel stopped
---------------------------------------------------------------------
To unsubscribe, e-mail: dev-unsubscribe@ws.apache.org
For additional commands, e-mail: dev-help@ws.apache.org