You are viewing a plain text version of this content. The canonical link for it is here.
Posted to builds@beam.apache.org by Apache Jenkins Server <je...@builds.apache.org> on 2022/02/10 01:02:43 UTC

Build failed in Jenkins: beam_PostCommit_XVR_Samza #812

See <https://ci-beam.apache.org/job/beam_PostCommit_XVR_Samza/812/display/redirect?page=changes>

Changes:

[david.prieto.rivera] Missing contribution

[noreply] Merge pull request #15848 from [BEAM-13835] An any-type implementation

[Valentyn Tymofieiev] [BEAM-12920] Assume that bare generators types define simple generators.

[noreply] [release-2.36.0][website] Fix github release notes script, header for

[noreply] Use shell to run python for setupVirtualenv (#16796)

[Daniel Oliveira] [BEAM-13830] Properly shut down Debezium expansion service in IT script.

[noreply] Merge pull request #16659 from [BEAM-13774][Playground] Add user to

[noreply] [BEAM-13776][Playground] (#16731)


------------------------------------------
[...truncated 1.19 MB...]
      >
      component_coder_ids: "c2"
    >
  >
  coders: <
    key: "c4"
    value: <
      spec: <
        urn: "beam:coder:kv:v1"
      >
      component_coder_ids: "c0"
      component_coder_ids: "c0"
    >
  >
  environments: <
    key: "PdVrxjXgmvbeam:env:docker:v1"
    value: <
      urn: "beam:env:docker:v1"
      payload: "\n apache/beam_java8_sdk:2.37.0.dev"
      capabilities: "beam:coder:bytes:v1"
      capabilities: "beam:coder:bool:v1"
      capabilities: "beam:coder:varint:v1"
      capabilities: "beam:coder:string_utf8:v1"
      capabilities: "beam:coder:iterable:v1"
      capabilities: "beam:coder:timer:v1"
      capabilities: "beam:coder:kv:v1"
      capabilities: "beam:coder:length_prefix:v1"
      capabilities: "beam:coder:global_window:v1"
      capabilities: "beam:coder:interval_window:v1"
      capabilities: "beam:coder:custom_window:v1"
      capabilities: "beam:coder:windowed_value:v1"
      capabilities: "beam:coder:double:v1"
      capabilities: "beam:coder:row:v1"
      capabilities: "beam:coder:param_windowed_value:v1"
      capabilities: "beam:coder:state_backed_iterable:v1"
      capabilities: "beam:coder:sharded_key:v1"
      capabilities: "beam:protocol:multi_core_bundle_processing:v1"
      capabilities: "beam:protocol:progress_reporting:v1"
      capabilities: "beam:protocol:harness_monitoring_infos:v1"
      capabilities: "beam:protocol:control_request_elements_embedding:v1"
      capabilities: "beam:protocol:state_caching:v1"
      capabilities: "beam:version:sdk_base:apache/beam_java8_sdk:2.37.0.dev"
      capabilities: "beam:transform:sdf_truncate_sized_restrictions:v1"
      capabilities: "beam:transform:to_string:v1"
      dependencies: <
        type_urn: "beam:artifact:type:file:v1"
        type_payload: "\nL/tmp/artifacts/icedtea-sound-ebvtNFkfFXg4aaYFuDnwKpwDSjzsaZqlqv5iKxPTr-U.jar\022@79bbed34591f15783869a605b839f02a9c034a3cec699aa5aafe622b13d3afe5"
        role_urn: "beam:artifact:role:staging_to:v1"
        role_payload: "\n=icedtea-sound-ebvtNFkfFXg4aaYFuDnwKpwDSjzsaZqlqv5iKxPTr-U.jar"
      >
      dependencies: <
        type_urn: "beam:artifact:type:file:v1"
        type_payload: "\nF/tmp/artifacts/jaccess-ULFTCPsb6cLYZ0f1BG1FQfczmHNaZCx8plXuRDKpBqE.jar\022@50b15308fb1be9c2d86747f5046d4541f73398735a642c7ca655ee4432a906a1"
        role_urn: "beam:artifact:role:staging_to:v1"
        role_payload: "\n7jaccess-ULFTCPsb6cLYZ0f1BG1FQfczmHNaZCx8plXuRDKpBqE.jar"
      >
      dependencies: <
        type_urn: "beam:artifact:type:file:v1"
        type_payload: "\nI/tmp/artifacts/localedata-dUHqyGxaTVCjfTI8MckPYarZ3_mwf62udkxaHi1aKns.jar\022@7541eac86c5a4d50a37d323c31c90f61aad9dff9b07fadae764c5a1e2d5a2a7b"
        role_urn: "beam:artifact:role:staging_to:v1"
        role_payload: "\n:localedata-dUHqyGxaTVCjfTI8MckPYarZ3_mwf62udkxaHi1aKns.jar"
      >
      dependencies: <
        type_urn: "beam:artifact:type:file:v1"
        type_payload: "\nF/tmp/artifacts/nashorn-XdUndQGroXOP9NCsfITpBERYcbbGXVHLjbvNWXCh-3A.jar\022@5dd5277501aba1738ff4d0ac7c84e904445871b6c65d51cb8dbbcd5970a1fb70"
        role_urn: "beam:artifact:role:staging_to:v1"
        role_payload: "\n7nashorn-XdUndQGroXOP9NCsfITpBERYcbbGXVHLjbvNWXCh-3A.jar"
      >
      dependencies: <
        type_urn: "beam:artifact:type:file:v1"
        type_payload: "\nG/tmp/artifacts/cldrdata-YqzuKX1QnLCOo0cwjKRdBhGrip_ltIJZg-APT60tUPA.jar\022@62acee297d509cb08ea347308ca45d0611ab8a9fe5b4825983e00f4fad2d50f0"
        role_urn: "beam:artifact:role:staging_to:v1"
        role_payload: "\n8cldrdata-YqzuKX1QnLCOo0cwjKRdBhGrip_ltIJZg-APT60tUPA.jar"
      >
      dependencies: <
        type_urn: "beam:artifact:type:file:v1"
        type_payload: "\nD/tmp/artifacts/dnsns-dhEp186udEF6X6chZus-RJzWRmzlccxx1_btlXWayVI.jar\022@761129d7ceae74417a5fa72166eb3e449cd6466ce571cc71d7f6ed95759ac952"
        role_urn: "beam:artifact:role:staging_to:v1"
        role_payload: "\n5dnsns-dhEp186udEF6X6chZus-RJzWRmzlccxx1_btlXWayVI.jar"
      >
      dependencies: <
        type_urn: "beam:artifact:type:file:v1"
        type_payload: "\nr/tmp/artifacts/beam-sdks-java-io-expansion-service-2.37.0-SNAPSHOT-52l-U8moPJCxzLJn5NhsBAR757m1iYm8UsnOV74v-6Q.jar\022@e7697e53c9a83c90b1ccb267e4d86c04047be7b9b58989bc52c9ce57be2ffba4"
        role_urn: "beam:artifact:role:staging_to:v1"
        role_payload: "\ncbeam-sdks-java-io-expansion-service-2.37.0-SNAPSHOT-52l-U8moPJCxzLJn5NhsBAR757m1iYm8UsnOV74v-6Q.jar"
      >
    >
  >
  environments: <
    key: "go"
    value: <
      urn: "beam:env:docker:v1"
      payload: "\n\026apache/beam_go_sdk:dev"
      capabilities: "beam:protocol:progress_reporting:v0"
      capabilities: "beam:protocol:multi_core_bundle_processing:v1"
      capabilities: "beam:version:sdk_base:go"
      capabilities: "beam:coder:bytes:v1"
      capabilities: "beam:coder:bool:v1"
      capabilities: "beam:coder:varint:v1"
      capabilities: "beam:coder:double:v1"
      capabilities: "beam:coder:string_utf8:v1"
      capabilities: "beam:coder:length_prefix:v1"
      capabilities: "beam:coder:kv:v1"
      capabilities: "beam:coder:iterable:v1"
      capabilities: "beam:coder:state_backed_iterable:v1"
      capabilities: "beam:coder:windowed_value:v1"
      capabilities: "beam:coder:global_window:v1"
      capabilities: "beam:coder:interval_window:v1"
      capabilities: "beam:coder:row:v1"
      dependencies: <
        type_urn: "beam:artifact:type:file:v1"
        role_urn: "beam:artifact:role:go_worker_binary:v1"
      >
    >
  >
>
root_transform_ids: "e4"
root_transform_ids: "s1"
root_transform_ids: "e5"
root_transform_ids: "s3"
requirements: "beam:requirement:pardo:splittable_dofn:v1"
2022/02/10 00:39:37 Cross-compiling <https://ci-beam.apache.org/job/beam_PostCommit_XVR_Samza/ws/src/sdks/go/test/integration/io/xlang/kafka/kafka_test.go> as /tmp/worker-2-1644453577837619759
2022/02/10 00:39:39 Prepared job with id: go-testkafkaio_basicreadwrite_91648ffd-8c3e-4131-9b21-5dfeb125321c and staging token: go-testkafkaio_basicreadwrite_91648ffd-8c3e-4131-9b21-5dfeb125321c
2022/02/10 00:39:39 Staged binary artifact with token: 
2022/02/10 00:39:39 Submitted job: go0testkafkaio0basicreadwrite-jenkins-0210003939-c2d0044a_7274426b-2c85-4d9f-8c70-d6091a7df343
2022/02/10 00:39:39 Job state: STOPPED
2022/02/10 00:39:39 Job state: STARTING
2022/02/10 00:39:39 Job state: RUNNING
2022/02/10 00:39:54 Job state: DONE
--- PASS: TestKafkaIO_BasicReadWrite (54.39s)
PASS
ok  	github.com/apache/beam/sdks/v2/go/test/integration/io/xlang/kafka	57.477s
FAIL
$ TEST_EXIT_CODE=0
$ cd ../..
$ exit 1
$ exit 1

> Task :runners:samza:job-server:validatesCrossLanguageRunnerGoUsingJava FAILED
> Task :runners:samza:job-server:validatesCrossLanguageRunnerJavaUsingJava
> Task :runners:samza:job-server:validatesCrossLanguageRunnerJavaUsingPython
> Task :runners:samza:job-server:validatesCrossLanguageRunnerJavaUsingPythonOnly

> Task :runners:samza:job-server:validatesCrossLanguageRunnerPythonUsingJava
>>> RUNNING integration tests with pipeline options: --runner=PortableRunner --job_endpoint=localhost:39251 --environment_cache_millis=10000 --experiments=beam_fn_api
>>>   pytest options: 
>>>   collect markers: -m=xlang_transforms
============================= test session starts ==============================
platform linux -- Python 3.6.15, pytest-4.6.11, py-1.11.0, pluggy-0.13.1
rootdir: <https://ci-beam.apache.org/job/beam_PostCommit_XVR_Samza/ws/src/sdks/python,> inifile: pytest.ini
plugins: xdist-1.34.0, timeout-1.4.2, forked-1.4.0, requests-mock-1.9.3
timeout: 600.0s
timeout method: signal
timeout func_only: False
collected 5207 items / 5197 deselected / 10 selected

apache_beam/io/external/generate_sequence_test.py ...                    [ 30%]
apache_beam/transforms/validate_runner_xlang_test.py .......             [100%]

=============================== warnings summary ===============================
apache_beam/io/filesystems_test.py:54
  <https://ci-beam.apache.org/job/beam_PostCommit_XVR_Samza/ws/src/sdks/python/apache_beam/io/filesystems_test.py>:54: DeprecationWarning: invalid escape sequence \c
    self.assertIsNone(FileSystems.get_scheme('c:\\abc\cdf'))  # pylint: disable=anomalous-backslash-in-string

apache_beam/io/filesystems_test.py:62
  <https://ci-beam.apache.org/job/beam_PostCommit_XVR_Samza/ws/src/sdks/python/apache_beam/io/filesystems_test.py>:62: DeprecationWarning: invalid escape sequence \d
    self.assertTrue(isinstance(FileSystems.get_filesystem('c:\\abc\def'),  # pylint: disable=anomalous-backslash-in-string

-- Docs: https://docs.pytest.org/en/latest/warnings.html
- generated xml file: <https://ci-beam.apache.org/job/beam_PostCommit_XVR_Samza/ws/src/sdks/python/pytest_xlangValidateRunner.xml> -
=========== 10 passed, 5197 deselected, 2 warnings in 125.78 seconds ===========

> Task :runners:samza:job-server:validatesCrossLanguageRunnerPythonUsingPython
>>> RUNNING integration tests with pipeline options: --runner=PortableRunner --job_endpoint=localhost:39251 --environment_cache_millis=10000 --experiments=beam_fn_api
>>>   pytest options: 
>>>   collect markers: -m=xlang_transforms
============================= test session starts ==============================
platform linux -- Python 3.6.15, pytest-4.6.11, py-1.11.0, pluggy-0.13.1
rootdir: <https://ci-beam.apache.org/job/beam_PostCommit_XVR_Samza/ws/src/sdks/python,> inifile: pytest.ini
plugins: xdist-1.34.0, timeout-1.4.2, forked-1.4.0, requests-mock-1.9.3
timeout: 600.0s
timeout method: signal
timeout func_only: False
collected 5207 items / 5197 deselected / 10 selected

apache_beam/io/external/generate_sequence_test.py .ss                    [ 30%]
apache_beam/transforms/validate_runner_xlang_test.py .......             [100%]

- generated xml file: <https://ci-beam.apache.org/job/beam_PostCommit_XVR_Samza/ws/src/sdks/python/pytest_xlangValidateRunner.xml> -
============ 8 passed, 2 skipped, 5197 deselected in 58.32 seconds =============

> Task :runners:samza:job-server:validatesCrossLanguageRunnerPythonUsingSql
>>> RUNNING integration tests with pipeline options: --runner=PortableRunner --job_endpoint=localhost:39251 --environment_cache_millis=10000 --experiments=beam_fn_api
>>>   pytest options: 
>>>   collect markers: -m=xlang_sql_expansion_service
============================= test session starts ==============================
platform linux -- Python 3.6.15, pytest-4.6.11, py-1.11.0, pluggy-0.13.1
rootdir: <https://ci-beam.apache.org/job/beam_PostCommit_XVR_Samza/ws/src/sdks/python,> inifile: pytest.ini
plugins: xdist-1.34.0, timeout-1.4.2, forked-1.4.0, requests-mock-1.9.3
timeout: 600.0s
timeout method: signal
timeout func_only: False
collected 5207 items / 5198 deselected / 9 selected

apache_beam/transforms/sql_test.py .........                             [100%]

- generated xml file: <https://ci-beam.apache.org/job/beam_PostCommit_XVR_Samza/ws/src/sdks/python/pytest_xlangSqlValidateRunner.xml> -
================= 9 passed, 5198 deselected in 234.98 seconds ==================

> Task :runners:samza:job-server:validatesCrossLanguageRunnerCleanup
Stopping expansion service pid: 98229.
Stopping expansion service pid: 98230.

> Task :runners:samza:job-server:samzaJobServerCleanup
Stopping job server pid: 81629.

FAILURE: Build failed with an exception.

* Where:
Build file '<https://ci-beam.apache.org/job/beam_PostCommit_XVR_Samza/ws/src/sdks/go/test/build.gradle'> line: 176

* What went wrong:
Execution failed for task ':runners:samza:job-server:validatesCrossLanguageRunnerGoUsingJava'.
> Process 'command 'sh'' finished with non-zero exit value 1

* Try:
> Run with --stacktrace option to get the stack trace.
> Run with --info or --debug option to get more log output.
> Run with --scan to get full insights.

* Get more help at https://help.gradle.org

Deprecated Gradle features were used in this build, making it incompatible with Gradle 8.0.

You can use '--warning-mode all' to show the individual deprecation warnings and determine if they come from your own scripts or plugins.

See https://docs.gradle.org/7.3.2/userguide/command_line_interface.html#sec:command_line_warnings

Execution optimizations have been disabled for 1 invalid unit(s) of work during this build to ensure correctness.
Please consult deprecation warnings for more details.

BUILD FAILED in 42m 24s
246 actionable tasks: 202 executed, 35 from cache, 9 up-to-date

Publishing build scan...
https://gradle.com/s/zxh467lwcldg6

Build step 'Invoke Gradle script' changed build result to FAILURE
Build step 'Invoke Gradle script' marked build as failure

---------------------------------------------------------------------
To unsubscribe, e-mail: builds-unsubscribe@beam.apache.org
For additional commands, e-mail: builds-help@beam.apache.org


Jenkins build is back to normal : beam_PostCommit_XVR_Samza #817

Posted by Apache Jenkins Server <je...@builds.apache.org>.
See <https://ci-beam.apache.org/job/beam_PostCommit_XVR_Samza/817/display/redirect?page=changes>


---------------------------------------------------------------------
To unsubscribe, e-mail: builds-unsubscribe@beam.apache.org
For additional commands, e-mail: builds-help@beam.apache.org


Build failed in Jenkins: beam_PostCommit_XVR_Samza #816

Posted by Apache Jenkins Server <je...@builds.apache.org>.
See <https://ci-beam.apache.org/job/beam_PostCommit_XVR_Samza/816/display/redirect?page=changes>

Changes:

[benjamin.gonzalez] [BEAM-12672] Retry flaky tests

[benjamin.gonzalez] [BEAM-12672] Fix spotlessApply

[laraschmidt] Fixing the log line to properly handle a large allowed skew.

[n] BEAM-13159 Update embedded-redis dependency

[n] address comments

[noreply] Minor: Add 2.38.0 section to CHANGES.md (#16804)

[noreply] [BEAM-12000] Fix typo in portable Python job definition (#16812)

[noreply] [BEAM-12164]: Fixes SpannerChangeStreamIT (#16806)

[noreply] [BEAM-12572] Fix failures in python examples tests (#16781)

[noreply] [BEAM-13921] filter out debeziumIO test for spark runner (#16815)

[noreply] [BEAM-13855] Skip SpannerChangeStreamOrderedWithinKeyIT and


------------------------------------------
[...truncated 720.70 KB...]
            | beam.Map(lambda v: beam.window.TimestampedValue(v, v.id)).
            with_output_types(SimpleRow)
            | beam.WindowInto(
                beam.window.FixedWindows(10)).with_output_types(SimpleRow)
            | SqlTransform("SELECT COUNT(*) as `count` FROM PCOLLECTION"))
>       assert_that(out, equal_to([(1, ), (1, ), (1, )]))

apache_beam/transforms/sql_test.py:175: 
_ _ _ _ _ _ _ _ _ _ _ _ _ _ _ _ _ _ _ _ _ _ _ _ _ _ _ _ _ _ _ _ _ _ _ _ _ _ _ _ 
apache_beam/pipeline.py:596: in __exit__
    self.result = self.run()
apache_beam/testing/test_pipeline.py:114: in run
    False if self.not_use_test_runner_api else test_runner_api))
apache_beam/pipeline.py:573: in run
    return self.runner.run_pipeline(self, self._options)
apache_beam/runners/portability/portable_runner.py:438: in run_pipeline
    job_service_handle = self.create_job_service(options)
apache_beam/runners/portability/portable_runner.py:317: in create_job_service
    return self.create_job_service_handle(server.start(), options)
apache_beam/runners/portability/job_server.py:54: in start
    grpc.channel_ready_future(channel).result(timeout=self._timeout)
../../build/gradleenv/1922375555/lib/python3.6/site-packages/grpc/_utilities.py:139: in result
    self._block(timeout)
_ _ _ _ _ _ _ _ _ _ _ _ _ _ _ _ _ _ _ _ _ _ _ _ _ _ _ _ _ _ _ _ _ _ _ _ _ _ _ _ 

self = <grpc._utilities._ChannelReadyFuture object at 0x7f17241aef60>
timeout = 60

    def _block(self, timeout):
        until = None if timeout is None else time.time() + timeout
        with self._condition:
            while True:
                if self._cancelled:
                    raise grpc.FutureCancelledError()
                elif self._matured:
                    return
                else:
                    if until is None:
                        self._condition.wait()
                    else:
                        remaining = until - time.time()
                        if remaining < 0:
>                           raise grpc.FutureTimeoutError()
E                           grpc.FutureTimeoutError

../../build/gradleenv/1922375555/lib/python3.6/site-packages/grpc/_utilities.py:85: FutureTimeoutError
----------------------------- Captured stderr call -----------------------------
WARNING:root:Waiting for grpc channel to be ready at localhost:38667.
WARNING:root:Waiting for grpc channel to be ready at localhost:38667.
WARNING:root:Waiting for grpc channel to be ready at localhost:38667.
WARNING:root:Waiting for grpc channel to be ready at localhost:38667.
WARNING:root:Waiting for grpc channel to be ready at localhost:38667.
WARNING:root:Make sure that locally built Python SDK docker image has Python 3.6 interpreter.
WARNING:root:Make sure that locally built Python SDK docker image has Python 3.6 interpreter.
------------------------------ Captured log call -------------------------------
WARNING  root:subprocess_server.py:98 Waiting for grpc channel to be ready at localhost:38667.
WARNING  root:subprocess_server.py:98 Waiting for grpc channel to be ready at localhost:38667.
WARNING  root:subprocess_server.py:98 Waiting for grpc channel to be ready at localhost:38667.
WARNING  root:subprocess_server.py:98 Waiting for grpc channel to be ready at localhost:38667.
WARNING  root:subprocess_server.py:98 Waiting for grpc channel to be ready at localhost:38667.
WARNING  root:environments.py:374 Make sure that locally built Python SDK docker image has Python 3.6 interpreter.
WARNING  root:environments.py:374 Make sure that locally built Python SDK docker image has Python 3.6 interpreter.
_________________ SqlTransformTest.test_zetasql_generate_data __________________

self = <apache_beam.transforms.sql_test.SqlTransformTest testMethod=test_zetasql_generate_data>

    def test_zetasql_generate_data(self):
      with TestPipeline() as p:
        out = p | SqlTransform(
            """SELECT
              CAST(1 AS INT64) AS `int`,
              CAST('foo' AS STRING) AS `str`,
              CAST(3.14  AS FLOAT64) AS `flt`""",
            dialect="zetasql")
>       assert_that(out, equal_to([(1, "foo", 3.14)]))

apache_beam/transforms/sql_test.py:160: 
_ _ _ _ _ _ _ _ _ _ _ _ _ _ _ _ _ _ _ _ _ _ _ _ _ _ _ _ _ _ _ _ _ _ _ _ _ _ _ _ 
apache_beam/pipeline.py:596: in __exit__
    self.result = self.run()
apache_beam/testing/test_pipeline.py:114: in run
    False if self.not_use_test_runner_api else test_runner_api))
apache_beam/pipeline.py:573: in run
    return self.runner.run_pipeline(self, self._options)
apache_beam/runners/portability/portable_runner.py:438: in run_pipeline
    job_service_handle = self.create_job_service(options)
apache_beam/runners/portability/portable_runner.py:317: in create_job_service
    return self.create_job_service_handle(server.start(), options)
apache_beam/runners/portability/job_server.py:54: in start
    grpc.channel_ready_future(channel).result(timeout=self._timeout)
../../build/gradleenv/1922375555/lib/python3.6/site-packages/grpc/_utilities.py:139: in result
    self._block(timeout)
_ _ _ _ _ _ _ _ _ _ _ _ _ _ _ _ _ _ _ _ _ _ _ _ _ _ _ _ _ _ _ _ _ _ _ _ _ _ _ _ 

self = <grpc._utilities._ChannelReadyFuture object at 0x7f172a8c3358>
timeout = 60

    def _block(self, timeout):
        until = None if timeout is None else time.time() + timeout
        with self._condition:
            while True:
                if self._cancelled:
                    raise grpc.FutureCancelledError()
                elif self._matured:
                    return
                else:
                    if until is None:
                        self._condition.wait()
                    else:
                        remaining = until - time.time()
                        if remaining < 0:
>                           raise grpc.FutureTimeoutError()
E                           grpc.FutureTimeoutError

../../build/gradleenv/1922375555/lib/python3.6/site-packages/grpc/_utilities.py:85: FutureTimeoutError
----------------------------- Captured stderr call -----------------------------
WARNING:root:Waiting for grpc channel to be ready at localhost:55611.
WARNING:root:Waiting for grpc channel to be ready at localhost:55611.
WARNING:root:Waiting for grpc channel to be ready at localhost:55611.
WARNING:root:Waiting for grpc channel to be ready at localhost:55611.
WARNING:root:Make sure that locally built Python SDK docker image has Python 3.6 interpreter.
WARNING:root:Make sure that locally built Python SDK docker image has Python 3.6 interpreter.
------------------------------ Captured log call -------------------------------
WARNING  root:subprocess_server.py:98 Waiting for grpc channel to be ready at localhost:55611.
WARNING  root:subprocess_server.py:98 Waiting for grpc channel to be ready at localhost:55611.
WARNING  root:subprocess_server.py:98 Waiting for grpc channel to be ready at localhost:55611.
WARNING  root:subprocess_server.py:98 Waiting for grpc channel to be ready at localhost:55611.
WARNING  root:environments.py:374 Make sure that locally built Python SDK docker image has Python 3.6 interpreter.
WARNING  root:environments.py:374 Make sure that locally built Python SDK docker image has Python 3.6 interpreter.
- generated xml file: <https://ci-beam.apache.org/job/beam_PostCommit_XVR_Samza/ws/src/sdks/python/pytest_xlangSqlValidateRunner.xml> -
================= 9 failed, 5198 deselected in 1065.85 seconds =================

> Task :runners:samza:job-server:validatesCrossLanguageRunnerPythonUsingSql FAILED

> Task :runners:samza:job-server:validatesCrossLanguageRunnerCleanup
Stopping expansion service pid: 2633163.
Stopping expansion service pid: 2633164.

> Task :runners:samza:job-server:samzaJobServerCleanup
Stopping job server pid: 2601997.

FAILURE: Build completed with 7 failures.

1: Task failed with an exception.
-----------
* Where:
Build file '<https://ci-beam.apache.org/job/beam_PostCommit_XVR_Samza/ws/src/sdks/go/test/build.gradle'> line: 176

* What went wrong:
Execution failed for task ':runners:samza:job-server:validatesCrossLanguageRunnerGoUsingJava'.
> Process 'command 'sh'' finished with non-zero exit value 1

* Try:
> Run with --stacktrace option to get the stack trace.
> Run with --info or --debug option to get more log output.
> Run with --scan to get full insights.
==============================================================================

2: Task failed with an exception.
-----------
* What went wrong:
Execution failed for task ':runners:samza:job-server:validatesCrossLanguageRunnerJavaUsingJava'.
> There were failing tests. See the report at: file://<https://ci-beam.apache.org/job/beam_PostCommit_XVR_Samza/ws/src/runners/samza/job-server/build/reports/tests/validatesCrossLanguageRunnerJavaUsingJava/index.html>

* Try:
> Run with --stacktrace option to get the stack trace.
> Run with --info or --debug option to get more log output.
> Run with --scan to get full insights.
==============================================================================

3: Task failed with an exception.
-----------
* What went wrong:
Execution failed for task ':runners:samza:job-server:validatesCrossLanguageRunnerJavaUsingPython'.
> There were failing tests. See the report at: file://<https://ci-beam.apache.org/job/beam_PostCommit_XVR_Samza/ws/src/runners/samza/job-server/build/reports/tests/validatesCrossLanguageRunnerJavaUsingPython/index.html>

* Try:
> Run with --stacktrace option to get the stack trace.
> Run with --info or --debug option to get more log output.
> Run with --scan to get full insights.
==============================================================================

4: Task failed with an exception.
-----------
* What went wrong:
Execution failed for task ':runners:samza:job-server:validatesCrossLanguageRunnerJavaUsingPythonOnly'.
> There were failing tests. See the report at: file://<https://ci-beam.apache.org/job/beam_PostCommit_XVR_Samza/ws/src/runners/samza/job-server/build/reports/tests/validatesCrossLanguageRunnerJavaUsingPythonOnly/index.html>

* Try:
> Run with --stacktrace option to get the stack trace.
> Run with --info or --debug option to get more log output.
> Run with --scan to get full insights.
==============================================================================

5: Task failed with an exception.
-----------
* What went wrong:
Execution failed for task ':runners:samza:job-server:validatesCrossLanguageRunnerPythonUsingJava'.
> Process 'command 'sh'' finished with non-zero exit value 1

* Try:
> Run with --stacktrace option to get the stack trace.
> Run with --info or --debug option to get more log output.
> Run with --scan to get full insights.
==============================================================================

6: Task failed with an exception.
-----------
* What went wrong:
Execution failed for task ':runners:samza:job-server:validatesCrossLanguageRunnerPythonUsingPython'.
> Process 'command 'sh'' finished with non-zero exit value 1

* Try:
> Run with --stacktrace option to get the stack trace.
> Run with --info or --debug option to get more log output.
> Run with --scan to get full insights.
==============================================================================

7: Task failed with an exception.
-----------
* What went wrong:
Execution failed for task ':runners:samza:job-server:validatesCrossLanguageRunnerPythonUsingSql'.
> Process 'command 'sh'' finished with non-zero exit value 1

* Try:
> Run with --stacktrace option to get the stack trace.
> Run with --info or --debug option to get more log output.
> Run with --scan to get full insights.
==============================================================================

* Get more help at https://help.gradle.org

Deprecated Gradle features were used in this build, making it incompatible with Gradle 8.0.

You can use '--warning-mode all' to show the individual deprecation warnings and determine if they come from your own scripts or plugins.

See https://docs.gradle.org/7.3.2/userguide/command_line_interface.html#sec:command_line_warnings

Execution optimizations have been disabled for 1 invalid unit(s) of work during this build to ensure correctness.
Please consult deprecation warnings for more details.

BUILD FAILED in 54m 3s
246 actionable tasks: 201 executed, 36 from cache, 9 up-to-date

Publishing build scan...
https://gradle.com/s/wfftl4fmunk76

Build step 'Invoke Gradle script' changed build result to FAILURE
Build step 'Invoke Gradle script' marked build as failure

---------------------------------------------------------------------
To unsubscribe, e-mail: builds-unsubscribe@beam.apache.org
For additional commands, e-mail: builds-help@beam.apache.org


Build failed in Jenkins: beam_PostCommit_XVR_Samza #815

Posted by Apache Jenkins Server <je...@builds.apache.org>.
See <https://ci-beam.apache.org/job/beam_PostCommit_XVR_Samza/815/display/redirect?page=changes>

Changes:

[noreply] Minor: Add 2.38.0 section to CHANGES.md (#16804)


------------------------------------------
[...truncated 116.61 KB...]
Collecting cryptography>=36.0.0
  Using cached cryptography-36.0.1-cp36-abi3-manylinux_2_24_x86_64.whl (3.6 MB)
Collecting azure-storage-blob>=12.3.2
  Using cached azure_storage_blob-12.9.0-py2.py3-none-any.whl (356 kB)
Collecting azure-core>=1.7.0
  Using cached azure_core-1.22.1-py3-none-any.whl (178 kB)
Requirement already satisfied: six>=1.11.0 in /home/jenkins/jenkins-slave/workspace/beam_PostCommit_XVR_Samza/src/build/gradleenv/1922375555/lib/python3.6/site-packages (from azure-core>=1.7.0->apache-beam==2.38.0.dev0) (1.16.0)
Collecting msrest>=0.6.21
  Using cached msrest-0.6.21-py2.py3-none-any.whl (85 kB)
Collecting s3transfer<0.6.0,>=0.5.0
  Using cached s3transfer-0.5.1-py3-none-any.whl (79 kB)
Collecting botocore<1.24.0,>=1.23.52
  Using cached botocore-1.23.52-py3-none-any.whl (8.5 MB)
Collecting jmespath<1.0.0,>=0.7.1
  Using cached jmespath-0.10.0-py2.py3-none-any.whl (24 kB)
Collecting cffi>=1.12
  Using cached cffi-1.15.0-cp36-cp36m-manylinux_2_5_x86_64.manylinux1_x86_64.whl (405 kB)
Collecting fasteners>=0.14
  Using cached fasteners-0.17.3-py3-none-any.whl (18 kB)
Collecting rsa<5,>=3.1.4
  Using cached rsa-4.8-py3-none-any.whl (39 kB)
Collecting pyasn1-modules>=0.2.1
  Using cached pyasn1_modules-0.2.8-py2.py3-none-any.whl (155 kB)
Collecting google-resumable-media<3.0dev,>=0.6.0
  Using cached google_resumable_media-2.2.1-py2.py3-none-any.whl (75 kB)
Collecting google-api-core[grpc]<3.0.0dev,>=1.29.0
  Using cached google_api_core-2.5.0-py2.py3-none-any.whl (111 kB)
Requirement already satisfied: packaging>=14.3 in /home/jenkins/jenkins-slave/workspace/beam_PostCommit_XVR_Samza/src/build/gradleenv/1922375555/lib/python3.6/site-packages (from google-cloud-bigquery<3,>=1.6.0->apache-beam==2.38.0.dev0) (21.3)
Collecting libcst>=0.2.5
  Using cached libcst-0.4.1-cp36-cp36m-manylinux_2_17_x86_64.manylinux2014_x86_64.whl (2.7 MB)
Collecting grpc-google-iam-v1<0.13dev,>=0.12.3
  Using cached grpc_google_iam_v1-0.12.3-py3-none-any.whl
Collecting google-api-core[grpc]<3.0.0dev,>=1.29.0
  Using cached google_api_core-1.31.5-py2.py3-none-any.whl (93 kB)
Collecting google-auth<3,>=1.18.0
  Using cached google_auth-1.35.0-py2.py3-none-any.whl (152 kB)
Requirement already satisfied: setuptools>=40.3.0 in /home/jenkins/jenkins-slave/workspace/beam_PostCommit_XVR_Samza/src/build/gradleenv/1922375555/lib/python3.6/site-packages (from google-auth<3,>=1.18.0->apache-beam==2.38.0.dev0) (59.6.0)
Collecting overrides<7.0.0,>=6.0.1
  Using cached overrides-6.1.0-py3-none-any.whl (14 kB)
Collecting grpcio-status>=1.18.0
  Using cached grpcio_status-1.43.0-py3-none-any.whl (10.0 kB)
Collecting docopt
  Using cached docopt-0.6.2-py2.py3-none-any.whl
Collecting pyparsing<3,>=2.4.2
  Using cached pyparsing-2.4.7-py2.py3-none-any.whl (67 kB)
Collecting pbr>=0.11
  Using cached pbr-5.8.1-py2.py3-none-any.whl (113 kB)
Collecting pyasn1>=0.1.7
  Using cached pyasn1-0.4.8-py2.py3-none-any.whl (77 kB)
Collecting atomicwrites>=1.0
  Using cached atomicwrites-1.4.0-py2.py3-none-any.whl (6.8 kB)
Collecting attrs>=17.4.0
  Using cached attrs-21.4.0-py2.py3-none-any.whl (60 kB)
Collecting pluggy<1.0,>=0.12
  Using cached pluggy-0.13.1-py2.py3-none-any.whl (18 kB)
Requirement already satisfied: importlib-metadata>=0.12 in /home/jenkins/jenkins-slave/workspace/beam_PostCommit_XVR_Samza/src/build/gradleenv/1922375555/lib/python3.6/site-packages (from pytest<5.0,>=4.4.0->apache-beam==2.38.0.dev0) (2.1.3)
Collecting more-itertools>=4.0.0
  Using cached more_itertools-8.12.0-py3-none-any.whl (54 kB)
Requirement already satisfied: py>=1.5.0 in /home/jenkins/jenkins-slave/workspace/beam_PostCommit_XVR_Samza/src/build/gradleenv/1922375555/lib/python3.6/site-packages (from pytest<5.0,>=4.4.0->apache-beam==2.38.0.dev0) (1.11.0)
Collecting wcwidth
  Using cached wcwidth-0.2.5-py2.py3-none-any.whl (30 kB)
Collecting execnet>=1.1
  Using cached execnet-1.9.0-py2.py3-none-any.whl (39 kB)
Collecting pytest-forked
  Using cached pytest_forked-1.4.0-py3-none-any.whl (4.9 kB)
Collecting charset-normalizer~=2.0.0
  Using cached charset_normalizer-2.0.11-py3-none-any.whl (39 kB)
Collecting idna<4,>=2.5
  Using cached idna-3.3-py3-none-any.whl (61 kB)
Collecting certifi>=2017.4.17
  Using cached certifi-2021.10.8-py2.py3-none-any.whl (149 kB)
Collecting urllib3<1.27,>=1.21.1
  Using cached urllib3-1.26.8-py2.py3-none-any.whl (138 kB)
Collecting greenlet!=0.4.17
  Using cached greenlet-1.1.2-cp36-cp36m-manylinux_2_17_x86_64.manylinux2014_x86_64.whl (147 kB)
Collecting wrapt
  Using cached wrapt-1.13.3-cp36-cp36m-manylinux_2_5_x86_64.manylinux1_x86_64.manylinux_2_12_x86_64.manylinux2010_x86_64.whl (78 kB)
Collecting docker
  Using cached docker-5.0.3-py2.py3-none-any.whl (146 kB)
Collecting deprecation
  Using cached deprecation-2.1.0-py2.py3-none-any.whl (11 kB)
Collecting pymysql
  Using cached PyMySQL-1.0.2-py3-none-any.whl (43 kB)
Collecting pycparser
  Using cached pycparser-2.21-py2.py3-none-any.whl (118 kB)
Collecting googleapis-common-protos<2.0dev,>=1.6.0
  Using cached googleapis_common_protos-1.54.0-py2.py3-none-any.whl (207 kB)
Collecting google-crc32c<2.0dev,>=1.0
  Using cached google_crc32c-1.3.0-cp36-cp36m-manylinux_2_12_x86_64.manylinux2010_x86_64.whl (37 kB)
Requirement already satisfied: zipp>=0.5 in /home/jenkins/jenkins-slave/workspace/beam_PostCommit_XVR_Samza/src/build/gradleenv/1922375555/lib/python3.6/site-packages (from importlib-metadata>=0.12->pytest<5.0,>=4.4.0->apache-beam==2.38.0.dev0) (3.6.0)
Collecting typing-inspect>=0.4.0
  Using cached typing_inspect-0.7.1-py3-none-any.whl (8.4 kB)
Collecting requests-oauthlib>=0.5.0
  Using cached requests_oauthlib-1.3.1-py2.py3-none-any.whl (23 kB)
Collecting isodate>=0.6.0
  Using cached isodate-0.6.1-py2.py3-none-any.whl (41 kB)
Collecting typing-utils>=0.0.3
  Using cached typing_utils-0.1.0-py3-none-any.whl (10 kB)
Collecting websocket-client>=0.32.0
  Using cached websocket_client-1.2.3-py3-none-any.whl (53 kB)
Collecting oauthlib>=3.0.0
  Using cached oauthlib-3.2.0-py3-none-any.whl (151 kB)
Collecting mypy-extensions>=0.3.0
  Using cached mypy_extensions-0.4.3-py2.py3-none-any.whl (4.5 kB)
Building wheels for collected packages: apache-beam
  Building wheel for apache-beam (setup.py): started
  Building wheel for apache-beam (setup.py): finished with status 'done'
  Created wheel for apache-beam: filename=apache_beam-2.38.0.dev0-py3-none-any.whl size=2656759 sha256=2992179be053b2166f8dc07051f25a35b75f60c2e2a15c4a86e5a72f5a1c704d
  Stored in directory: /home/jenkins/.cache/pip/wheels/4b/af/e7/2175c695282fc2a09225c688382dde75a9538796773a5684e2
Successfully built apache-beam
Installing collected packages: pyasn1, urllib3, rsa, pyparsing, pyasn1-modules, idna, charset-normalizer, certifi, cachetools, typing-extensions, requests, pytz, mypy-extensions, googleapis-common-protos, google-auth, websocket-client, wcwidth, typing-inspect, pyyaml, python-dateutil, pycparser, pluggy, oauthlib, more-itertools, jmespath, google-api-core, dataclasses, attrs, atomicwrites, wrapt, typing-utils, requests-oauthlib, pytest, proto-plus, numpy, libcst, isodate, httplib2, grpcio-gcp, grpc-google-iam-v1, greenlet, google-crc32c, docopt, docker, deprecation, cffi, botocore, testcontainers, sqlalchemy, s3transfer, pytest-forked, pymysql, pymongo, pydot, pyarrow, pbr, overrides, orjson, oauth2client, msrest, hdfs, grpcio-status, google-resumable-media, google-cloud-pubsub, google-cloud-core, fasteners, fastavro, execnet, dill, cryptography, crcmod, cloudpickle, azure-core, tenacity, requests-mock, pytest-xdist, pytest-timeout, pyhamcrest, psycopg2-binary, parameterized, pandas, mock, google-cloud-vision, google-cloud-videointelligence, google-cloud-spanner, google-cloud-recommendations-ai, google-cloud-pubsublite, google-cloud-language, google-cloud-dlp, google-cloud-datastore, google-cloud-bigtable, google-cloud-bigquery-storage, google-cloud-bigquery, google-apitools, freezegun, boto3, azure-storage-blob, apache-beam
  Attempting uninstall: pyparsing
    Found existing installation: pyparsing 3.0.7
    Uninstalling pyparsing-3.0.7:
      Successfully uninstalled pyparsing-3.0.7
  Attempting uninstall: pluggy
    Found existing installation: pluggy 1.0.0
    Uninstalling pluggy-1.0.0:
      Successfully uninstalled pluggy-1.0.0

> Task :release:go-licenses:java:dockerRun
+ go-licenses save github.com/apache/beam/sdks/java/container --save_path=/output/licenses
+ go-licenses csv github.com/apache/beam/sdks/java/container
+ tee /output/licenses/list.csv
github.com/apache/beam/sdks/java/container,https://github.com/apache/beam/blob/master/LICENSE,Apache-2.0
google.golang.org/genproto/googleapis/rpc/status,https://github.com/googleapis/go-genproto/blob/master/LICENSE,Apache-2.0
golang.org/x/text,https://go.googlesource.com/text/+/refs/heads/master/LICENSE,BSD-3-Clause
golang.org/x/sys,https://go.googlesource.com/sys/+/refs/heads/master/LICENSE,BSD-3-Clause
github.com/apache/beam/sdks/go/pkg/beam,https://github.com/apache/beam/blob/master/sdks/go/README.md,Apache-2.0
google.golang.org/grpc,https://github.com/grpc/grpc-go/blob/master/LICENSE,Apache-2.0
golang.org/x/net,https://go.googlesource.com/net/+/refs/heads/master/LICENSE,BSD-3-Clause
github.com/golang/protobuf,https://github.com/golang/protobuf/blob/master/LICENSE,BSD-3-Clause
google.golang.org/protobuf,https://go.googlesource.com/protobuf/+/refs/heads/master/LICENSE,BSD-3-Clause
+ chmod -R a+w /output/licenses

> Task :release:go-licenses:java:createLicenses
> Task :sdks:java:container:java8:copyGolangLicenses
> Task :sdks:java:container:java8:dockerPrepare

> Task :sdks:java:container:java8:docker
Removing intermediate container 781d0dffd520
 ---> d0784ef4acd1
Step 4/19 : ARG pull_licenses
 ---> Running in 45cae84cc2f3
Removing intermediate container 45cae84cc2f3
 ---> 447800c10872
Step 5/19 : ADD target/slf4j-api.jar /opt/apache/beam/jars/
 ---> ae48bbd56fc6
Step 6/19 : ADD target/slf4j-jdk14.jar /opt/apache/beam/jars/
 ---> 36f5b7629532
Step 7/19 : ADD target/beam-sdks-java-harness.jar /opt/apache/beam/jars/
 ---> 944dda632bdd
Step 8/19 : ADD target/beam-sdks-java-io-kafka.jar /opt/apache/beam/jars/
 ---> 138803b04c67
Step 9/19 : ADD target/kafka-clients.jar /opt/apache/beam/jars/
 ---> 0ff8b90ea8d8
Step 10/19 : ADD target/jamm.jar /opt/apache/beam/jars/
 ---> cd3f7a0cc147
Step 11/19 : ADD target/linux_amd64/boot /opt/apache/beam/
 ---> 504cdf8ae458
Step 12/19 : COPY target/LICENSE /opt/apache/beam/
 ---> 670c36acb246
Step 13/19 : COPY target/NOTICE /opt/apache/beam/
 ---> 1cbda4d0b999
Step 14/19 : ADD target/third_party_licenses /opt/apache/beam/third_party_licenses/
 ---> 3db1f92c8670
Step 15/19 : COPY target/LICENSE target/go-licenses/* /opt/apache/beam/third_party_licenses/golang/
 ---> ba5efa6beaca
Step 16/19 : RUN rm /opt/apache/beam/third_party_licenses/golang/LICENSE
 ---> Running in ebe573dc4658
Removing intermediate container ebe573dc4658
 ---> 3a8b98bf0510
Step 17/19 : RUN if [ "${pull_licenses}" = "false" ] ; then     rm -rf /opt/apache/beam/third_party_licenses ;    fi
 ---> Running in 1b72e69c9aed
Removing intermediate container 1b72e69c9aed
 ---> a675ffd29dde
Step 18/19 : COPY target/profiler/* /opt/google_cloud_profiler/
 ---> 599ec60a21d3
Step 19/19 : ENTRYPOINT ["/opt/apache/beam/boot"]
 ---> Running in 89ca6d11d24a
Removing intermediate container 89ca6d11d24a
 ---> c8afdcad24ca
Successfully built c8afdcad24ca
Successfully tagged apache/beam_java8_sdk:2.38.0.dev

> Task :release:go-licenses:go:dockerRun
+ go-licenses save github.com/apache/beam/sdks/go/container --save_path=/output/licenses
+ go-licenses csv github.com/apache/beam/sdks/go/container
+ tee /output/licenses/list.csv
+ chmod -R a+w /output/licenses

> Task :release:go-licenses:go:createLicenses
> Task :sdks:go:container:copyGolangLicenses
> Task :sdks:go:container:dockerPrepare
> Task :sdks:go:container:docker

> Task :release:go-licenses:py:dockerRun
+ go-licenses save github.com/apache/beam/sdks/python/container --save_path=/output/licenses
+ go-licenses csv github.com/apache/beam/sdks/python/container
+ tee /output/licenses/list.csv
github.com/nightlyone/lockfile,https://github.com/nightlyone/lockfile/blob/master/LICENSE,MIT
github.com/apache/beam/sdks/python/container,https://github.com/apache/beam/blob/master/LICENSE,Apache-2.0
google.golang.org/grpc,https://github.com/grpc/grpc-go/blob/master/LICENSE,Apache-2.0
golang.org/x/net,https://go.googlesource.com/net/+/refs/heads/master/LICENSE,BSD-3-Clause
golang.org/x/sys,https://go.googlesource.com/sys/+/refs/heads/master/LICENSE,BSD-3-Clause
golang.org/x/text,https://go.googlesource.com/text/+/refs/heads/master/LICENSE,BSD-3-Clause
github.com/apache/beam/sdks/go/pkg/beam,https://github.com/apache/beam/blob/master/sdks/go/README.md,Apache-2.0
github.com/golang/protobuf,https://github.com/golang/protobuf/blob/master/LICENSE,BSD-3-Clause
google.golang.org/protobuf,https://go.googlesource.com/protobuf/+/refs/heads/master/LICENSE,BSD-3-Clause
google.golang.org/genproto/googleapis/rpc/status,https://github.com/googleapis/go-genproto/blob/master/LICENSE,Apache-2.0
+ chmod -R a+w /output/licenses

> Task :release:go-licenses:py:createLicenses
> Task :sdks:python:container:py36:copyGolangLicenses
> Task :sdks:python:container:py36:dockerPrepare
> Task :sdks:python:container:py36:docker
FATAL: command execution failed
java.io.IOException: Backing channel 'apache-beam-jenkins-6' is disconnected.
	at hudson.remoting.RemoteInvocationHandler.channelOrFail(RemoteInvocationHandler.java:216)
	at hudson.remoting.RemoteInvocationHandler.invoke(RemoteInvocationHandler.java:286)
	at com.sun.proxy.$Proxy133.isAlive(Unknown Source)
	at hudson.Launcher$RemoteLauncher$ProcImpl.isAlive(Launcher.java:1211)
	at hudson.Launcher$RemoteLauncher$ProcImpl.join(Launcher.java:1203)
	at hudson.Launcher$ProcStarter.join(Launcher.java:523)
	at hudson.plugins.gradle.Gradle.perform(Gradle.java:317)
	at hudson.tasks.BuildStepMonitor$1.perform(BuildStepMonitor.java:20)
	at hudson.model.AbstractBuild$AbstractBuildExecution.perform(AbstractBuild.java:803)
	at hudson.model.Build$BuildExecution.build(Build.java:197)
	at hudson.model.Build$BuildExecution.doRun(Build.java:163)
	at hudson.model.AbstractBuild$AbstractBuildExecution.run(AbstractBuild.java:513)
	at hudson.model.Run.execute(Run.java:1906)
	at hudson.model.FreeStyleBuild.run(FreeStyleBuild.java:43)
	at hudson.model.ResourceController.execute(ResourceController.java:97)
	at hudson.model.Executor.run(Executor.java:429)
Caused by: java.io.IOException: Unexpected termination of the channel
	at hudson.remoting.SynchronousCommandTransport$ReaderThread.run(SynchronousCommandTransport.java:75)
Caused by: java.io.EOFException
	at java.io.ObjectInputStream$PeekInputStream.readFully(ObjectInputStream.java:2799)
	at java.io.ObjectInputStream$BlockDataInputStream.readShort(ObjectInputStream.java:3274)
	at java.io.ObjectInputStream.readStreamHeader(ObjectInputStream.java:934)
	at java.io.ObjectInputStream.<init>(ObjectInputStream.java:396)
	at hudson.remoting.ObjectInputStreamEx.<init>(ObjectInputStreamEx.java:49)
	at hudson.remoting.Command.readFrom(Command.java:142)
	at hudson.remoting.Command.readFrom(Command.java:128)
	at hudson.remoting.AbstractSynchronousByteArrayCommandTransport.read(AbstractSynchronousByteArrayCommandTransport.java:35)
	at hudson.remoting.SynchronousCommandTransport$ReaderThread.run(SynchronousCommandTransport.java:61)
Build step 'Invoke Gradle script' changed build result to FAILURE
Build step 'Invoke Gradle script' marked build as failure
ERROR: apache-beam-jenkins-6 is offline; cannot locate jdk_1.8_latest

---------------------------------------------------------------------
To unsubscribe, e-mail: builds-unsubscribe@beam.apache.org
For additional commands, e-mail: builds-help@beam.apache.org


Build failed in Jenkins: beam_PostCommit_XVR_Samza #814

Posted by Apache Jenkins Server <je...@builds.apache.org>.
See <https://ci-beam.apache.org/job/beam_PostCommit_XVR_Samza/814/display/redirect>

Changes:


------------------------------------------
[...truncated 1.16 MB...]
    >
  >
  coders: <
    key: "rXpiInkeqDKvCoder2"
    value: <
      spec: <
        urn: "beam:coder:kv:v1"
      >
      component_coder_ids: "rXpiInkeqDVarIntCoder"
      component_coder_ids: "rXpiInkeqDSerializableCoder1"
    >
  >
  coders: <
    key: "rXpiInkeqDKvCoder3"
    value: <
      spec: <
        urn: "beam:coder:kv:v1"
      >
      component_coder_ids: "rXpiInkeqDVarIntCoder"
      component_coder_ids: "rXpiInkeqDTimestampedValueCoder"
    >
  >
  coders: <
    key: "rXpiInkeqDKvCoder4"
    value: <
      spec: <
        urn: "beam:coder:kv:v1"
      >
      component_coder_ids: "rXpiInkeqDVarIntCoder"
      component_coder_ids: "rXpiInkeqDIterableCoder"
    >
  >
  coders: <
    key: "rXpiInkeqDSerializableCoder"
    value: <
      spec: <
        urn: "beam:coders:javasdk:0.1"
        payload: "\202SNAPPY\000\000\000\000\001\000\000\000\001\000\000\000\312\241\002\360^\254\355\000\005sr\000,org.apache.beam.sdk.coders.SerializableCoder\010\364 \216\305ynl\002\000\001L\000\004typet\000\021Ljava/lang/Class;xr\000&ofV\000\024Custom\005P8j\260\010\235\013;\035\013\002\000\000xr\000 j\213\000\005/\034C\335\325\211\256\274~\370\001/\020pvr\000$N1\000\\io.BoundedSource!`v\023\177\370QA\0015\010r\000\035Z3\000\t,0\020\213\372\020Y\214\347\323\002\000\000xp"
      >
    >
  >
  coders: <
    key: "rXpiInkeqDSerializableCoder1"
    value: <
      spec: <
        urn: "beam:coders:javasdk:0.1"
        payload: "\202SNAPPY\000\000\000\000\001\000\000\000\001\000\000\000\312\214\002\360^\254\355\000\005sr\000,org.apache.beam.sdk.coders.SerializableCoder\010\364 \216\305ynl\002\000\001L\000\004typet\000\021Ljava/lang/Class;xr\000&ofV\000\024Custom\005P8j\260\010\235\013;\035\013\002\000\000xr\000 j\213\000\005/\034C\335\325\211\256\274~\370\001/\020pvr\000;N1\000Pio.BoundedReadFromUnb\t\021`Source$Shardd\236\240U\205\000j\363\002\000\000xp"
      >
    >
  >
  coders: <
    key: "rXpiInkeqDTimestampedValueCoder"
    value: <
      spec: <
        urn: "beam:coders:javasdk:0.1"
        payload: "\202SNAPPY\000\000\000\000\001\000\000\000\001\000\000\001?\315\003\270\254\355\000\005sr\000Aorg.apache.beam.sdk.values.TimestampedV\001\022\000$>\021\000LCoder\364\376\202p\274iX-\002\000\001L\000\nv\001)\005\030\034t\000\"Lorg/\t]\000/\001],/sdk/coders/\005$\020;xr\000*N\202\000\t%(.Structured\005/8s\277\022\016\325\3246\021\002\000\000xr\000 j9\000\005/\034C\335\325\211\256\274~\370\001/\020psr\000,j1\000(Serializabl\t\277\034\010\364 \216\305ynl\005\327\\\004typet\000\021Ljava/lang/Class\001\300\000&jV\000\024Custom\005\215Pj\260\010\235\013;\035\013\002\000\000xq\000~\000\003vr\000;N;\000Pio.BoundedReadFromUnb\t\021`Source$Shardd\236\240U\205\000j\363\002\000\000xp"
      >
    >
  >
  coders: <
    key: "rXpiInkeqDValueWithRecordIdCoder"
    value: <
      spec: <
        urn: "beam:coders:javasdk:0.1"
        payload: "\202SNAPPY\000\000\000\000\001\000\000\000\001\000\000\001h\364\004\320\254\355\000\005sr\000Corg.apache.beam.sdk.values.ValueWithRecordId$B\022\000LCoder{\343\376bQ\014\204>\002\000\002L\000\007i\t\025\034t\000+Lorg/\t\\\000/\001\\\024/sdk/c\0012(s/ByteArray\005B\014;L\000\n\005u\005\016\010t\000\"n;\000\005$\020;xr\000*N\274\000\t`(.Structured\005/8s\277\022\016\325\3246\021\002\000\000xr\000 j9\000\005/\034C\335\325\211\256\274~\370\001/\020psr\000)j1\0006\312\000\034\351\277\005|\263\3746\333\001:\010r\000&j8\000\024Atomic\005o\034\307\354\265\314\205tPF\0015 q\000~\000\003sr\000-N;\000$io.kafka.K\001\006\000R%\227\005B<I\320\251Y\032\341{#\002\000\001L\000\007kv\005\025\010t\000$nH\001\000K\t&\000;\025s\000\"Ns\000-P\r- j\000\275\271\035\243\3126\002!\353\010\010ke)\277\001\264\000\0022\303\001\005\022\rY$q\000~\000\006q\000~\000\016"
      >
    >
  >
  coders: <
    key: "rXpiInkeqDVarIntCoder"
    value: <
      spec: <
        urn: "beam:coders:javasdk:0.1"
        payload: "\202SNAPPY\000\000\000\000\001\000\000\000\001\000\000\000\210\330\001\350\254\355\000\005sr\000&org.apache.beam.sdk.coders.VarIntCoder\300K2\332\251KVh\002\000\000xrr5\000\024Atomic\0055 \307\354\265\314\205tPF\002\0055\000*jj\000$Structured\0059\034s\277\022\016\325\3246\021\t9\000 j9\000\005/0C\335\325\211\256\274~\370\002\000\000xp"
      >
    >
  >
  coders: <
    key: "rXpiInkeqDVoidCoder"
    value: <
      spec: <
        urn: "beam:coders:javasdk:0.1"
        payload: "\202SNAPPY\000\000\000\000\001\000\000\000\001\000\000\000\210\326\001\350\254\355\000\005sr\000$org.apache.beam.sdk.coders.VoidCoder\271\277U\233\350\r\257U\002\000\000xr\000&j3\000\024Atomic\0055 \307\354\265\314\205tPF\002\0055\000*j5\000$Structured\0059\034s\277\022\016\325\3246\021\t9\000 j9\000\005/0C\335\325\211\256\274~\370\002\000\000xp"
      >
    >
  >
  environments: <
    key: "go"
    value: <
      urn: "beam:env:docker:v1"
      payload: "\n\026apache/beam_go_sdk:dev"
      capabilities: "beam:protocol:progress_reporting:v0"
      capabilities: "beam:protocol:multi_core_bundle_processing:v1"
      capabilities: "beam:version:sdk_base:go"
      capabilities: "beam:coder:bytes:v1"
      capabilities: "beam:coder:bool:v1"
      capabilities: "beam:coder:varint:v1"
      capabilities: "beam:coder:double:v1"
      capabilities: "beam:coder:string_utf8:v1"
      capabilities: "beam:coder:length_prefix:v1"
      capabilities: "beam:coder:kv:v1"
      capabilities: "beam:coder:iterable:v1"
      capabilities: "beam:coder:state_backed_iterable:v1"
      capabilities: "beam:coder:windowed_value:v1"
      capabilities: "beam:coder:global_window:v1"
      capabilities: "beam:coder:interval_window:v1"
      capabilities: "beam:coder:row:v1"
      dependencies: <
        type_urn: "beam:artifact:type:file:v1"
        role_urn: "beam:artifact:role:go_worker_binary:v1"
      >
    >
  >
  environments: <
    key: "rXpiInkeqDbeam:env:docker:v1"
    value: <
      urn: "beam:env:docker:v1"
      payload: "\n apache/beam_java8_sdk:2.38.0.dev"
      capabilities: "beam:coder:bytes:v1"
      capabilities: "beam:coder:bool:v1"
      capabilities: "beam:coder:varint:v1"
      capabilities: "beam:coder:string_utf8:v1"
      capabilities: "beam:coder:iterable:v1"
      capabilities: "beam:coder:timer:v1"
      capabilities: "beam:coder:kv:v1"
      capabilities: "beam:coder:length_prefix:v1"
      capabilities: "beam:coder:global_window:v1"
      capabilities: "beam:coder:interval_window:v1"
      capabilities: "beam:coder:custom_window:v1"
      capabilities: "beam:coder:windowed_value:v1"
      capabilities: "beam:coder:double:v1"
      capabilities: "beam:coder:row:v1"
      capabilities: "beam:coder:param_windowed_value:v1"
      capabilities: "beam:coder:state_backed_iterable:v1"
      capabilities: "beam:coder:sharded_key:v1"
      capabilities: "beam:protocol:multi_core_bundle_processing:v1"
      capabilities: "beam:protocol:progress_reporting:v1"
      capabilities: "beam:protocol:harness_monitoring_infos:v1"
      capabilities: "beam:protocol:control_request_elements_embedding:v1"
      capabilities: "beam:protocol:state_caching:v1"
      capabilities: "beam:version:sdk_base:apache/beam_java8_sdk:2.38.0.dev"
      capabilities: "beam:transform:sdf_truncate_sized_restrictions:v1"
      capabilities: "beam:transform:to_string:v1"
      dependencies: <
        type_urn: "beam:artifact:type:file:v1"
        type_payload: "\nL/tmp/artifacts/icedtea-sound-ebvtNFkfFXg4aaYFuDnwKpwDSjzsaZqlqv5iKxPTr-U.jar\022@79bbed34591f15783869a605b839f02a9c034a3cec699aa5aafe622b13d3afe5"
        role_urn: "beam:artifact:role:staging_to:v1"
        role_payload: "\n=icedtea-sound-ebvtNFkfFXg4aaYFuDnwKpwDSjzsaZqlqv5iKxPTr-U.jar"
      >
      dependencies: <
        type_urn: "beam:artifact:type:file:v1"
        type_payload: "\nF/tmp/artifacts/jaccess-ULFTCPsb6cLYZ0f1BG1FQfczmHNaZCx8plXuRDKpBqE.jar\022@50b15308fb1be9c2d86747f5046d4541f73398735a642c7ca655ee4432a906a1"
        role_urn: "beam:artifact:role:staging_to:v1"
        role_payload: "\n7jaccess-ULFTCPsb6cLYZ0f1BG1FQfczmHNaZCx8plXuRDKpBqE.jar"
      >
      dependencies: <
        type_urn: "beam:artifact:type:file:v1"
        type_payload: "\nI/tmp/artifacts/localedata-dUHqyGxaTVCjfTI8MckPYarZ3_mwf62udkxaHi1aKns.jar\022@7541eac86c5a4d50a37d323c31c90f61aad9dff9b07fadae764c5a1e2d5a2a7b"
        role_urn: "beam:artifact:role:staging_to:v1"
        role_payload: "\n:localedata-dUHqyGxaTVCjfTI8MckPYarZ3_mwf62udkxaHi1aKns.jar"
      >
      dependencies: <
        type_urn: "beam:artifact:type:file:v1"
        type_payload: "\nF/tmp/artifacts/nashorn-XdUndQGroXOP9NCsfITpBERYcbbGXVHLjbvNWXCh-3A.jar\022@5dd5277501aba1738ff4d0ac7c84e904445871b6c65d51cb8dbbcd5970a1fb70"
        role_urn: "beam:artifact:role:staging_to:v1"
        role_payload: "\n7nashorn-XdUndQGroXOP9NCsfITpBERYcbbGXVHLjbvNWXCh-3A.jar"
      >
      dependencies: <
        type_urn: "beam:artifact:type:file:v1"
        type_payload: "\nG/tmp/artifacts/cldrdata-YqzuKX1QnLCOo0cwjKRdBhGrip_ltIJZg-APT60tUPA.jar\022@62acee297d509cb08ea347308ca45d0611ab8a9fe5b4825983e00f4fad2d50f0"
        role_urn: "beam:artifact:role:staging_to:v1"
        role_payload: "\n8cldrdata-YqzuKX1QnLCOo0cwjKRdBhGrip_ltIJZg-APT60tUPA.jar"
      >
      dependencies: <
        type_urn: "beam:artifact:type:file:v1"
        type_payload: "\nD/tmp/artifacts/dnsns-dhEp186udEF6X6chZus-RJzWRmzlccxx1_btlXWayVI.jar\022@761129d7ceae74417a5fa72166eb3e449cd6466ce571cc71d7f6ed95759ac952"
        role_urn: "beam:artifact:role:staging_to:v1"
        role_payload: "\n5dnsns-dhEp186udEF6X6chZus-RJzWRmzlccxx1_btlXWayVI.jar"
      >
      dependencies: <
        type_urn: "beam:artifact:type:file:v1"
        type_payload: "\nr/tmp/artifacts/beam-sdks-java-io-expansion-service-2.38.0-SNAPSHOT-_6Tx1PpVR2h5k2-Ebq-7KCkuK0OHMaQvrgZ6-7rb-tA.jar\022@ffa4f1d4fa55476879936f846eafbb28292e2b438731a42fae067afbbadbfad0"
        role_urn: "beam:artifact:role:staging_to:v1"
        role_payload: "\ncbeam-sdks-java-io-expansion-service-2.38.0-SNAPSHOT-_6Tx1PpVR2h5k2-Ebq-7KCkuK0OHMaQvrgZ6-7rb-tA.jar"
      >
    >
  >
>
root_transform_ids: "e4"
root_transform_ids: "e5"
root_transform_ids: "s1"
root_transform_ids: "s3"
requirements: "beam:requirement:pardo:splittable_dofn:v1"
2022/02/10 12:29:02 Cross-compiling <https://ci-beam.apache.org/job/beam_PostCommit_XVR_Samza/ws/src/sdks/go/test/integration/io/xlang/kafka/kafka_test.go> as /tmp/worker-2-1644496142035433599
2022/02/10 12:29:11 Prepared job with id: go-testkafkaio_basicreadwrite_91e91f79-1ad4-4906-b828-8b5f3cad1b1f and staging token: go-testkafkaio_basicreadwrite_91e91f79-1ad4-4906-b828-8b5f3cad1b1f
2022/02/10 12:29:11 Staged binary artifact with token: 
2022/02/10 12:29:11 Submitted job: go0testkafkaio0basicreadwrite-jenkins-0210122911-8d03cb0c_d1646c0c-2b9b-4703-b516-f7f6c88e2a56
2022/02/10 12:29:11 Job state: STOPPED
2022/02/10 12:29:11 Job state: STARTING
2022/02/10 12:29:11 Job state: RUNNING
2022/02/10 12:29:40 Job state: DONE
--- PASS: TestKafkaIO_BasicReadWrite (86.26s)
PASS
ok  	github.com/apache/beam/sdks/v2/go/test/integration/io/xlang/kafka	89.388s
FAIL

> Task :runners:samza:job-server:validatesCrossLanguageRunnerGoUsingJava FAILED
> Task :runners:samza:job-server:validatesCrossLanguageRunnerJavaUsingJava
> Task :runners:samza:job-server:validatesCrossLanguageRunnerJavaUsingPython
> Task :runners:samza:job-server:validatesCrossLanguageRunnerJavaUsingPythonOnly
> Task :runners:samza:job-server:validatesCrossLanguageRunnerPythonUsingJava
> Task :runners:samza:job-server:validatesCrossLanguageRunnerPythonUsingPython
> Task :runners:samza:job-server:validatesCrossLanguageRunnerPythonUsingSql
> Task :runners:samza:job-server:validatesCrossLanguageRunnerCleanup
> Task :runners:samza:job-server:samzaJobServerCleanup

FAILURE: Build failed with an exception.

* Where:
Build file '<https://ci-beam.apache.org/job/beam_PostCommit_XVR_Samza/ws/src/sdks/go/test/build.gradle'> line: 176

* What went wrong:
Execution failed for task ':runners:samza:job-server:validatesCrossLanguageRunnerGoUsingJava'.
> Process 'command 'sh'' finished with non-zero exit value 1

* Try:
> Run with --stacktrace option to get the stack trace.
> Run with --info or --debug option to get more log output.
> Run with --scan to get full insights.

* Get more help at https://help.gradle.org

Deprecated Gradle features were used in this build, making it incompatible with Gradle 8.0.

You can use '--warning-mode all' to show the individual deprecation warnings and determine if they come from your own scripts or plugins.

See https://docs.gradle.org/7.3.2/userguide/command_line_interface.html#sec:command_line_warnings

Execution optimizations have been disabled for 1 invalid unit(s) of work during this build to ensure correctness.
Please consult deprecation warnings for more details.

BUILD FAILED in 55m 31s
246 actionable tasks: 181 executed, 56 from cache, 9 up-to-date

Publishing build scan...
https://gradle.com/s/wwql32obtisyi

Build step 'Invoke Gradle script' changed build result to FAILURE
Build step 'Invoke Gradle script' marked build as failure

---------------------------------------------------------------------
To unsubscribe, e-mail: builds-unsubscribe@beam.apache.org
For additional commands, e-mail: builds-help@beam.apache.org


Build failed in Jenkins: beam_PostCommit_XVR_Samza #813

Posted by Apache Jenkins Server <je...@builds.apache.org>.
See <https://ci-beam.apache.org/job/beam_PostCommit_XVR_Samza/813/display/redirect?page=changes>

Changes:

[Valentyn Tymofieiev] Add a container for Python 3.9.

[Valentyn Tymofieiev] Allow job submission with Python 3.9 on Dataflow runner

[Valentyn Tymofieiev] Add Python 3.9 test suites. Keep Dataflow V1 suites unchanged for now.

[Valentyn Tymofieiev] Add py3.9 Github actions suites.

[Valentyn Tymofieiev] Py39 Doc updates.

[Valentyn Tymofieiev] [BEAM-9980] Simplify run_validates_container.sh to avoid branching.

[Valentyn Tymofieiev] Update Cython to a new version that has py39 wheels.

[Valentyn Tymofieiev] [BEAM-13845] Fix comparison with potentially incomparable default

[Valentyn Tymofieiev] [BEAM-12920] Assume that bare generators types define simple generators.

[Valentyn Tymofieiev] Mark Python 3.9 as supported version.

[Valentyn Tymofieiev] [BEAM-13868] Remove gsutil dep from hdfs IT test.

[noreply] [BEAM-13867] Drop NaNs returned by nlargest in flight_delays example

[noreply] Announce Python 3.9 in CHANGES.md (#16802)

[Brian Hulette] Moving to 2.38.0-SNAPSHOT on master branch.

[noreply] [BEAM-11095] Better error handling for iter/reiter/multimap (#16794)


------------------------------------------
[...truncated 361.22 KB...]
----------------------------- Captured stderr call -----------------------------
WARNING:root:Make sure that locally built Python SDK docker image has Python 3.6 interpreter.
WARNING:root:Make sure that locally built Python SDK docker image has Python 3.6 interpreter.
------------------------------ Captured log call -------------------------------
WARNING  root:environments.py:374 Make sure that locally built Python SDK docker image has Python 3.6 interpreter.
WARNING  root:environments.py:374 Make sure that locally built Python SDK docker image has Python 3.6 interpreter.
__________________ SqlTransformTest.test_windowing_before_sql __________________

self = <apache_beam.transforms.sql_test.SqlTransformTest testMethod=test_windowing_before_sql>

    def test_windowing_before_sql(self):
      with TestPipeline() as p:
        out = (
            p | beam.Create([
                SimpleRow(5, "foo", 1.),
                SimpleRow(15, "bar", 2.),
                SimpleRow(25, "baz", 3.)
            ])
            | beam.Map(lambda v: beam.window.TimestampedValue(v, v.id)).
            with_output_types(SimpleRow)
            | beam.WindowInto(
                beam.window.FixedWindows(10)).with_output_types(SimpleRow)
            | SqlTransform("SELECT COUNT(*) as `count` FROM PCOLLECTION"))
>       assert_that(out, equal_to([(1, ), (1, ), (1, )]))

apache_beam/transforms/sql_test.py:175: 
_ _ _ _ _ _ _ _ _ _ _ _ _ _ _ _ _ _ _ _ _ _ _ _ _ _ _ _ _ _ _ _ _ _ _ _ _ _ _ _ 
apache_beam/pipeline.py:596: in __exit__
    self.result = self.run()
apache_beam/testing/test_pipeline.py:114: in run
    False if self.not_use_test_runner_api else test_runner_api))
apache_beam/pipeline.py:573: in run
    return self.runner.run_pipeline(self, self._options)
apache_beam/runners/portability/portable_runner.py:438: in run_pipeline
    job_service_handle = self.create_job_service(options)
apache_beam/runners/portability/portable_runner.py:317: in create_job_service
    return self.create_job_service_handle(server.start(), options)
apache_beam/runners/portability/job_server.py:54: in start
    grpc.channel_ready_future(channel).result(timeout=self._timeout)
../../build/gradleenv/1922375555/lib/python3.6/site-packages/grpc/_utilities.py:139: in result
    self._block(timeout)
_ _ _ _ _ _ _ _ _ _ _ _ _ _ _ _ _ _ _ _ _ _ _ _ _ _ _ _ _ _ _ _ _ _ _ _ _ _ _ _ 

self = <grpc._utilities._ChannelReadyFuture object at 0x7fc2dc031358>
timeout = 60

    def _block(self, timeout):
        until = None if timeout is None else time.time() + timeout
        with self._condition:
            while True:
                if self._cancelled:
                    raise grpc.FutureCancelledError()
                elif self._matured:
                    return
                else:
                    if until is None:
                        self._condition.wait()
                    else:
                        remaining = until - time.time()
                        if remaining < 0:
>                           raise grpc.FutureTimeoutError()
E                           grpc.FutureTimeoutError

../../build/gradleenv/1922375555/lib/python3.6/site-packages/grpc/_utilities.py:85: FutureTimeoutError
----------------------------- Captured stderr call -----------------------------
WARNING:root:Make sure that locally built Python SDK docker image has Python 3.6 interpreter.
WARNING:root:Make sure that locally built Python SDK docker image has Python 3.6 interpreter.
------------------------------ Captured log call -------------------------------
WARNING  root:environments.py:374 Make sure that locally built Python SDK docker image has Python 3.6 interpreter.
WARNING  root:environments.py:374 Make sure that locally built Python SDK docker image has Python 3.6 interpreter.
_________________ SqlTransformTest.test_zetasql_generate_data __________________

self = <apache_beam.transforms.sql_test.SqlTransformTest testMethod=test_zetasql_generate_data>

    def test_zetasql_generate_data(self):
      with TestPipeline() as p:
        out = p | SqlTransform(
            """SELECT
              CAST(1 AS INT64) AS `int`,
              CAST('foo' AS STRING) AS `str`,
              CAST(3.14  AS FLOAT64) AS `flt`""",
            dialect="zetasql")
>       assert_that(out, equal_to([(1, "foo", 3.14)]))

apache_beam/transforms/sql_test.py:160: 
_ _ _ _ _ _ _ _ _ _ _ _ _ _ _ _ _ _ _ _ _ _ _ _ _ _ _ _ _ _ _ _ _ _ _ _ _ _ _ _ 
apache_beam/pipeline.py:596: in __exit__
    self.result = self.run()
apache_beam/testing/test_pipeline.py:114: in run
    False if self.not_use_test_runner_api else test_runner_api))
apache_beam/pipeline.py:573: in run
    return self.runner.run_pipeline(self, self._options)
apache_beam/runners/portability/portable_runner.py:438: in run_pipeline
    job_service_handle = self.create_job_service(options)
apache_beam/runners/portability/portable_runner.py:317: in create_job_service
    return self.create_job_service_handle(server.start(), options)
apache_beam/runners/portability/job_server.py:54: in start
    grpc.channel_ready_future(channel).result(timeout=self._timeout)
../../build/gradleenv/1922375555/lib/python3.6/site-packages/grpc/_utilities.py:139: in result
    self._block(timeout)
_ _ _ _ _ _ _ _ _ _ _ _ _ _ _ _ _ _ _ _ _ _ _ _ _ _ _ _ _ _ _ _ _ _ _ _ _ _ _ _ 

self = <grpc._utilities._ChannelReadyFuture object at 0x7fc2dc294f98>
timeout = 60

    def _block(self, timeout):
        until = None if timeout is None else time.time() + timeout
        with self._condition:
            while True:
                if self._cancelled:
                    raise grpc.FutureCancelledError()
                elif self._matured:
                    return
                else:
                    if until is None:
                        self._condition.wait()
                    else:
                        remaining = until - time.time()
                        if remaining < 0:
>                           raise grpc.FutureTimeoutError()
E                           grpc.FutureTimeoutError

../../build/gradleenv/1922375555/lib/python3.6/site-packages/grpc/_utilities.py:85: FutureTimeoutError
----------------------------- Captured stderr call -----------------------------
WARNING:root:Make sure that locally built Python SDK docker image has Python 3.6 interpreter.
WARNING:root:Make sure that locally built Python SDK docker image has Python 3.6 interpreter.
------------------------------ Captured log call -------------------------------
WARNING  root:environments.py:374 Make sure that locally built Python SDK docker image has Python 3.6 interpreter.
WARNING  root:environments.py:374 Make sure that locally built Python SDK docker image has Python 3.6 interpreter.
- generated xml file: <https://ci-beam.apache.org/job/beam_PostCommit_XVR_Samza/ws/src/sdks/python/pytest_xlangSqlValidateRunner.xml> -
================= 9 failed, 5198 deselected in 663.05 seconds ==================

> Task :runners:samza:job-server:validatesCrossLanguageRunnerPythonUsingSql FAILED

> Task :runners:samza:job-server:validatesCrossLanguageRunnerCleanup
Stopping expansion service pid: 3516256.
Stopping expansion service pid: 3516257.

> Task :runners:samza:job-server:samzaJobServerCleanup
Stopping job server pid: 3472784.

FAILURE: Build completed with 7 failures.

1: Task failed with an exception.
-----------
* Where:
Build file '<https://ci-beam.apache.org/job/beam_PostCommit_XVR_Samza/ws/src/sdks/go/test/build.gradle'> line: 176

* What went wrong:
Execution failed for task ':runners:samza:job-server:validatesCrossLanguageRunnerGoUsingJava'.
> Process 'command 'sh'' finished with non-zero exit value 1

* Try:
> Run with --stacktrace option to get the stack trace.
> Run with --info or --debug option to get more log output.
> Run with --scan to get full insights.
==============================================================================

2: Task failed with an exception.
-----------
* What went wrong:
Execution failed for task ':runners:samza:job-server:validatesCrossLanguageRunnerJavaUsingJava'.
> There were failing tests. See the report at: file://<https://ci-beam.apache.org/job/beam_PostCommit_XVR_Samza/ws/src/runners/samza/job-server/build/reports/tests/validatesCrossLanguageRunnerJavaUsingJava/index.html>

* Try:
> Run with --stacktrace option to get the stack trace.
> Run with --info or --debug option to get more log output.
> Run with --scan to get full insights.
==============================================================================

3: Task failed with an exception.
-----------
* What went wrong:
Execution failed for task ':runners:samza:job-server:validatesCrossLanguageRunnerJavaUsingPython'.
> There were failing tests. See the report at: file://<https://ci-beam.apache.org/job/beam_PostCommit_XVR_Samza/ws/src/runners/samza/job-server/build/reports/tests/validatesCrossLanguageRunnerJavaUsingPython/index.html>

* Try:
> Run with --stacktrace option to get the stack trace.
> Run with --info or --debug option to get more log output.
> Run with --scan to get full insights.
==============================================================================

4: Task failed with an exception.
-----------
* What went wrong:
Execution failed for task ':runners:samza:job-server:validatesCrossLanguageRunnerJavaUsingPythonOnly'.
> There were failing tests. See the report at: file://<https://ci-beam.apache.org/job/beam_PostCommit_XVR_Samza/ws/src/runners/samza/job-server/build/reports/tests/validatesCrossLanguageRunnerJavaUsingPythonOnly/index.html>

* Try:
> Run with --stacktrace option to get the stack trace.
> Run with --info or --debug option to get more log output.
> Run with --scan to get full insights.
==============================================================================

5: Task failed with an exception.
-----------
* What went wrong:
Execution failed for task ':runners:samza:job-server:validatesCrossLanguageRunnerPythonUsingJava'.
> Process 'command 'sh'' finished with non-zero exit value 1

* Try:
> Run with --stacktrace option to get the stack trace.
> Run with --info or --debug option to get more log output.
> Run with --scan to get full insights.
==============================================================================

6: Task failed with an exception.
-----------
* What went wrong:
Execution failed for task ':runners:samza:job-server:validatesCrossLanguageRunnerPythonUsingPython'.
> Process 'command 'sh'' finished with non-zero exit value 1

* Try:
> Run with --stacktrace option to get the stack trace.
> Run with --info or --debug option to get more log output.
> Run with --scan to get full insights.
==============================================================================

7: Task failed with an exception.
-----------
* What went wrong:
Execution failed for task ':runners:samza:job-server:validatesCrossLanguageRunnerPythonUsingSql'.
> Process 'command 'sh'' finished with non-zero exit value 1

* Try:
> Run with --stacktrace option to get the stack trace.
> Run with --info or --debug option to get more log output.
> Run with --scan to get full insights.
==============================================================================

* Get more help at https://help.gradle.org

Deprecated Gradle features were used in this build, making it incompatible with Gradle 8.0.

You can use '--warning-mode all' to show the individual deprecation warnings and determine if they come from your own scripts or plugins.

See https://docs.gradle.org/7.3.2/userguide/command_line_interface.html#sec:command_line_warnings

Execution optimizations have been disabled for 1 invalid unit(s) of work during this build to ensure correctness.
Please consult deprecation warnings for more details.

BUILD FAILED in 36m 54s
246 actionable tasks: 169 executed, 66 from cache, 11 up-to-date

Publishing build scan...
https://gradle.com/s/hjupntlfwrqfk

Build step 'Invoke Gradle script' changed build result to FAILURE
Build step 'Invoke Gradle script' marked build as failure

---------------------------------------------------------------------
To unsubscribe, e-mail: builds-unsubscribe@beam.apache.org
For additional commands, e-mail: builds-help@beam.apache.org