You are viewing a plain text version of this content. The canonical link for it is here.
Posted to dev@lucene.apache.org by Policeman Jenkins Server <je...@thetaphi.de> on 2013/03/09 11:22:49 UTC

[JENKINS] Lucene-Solr-4.x-Linux (32bit/jdk1.8.0-ea-b79) - Build # 4604 - Failure!

Build: http://jenkins.thetaphi.de/job/Lucene-Solr-4.x-Linux/4604/
Java: 32bit/jdk1.8.0-ea-b79 -client -XX:+UseG1GC -XX:MarkStackSize=256K

5 tests failed.
FAILED:  junit.framework.TestSuite.org.apache.solr.cloud.ChaosMonkeySafeLeaderTest

Error Message:
Suite timeout exceeded (>= 7200000 msec).

Stack Trace:
java.lang.Exception: Suite timeout exceeded (>= 7200000 msec).
	at __randomizedtesting.SeedInfo.seed([3BEF0DA708BE9CD7]:0)


FAILED:  junit.framework.TestSuite.org.apache.solr.cloud.RecoveryZkTest

Error Message:
Resource in scope SUITE failed to close. Resource was registered from thread Thread[id=2910, name=coreLoadExecutor-2193-thread-1, state=RUNNABLE, group=TGRP-RecoveryZkTest], registration stack trace below.

Stack Trace:
com.carrotsearch.randomizedtesting.ResourceDisposalError: Resource in scope SUITE failed to close. Resource was registered from thread Thread[id=2910, name=coreLoadExecutor-2193-thread-1, state=RUNNABLE, group=TGRP-RecoveryZkTest], registration stack trace below.
	at java.lang.Thread.getStackTrace(Thread.java:1569)
	at com.carrotsearch.randomizedtesting.RandomizedContext.closeAtEnd(RandomizedContext.java:150)
	at org.apache.lucene.util.LuceneTestCase.closeAfterSuite(LuceneTestCase.java:520)
	at org.apache.lucene.util.LuceneTestCase.wrapDirectory(LuceneTestCase.java:986)
	at org.apache.lucene.util.LuceneTestCase.newDirectory(LuceneTestCase.java:878)
	at org.apache.lucene.util.LuceneTestCase.newDirectory(LuceneTestCase.java:870)
	at org.apache.solr.core.MockDirectoryFactory.create(MockDirectoryFactory.java:33)
	at org.apache.solr.core.CachingDirectoryFactory.get(CachingDirectoryFactory.java:266)
	at org.apache.solr.core.CachingDirectoryFactory.get(CachingDirectoryFactory.java:222)
	at org.apache.solr.core.SolrCore.getNewIndexDir(SolrCore.java:244)
	at org.apache.solr.core.SolrCore.initIndex(SolrCore.java:458)
	at org.apache.solr.core.SolrCore.<init>(SolrCore.java:733)
	at org.apache.solr.core.SolrCore.<init>(SolrCore.java:619)
	at org.apache.solr.core.CoreContainer.createFromZk(CoreContainer.java:868)
	at org.apache.solr.core.CoreContainer.create(CoreContainer.java:951)
	at org.apache.solr.core.CoreContainer$2.call(CoreContainer.java:574)
	at org.apache.solr.core.CoreContainer$2.call(CoreContainer.java:569)
	at java.util.concurrent.FutureTask.run(FutureTask.java:262)
	at java.util.concurrent.Executors$RunnableAdapter.call(Executors.java:471)
	at java.util.concurrent.FutureTask.run(FutureTask.java:262)
	at java.util.concurrent.ThreadPoolExecutor.runWorker(ThreadPoolExecutor.java:1110)
	at java.util.concurrent.ThreadPoolExecutor$Worker.run(ThreadPoolExecutor.java:603)
	at java.lang.Thread.run(Thread.java:722)
Caused by: java.lang.AssertionError: Directory not closed: MockDirWrapper(org.apache.lucene.store.RAMDirectory@602e41 lockFactory=org.apache.lucene.store.NativeFSLockFactory@dd2f01)
	at org.junit.Assert.fail(Assert.java:93)
	at org.apache.lucene.util.CloseableDirectory.close(CloseableDirectory.java:47)
	at com.carrotsearch.randomizedtesting.RandomizedRunner$2$1.apply(RandomizedRunner.java:602)
	at com.carrotsearch.randomizedtesting.RandomizedRunner$2$1.apply(RandomizedRunner.java:599)
	at com.carrotsearch.randomizedtesting.RandomizedContext.closeResources(RandomizedContext.java:167)
	at com.carrotsearch.randomizedtesting.RandomizedRunner$2.afterAlways(RandomizedRunner.java:615)
	at com.carrotsearch.randomizedtesting.rules.StatementAdapter.evaluate(StatementAdapter.java:43)
	at com.carrotsearch.randomizedtesting.ThreadLeakControl$StatementRunner.run(ThreadLeakControl.java:358)
	... 1 more


FAILED:  junit.framework.TestSuite.org.apache.solr.cloud.RecoveryZkTest

Error Message:
Resource in scope SUITE failed to close. Resource was registered from thread Thread[id=2912, name=RecoveryThread, state=RUNNABLE, group=TGRP-RecoveryZkTest], registration stack trace below.

Stack Trace:
com.carrotsearch.randomizedtesting.ResourceDisposalError: Resource in scope SUITE failed to close. Resource was registered from thread Thread[id=2912, name=RecoveryThread, state=RUNNABLE, group=TGRP-RecoveryZkTest], registration stack trace below.
	at java.lang.Thread.getStackTrace(Thread.java:1569)
	at com.carrotsearch.randomizedtesting.RandomizedContext.closeAtEnd(RandomizedContext.java:150)
	at org.apache.lucene.util.LuceneTestCase.closeAfterSuite(LuceneTestCase.java:520)
	at org.apache.lucene.util.LuceneTestCase.wrapDirectory(LuceneTestCase.java:986)
	at org.apache.lucene.util.LuceneTestCase.newDirectory(LuceneTestCase.java:878)
	at org.apache.lucene.util.LuceneTestCase.newDirectory(LuceneTestCase.java:870)
	at org.apache.solr.core.MockDirectoryFactory.create(MockDirectoryFactory.java:33)
	at org.apache.solr.core.CachingDirectoryFactory.get(CachingDirectoryFactory.java:266)
	at org.apache.solr.core.CachingDirectoryFactory.get(CachingDirectoryFactory.java:222)
	at org.apache.solr.handler.SnapPuller.fetchLatestIndex(SnapPuller.java:383)
	at org.apache.solr.handler.ReplicationHandler.doFetch(ReplicationHandler.java:281)
	at org.apache.solr.cloud.RecoveryStrategy.replicate(RecoveryStrategy.java:153)
	at org.apache.solr.cloud.RecoveryStrategy.doRecovery(RecoveryStrategy.java:409)
	at org.apache.solr.cloud.RecoveryStrategy.run(RecoveryStrategy.java:223)
Caused by: java.lang.AssertionError: Directory not closed: MockDirWrapper(org.apache.lucene.store.RAMDirectory@5008a3 lockFactory=org.apache.lucene.store.NativeFSLockFactory@1fff699)
	at org.junit.Assert.fail(Assert.java:93)
	at org.apache.lucene.util.CloseableDirectory.close(CloseableDirectory.java:47)
	at com.carrotsearch.randomizedtesting.RandomizedRunner$2$1.apply(RandomizedRunner.java:602)
	at com.carrotsearch.randomizedtesting.RandomizedRunner$2$1.apply(RandomizedRunner.java:599)
	at com.carrotsearch.randomizedtesting.RandomizedContext.closeResources(RandomizedContext.java:167)
	at com.carrotsearch.randomizedtesting.RandomizedRunner$2.afterAlways(RandomizedRunner.java:615)
	at com.carrotsearch.randomizedtesting.rules.StatementAdapter.evaluate(StatementAdapter.java:43)
	at com.carrotsearch.randomizedtesting.ThreadLeakControl$StatementRunner.run(ThreadLeakControl.java:358)
	at java.lang.Thread.run(Thread.java:722)


REGRESSION:  org.apache.solr.cloud.ChaosMonkeySafeLeaderTest.testDistribSearch

Error Message:
Test abandoned because suite timeout was reached.

Stack Trace:
java.lang.Exception: Test abandoned because suite timeout was reached.
	at __randomizedtesting.SeedInfo.seed([3BEF0DA708BE9CD7]:0)


REGRESSION:  org.apache.solr.cloud.UnloadDistributedZkTest.testDistribSearch

Error Message:
Still found shard

Stack Trace:
java.lang.AssertionError: Still found shard
	at __randomizedtesting.SeedInfo.seed([3BEF0DA708BE9CD7:BA0983BF7FE1FCEB]:0)
	at org.junit.Assert.fail(Assert.java:93)
	at org.apache.solr.cloud.UnloadDistributedZkTest.testUnloadShardAndCollection(UnloadDistributedZkTest.java:124)
	at org.apache.solr.cloud.UnloadDistributedZkTest.doTest(UnloadDistributedZkTest.java:77)
	at org.apache.solr.BaseDistributedSearchTestCase.testDistribSearch(BaseDistributedSearchTestCase.java:806)
	at sun.reflect.NativeMethodAccessorImpl.invoke0(Native Method)
	at sun.reflect.NativeMethodAccessorImpl.invoke(NativeMethodAccessorImpl.java:57)
	at sun.reflect.DelegatingMethodAccessorImpl.invoke(DelegatingMethodAccessorImpl.java:43)
	at java.lang.reflect.Method.invoke(Method.java:487)
	at com.carrotsearch.randomizedtesting.RandomizedRunner.invoke(RandomizedRunner.java:1559)
	at com.carrotsearch.randomizedtesting.RandomizedRunner.access$600(RandomizedRunner.java:79)
	at com.carrotsearch.randomizedtesting.RandomizedRunner$6.evaluate(RandomizedRunner.java:737)
	at com.carrotsearch.randomizedtesting.RandomizedRunner$7.evaluate(RandomizedRunner.java:773)
	at com.carrotsearch.randomizedtesting.RandomizedRunner$8.evaluate(RandomizedRunner.java:787)
	at com.carrotsearch.randomizedtesting.rules.SystemPropertiesRestoreRule$1.evaluate(SystemPropertiesRestoreRule.java:53)
	at org.apache.lucene.util.TestRuleSetupTeardownChained$1.evaluate(TestRuleSetupTeardownChained.java:50)
	at org.apache.lucene.util.TestRuleFieldCacheSanity$1.evaluate(TestRuleFieldCacheSanity.java:51)
	at org.apache.lucene.util.AbstractBeforeAfterRule$1.evaluate(AbstractBeforeAfterRule.java:46)
	at com.carrotsearch.randomizedtesting.rules.SystemPropertiesInvariantRule$1.evaluate(SystemPropertiesInvariantRule.java:55)
	at org.apache.lucene.util.TestRuleThreadAndTestName$1.evaluate(TestRuleThreadAndTestName.java:49)
	at org.apache.lucene.util.TestRuleIgnoreAfterMaxFailures$1.evaluate(TestRuleIgnoreAfterMaxFailures.java:70)
	at org.apache.lucene.util.TestRuleMarkFailure$1.evaluate(TestRuleMarkFailure.java:48)
	at com.carrotsearch.randomizedtesting.rules.StatementAdapter.evaluate(StatementAdapter.java:36)
	at com.carrotsearch.randomizedtesting.ThreadLeakControl$StatementRunner.run(ThreadLeakControl.java:358)
	at com.carrotsearch.randomizedtesting.ThreadLeakControl.forkTimeoutingTask(ThreadLeakControl.java:782)
	at com.carrotsearch.randomizedtesting.ThreadLeakControl$3.evaluate(ThreadLeakControl.java:442)
	at com.carrotsearch.randomizedtesting.RandomizedRunner.runSingleTest(RandomizedRunner.java:746)
	at com.carrotsearch.randomizedtesting.RandomizedRunner$3.evaluate(RandomizedRunner.java:648)
	at com.carrotsearch.randomizedtesting.RandomizedRunner$4.evaluate(RandomizedRunner.java:682)
	at com.carrotsearch.randomizedtesting.RandomizedRunner$5.evaluate(RandomizedRunner.java:693)
	at com.carrotsearch.randomizedtesting.rules.StatementAdapter.evaluate(StatementAdapter.java:36)
	at com.carrotsearch.randomizedtesting.rules.SystemPropertiesRestoreRule$1.evaluate(SystemPropertiesRestoreRule.java:53)
	at org.apache.lucene.util.AbstractBeforeAfterRule$1.evaluate(AbstractBeforeAfterRule.java:46)
	at org.apache.lucene.util.TestRuleStoreClassName$1.evaluate(TestRuleStoreClassName.java:42)
	at com.carrotsearch.randomizedtesting.rules.SystemPropertiesInvariantRule$1.evaluate(SystemPropertiesInvariantRule.java:55)
	at com.carrotsearch.randomizedtesting.rules.NoShadowingOrOverridesOnMethodsRule$1.evaluate(NoShadowingOrOverridesOnMethodsRule.java:39)
	at com.carrotsearch.randomizedtesting.rules.NoShadowingOrOverridesOnMethodsRule$1.evaluate(NoShadowingOrOverridesOnMethodsRule.java:39)
	at com.carrotsearch.randomizedtesting.rules.StatementAdapter.evaluate(StatementAdapter.java:36)
	at org.apache.lucene.util.TestRuleAssertionsRequired$1.evaluate(TestRuleAssertionsRequired.java:43)
	at org.apache.lucene.util.TestRuleMarkFailure$1.evaluate(TestRuleMarkFailure.java:48)
	at org.apache.lucene.util.TestRuleIgnoreAfterMaxFailures$1.evaluate(TestRuleIgnoreAfterMaxFailures.java:70)
	at org.apache.lucene.util.TestRuleIgnoreTestSuites$1.evaluate(TestRuleIgnoreTestSuites.java:55)
	at com.carrotsearch.randomizedtesting.rules.StatementAdapter.evaluate(StatementAdapter.java:36)
	at com.carrotsearch.randomizedtesting.ThreadLeakControl$StatementRunner.run(ThreadLeakControl.java:358)
	at java.lang.Thread.run(Thread.java:722)




Build Log:
[...truncated 9382 lines...]
[junit4:junit4] Suite: org.apache.solr.cloud.UnloadDistributedZkTest
[junit4:junit4]   2> 0 T2173 oas.BaseDistributedSearchTestCase.initHostContext Setting hostContext system property: /fb_ywo/a
[junit4:junit4]   2> 3 T2173 oas.SolrTestCaseJ4.setUp ###Starting testDistribSearch
[junit4:junit4]   2> Creating dataDir: /mnt/ssd/jenkins/workspace/Lucene-Solr-4.x-Linux/solr/build/solr-core/test/J1/./solrtest-UnloadDistributedZkTest-1362817284791
[junit4:junit4]   2> 4 T2173 oasc.ZkTestServer.run STARTING ZK TEST SERVER
[junit4:junit4]   2> 5 T2174 oasc.ZkTestServer$ZKServerMain.runFromConfig Starting server
[junit4:junit4]   2> 5 T2174 oazs.ZooKeeperServer.setTickTime tickTime set to 1000
[junit4:junit4]   2> 5 T2174 oazs.ZooKeeperServer.setMinSessionTimeout minSessionTimeout set to -1
[junit4:junit4]   2> 6 T2174 oazs.ZooKeeperServer.setMaxSessionTimeout maxSessionTimeout set to -1
[junit4:junit4]   2> 6 T2174 oazs.NIOServerCnxnFactory.configure binding to port 0.0.0.0/0.0.0.0:0
[junit4:junit4]   2> 7 T2174 oazsp.FileTxnSnapLog.save Snapshotting: 0x0 to /mnt/ssd/jenkins/workspace/Lucene-Solr-4.x-Linux/solr/build/solr-core/test/J1/./org.apache.solr.cloud.UnloadDistributedZkTest-1362817284791/zookeeper/server1/data/version-2/snapshot.0
[junit4:junit4]   2> 105 T2173 oasc.ZkTestServer.run start zk server on port:44771
[junit4:junit4]   2> 105 T2173 oaz.ZooKeeper.<init> Initiating client connection, connectString=127.0.0.1:44771 sessionTimeout=10000 watcher=org.apache.solr.common.cloud.ConnectionManager@1034d21
[junit4:junit4]   2> 106 T2173 oascc.ConnectionManager.waitForConnected Waiting for client to connect to ZooKeeper
[junit4:junit4]   2> 106 T2179 oaz.ClientCnxn$SendThread.logStartConnect Opening socket connection to server localhost.localdomain/127.0.0.1:44771. Will not attempt to authenticate using SASL (access denied ("javax.security.auth.AuthPermission" "getLoginConfiguration"))
[junit4:junit4]   2> 107 T2179 oaz.ClientCnxn$SendThread.primeConnection Socket connection established to localhost.localdomain/127.0.0.1:44771, initiating session
[junit4:junit4]   2> 107 T2175 oazs.NIOServerCnxnFactory.run Accepted socket connection from /127.0.0.1:47427
[junit4:junit4]   2> 107 T2175 oazs.ZooKeeperServer.processConnectRequest Client attempting to establish new session at /127.0.0.1:47427
[junit4:junit4]   2> 108 T2177 oazsp.FileTxnLog.append Creating new log file: log.1
[junit4:junit4]   2> 129 T2177 oazs.ZooKeeperServer.finishSessionInit Established session 0x13d4e3d7aba0000 with negotiated timeout 10000 for client /127.0.0.1:47427
[junit4:junit4]   2> 129 T2179 oaz.ClientCnxn$SendThread.onConnected Session establishment complete on server localhost.localdomain/127.0.0.1:44771, sessionid = 0x13d4e3d7aba0000, negotiated timeout = 10000
[junit4:junit4]   2> 130 T2180 oascc.ConnectionManager.process Watcher org.apache.solr.common.cloud.ConnectionManager@1034d21 name:ZooKeeperConnection Watcher:127.0.0.1:44771 got event WatchedEvent state:SyncConnected type:None path:null path:null type:None
[junit4:junit4]   2> 130 T2173 oascc.ConnectionManager.waitForConnected Client is connected to ZooKeeper
[junit4:junit4]   2> 130 T2173 oascc.SolrZkClient.makePath makePath: /solr
[junit4:junit4]   2> 133 T2178 oazs.PrepRequestProcessor.pRequest2Txn Processed session termination for sessionid: 0x13d4e3d7aba0000
[junit4:junit4]   2> 133 T2180 oaz.ClientCnxn$EventThread.run EventThread shut down
[junit4:junit4]   2> 134 T2175 oazs.NIOServerCnxn.closeSock Closed socket connection for client /127.0.0.1:47427 which had sessionid 0x13d4e3d7aba0000
[junit4:junit4]   2> 133 T2173 oaz.ZooKeeper.close Session: 0x13d4e3d7aba0000 closed
[junit4:junit4]   2> 134 T2173 oaz.ZooKeeper.<init> Initiating client connection, connectString=127.0.0.1:44771/solr sessionTimeout=10000 watcher=org.apache.solr.common.cloud.ConnectionManager@1c4b6f1
[junit4:junit4]   2> 135 T2181 oaz.ClientCnxn$SendThread.logStartConnect Opening socket connection to server localhost.localdomain/127.0.0.1:44771. Will not attempt to authenticate using SASL (access denied ("javax.security.auth.AuthPermission" "getLoginConfiguration"))
[junit4:junit4]   2> 135 T2173 oascc.ConnectionManager.waitForConnected Waiting for client to connect to ZooKeeper
[junit4:junit4]   2> 135 T2181 oaz.ClientCnxn$SendThread.primeConnection Socket connection established to localhost.localdomain/127.0.0.1:44771, initiating session
[junit4:junit4]   2> 135 T2175 oazs.NIOServerCnxnFactory.run Accepted socket connection from /127.0.0.1:47428
[junit4:junit4]   2> 136 T2175 oazs.ZooKeeperServer.processConnectRequest Client attempting to establish new session at /127.0.0.1:47428
[junit4:junit4]   2> 137 T2177 oazs.ZooKeeperServer.finishSessionInit Established session 0x13d4e3d7aba0001 with negotiated timeout 10000 for client /127.0.0.1:47428
[junit4:junit4]   2> 137 T2181 oaz.ClientCnxn$SendThread.onConnected Session establishment complete on server localhost.localdomain/127.0.0.1:44771, sessionid = 0x13d4e3d7aba0001, negotiated timeout = 10000
[junit4:junit4]   2> 137 T2182 oascc.ConnectionManager.process Watcher org.apache.solr.common.cloud.ConnectionManager@1c4b6f1 name:ZooKeeperConnection Watcher:127.0.0.1:44771/solr got event WatchedEvent state:SyncConnected type:None path:null path:null type:None
[junit4:junit4]   2> 137 T2173 oascc.ConnectionManager.waitForConnected Client is connected to ZooKeeper
[junit4:junit4]   2> 138 T2173 oascc.SolrZkClient.makePath makePath: /collections/collection1
[junit4:junit4]   2> 140 T2173 oascc.SolrZkClient.makePath makePath: /collections/collection1/shards
[junit4:junit4]   2> 142 T2173 oascc.SolrZkClient.makePath makePath: /collections/control_collection
[junit4:junit4]   2> 144 T2173 oascc.SolrZkClient.makePath makePath: /collections/control_collection/shards
[junit4:junit4]   2> 146 T2173 oasc.AbstractZkTestCase.putConfig put /mnt/ssd/jenkins/workspace/Lucene-Solr-4.x-Linux/solr/build/solr-core/test-files/solr/collection1/conf/solrconfig-tlog.xml to /configs/conf1/solrconfig.xml
[junit4:junit4]   2> 147 T2173 oascc.SolrZkClient.makePath makePath: /configs/conf1/solrconfig.xml
[junit4:junit4]   2> 150 T2173 oasc.AbstractZkTestCase.putConfig put /mnt/ssd/jenkins/workspace/Lucene-Solr-4.x-Linux/solr/build/solr-core/test-files/solr/collection1/conf/schema.xml to /configs/conf1/schema.xml
[junit4:junit4]   2> 151 T2173 oascc.SolrZkClient.makePath makePath: /configs/conf1/schema.xml
[junit4:junit4]   2> 153 T2173 oasc.AbstractZkTestCase.putConfig put /mnt/ssd/jenkins/workspace/Lucene-Solr-4.x-Linux/solr/build/solr-core/test-files/solr/collection1/conf/stopwords.txt to /configs/conf1/stopwords.txt
[junit4:junit4]   2> 154 T2173 oascc.SolrZkClient.makePath makePath: /configs/conf1/stopwords.txt
[junit4:junit4]   2> 156 T2173 oasc.AbstractZkTestCase.putConfig put /mnt/ssd/jenkins/workspace/Lucene-Solr-4.x-Linux/solr/build/solr-core/test-files/solr/collection1/conf/protwords.txt to /configs/conf1/protwords.txt
[junit4:junit4]   2> 156 T2173 oascc.SolrZkClient.makePath makePath: /configs/conf1/protwords.txt
[junit4:junit4]   2> 158 T2173 oasc.AbstractZkTestCase.putConfig put /mnt/ssd/jenkins/workspace/Lucene-Solr-4.x-Linux/solr/build/solr-core/test-files/solr/collection1/conf/currency.xml to /configs/conf1/currency.xml
[junit4:junit4]   2> 158 T2173 oascc.SolrZkClient.makePath makePath: /configs/conf1/currency.xml
[junit4:junit4]   2> 160 T2173 oasc.AbstractZkTestCase.putConfig put /mnt/ssd/jenkins/workspace/Lucene-Solr-4.x-Linux/solr/build/solr-core/test-files/solr/collection1/conf/open-exchange-rates.json to /configs/conf1/open-exchange-rates.json
[junit4:junit4]   2> 161 T2173 oascc.SolrZkClient.makePath makePath: /configs/conf1/open-exchange-rates.json
[junit4:junit4]   2> 162 T2173 oasc.AbstractZkTestCase.putConfig put /mnt/ssd/jenkins/workspace/Lucene-Solr-4.x-Linux/solr/build/solr-core/test-files/solr/collection1/conf/mapping-ISOLatin1Accent.txt to /configs/conf1/mapping-ISOLatin1Accent.txt
[junit4:junit4]   2> 163 T2173 oascc.SolrZkClient.makePath makePath: /configs/conf1/mapping-ISOLatin1Accent.txt
[junit4:junit4]   2> 165 T2173 oasc.AbstractZkTestCase.putConfig put /mnt/ssd/jenkins/workspace/Lucene-Solr-4.x-Linux/solr/build/solr-core/test-files/solr/collection1/conf/old_synonyms.txt to /configs/conf1/old_synonyms.txt
[junit4:junit4]   2> 165 T2173 oascc.SolrZkClient.makePath makePath: /configs/conf1/old_synonyms.txt
[junit4:junit4]   2> 167 T2173 oasc.AbstractZkTestCase.putConfig put /mnt/ssd/jenkins/workspace/Lucene-Solr-4.x-Linux/solr/build/solr-core/test-files/solr/collection1/conf/synonyms.txt to /configs/conf1/synonyms.txt
[junit4:junit4]   2> 167 T2173 oascc.SolrZkClient.makePath makePath: /configs/conf1/synonyms.txt
[junit4:junit4]   2> 169 T2178 oazs.PrepRequestProcessor.pRequest2Txn Processed session termination for sessionid: 0x13d4e3d7aba0001
[junit4:junit4]   2> 169 T2182 oaz.ClientCnxn$EventThread.run EventThread shut down
[junit4:junit4]   2> 169 T2173 oaz.ZooKeeper.close Session: 0x13d4e3d7aba0001 closed
[junit4:junit4]   2> 169 T2175 oazs.NIOServerCnxn.closeSock Closed socket connection for client /127.0.0.1:47428 which had sessionid 0x13d4e3d7aba0001
[junit4:junit4]   2> 227 T2173 oejs.Server.doStart jetty-8.1.8.v20121106
[junit4:junit4]   2> 286 T2173 oejs.AbstractConnector.doStart Started SelectChannelConnector@127.0.0.1:53397
[junit4:junit4]   2> 286 T2173 oass.SolrDispatchFilter.init SolrDispatchFilter.init()
[junit4:junit4]   2> 287 T2173 oasc.SolrResourceLoader.locateSolrHome JNDI not configured for solr (NoInitialContextEx)
[junit4:junit4]   2> 287 T2173 oasc.SolrResourceLoader.locateSolrHome using system property solr.solr.home: /mnt/ssd/jenkins/workspace/Lucene-Solr-4.x-Linux/solr/build/solr-core/test/J1/./org.apache.solr.cloud.UnloadDistributedZkTest-controljetty-1362817284957
[junit4:junit4]   2> 288 T2173 oasc.CoreContainer$Initializer.initialize looking for solr config file: /mnt/ssd/jenkins/workspace/Lucene-Solr-4.x-Linux/solr/build/solr-core/test/J1/./org.apache.solr.cloud.UnloadDistributedZkTest-controljetty-1362817284957/solr.xml
[junit4:junit4]   2> 288 T2173 oasc.CoreContainer.<init> New CoreContainer 14850768
[junit4:junit4]   2> 288 T2173 oasc.CoreContainer.load Loading CoreContainer using Solr Home: '/mnt/ssd/jenkins/workspace/Lucene-Solr-4.x-Linux/solr/build/solr-core/test/J1/./org.apache.solr.cloud.UnloadDistributedZkTest-controljetty-1362817284957/'
[junit4:junit4]   2> 289 T2173 oasc.SolrResourceLoader.<init> new SolrResourceLoader for directory: '/mnt/ssd/jenkins/workspace/Lucene-Solr-4.x-Linux/solr/build/solr-core/test/J1/./org.apache.solr.cloud.UnloadDistributedZkTest-controljetty-1362817284957/'
[junit4:junit4]   2> 310 T2173 oashc.HttpShardHandlerFactory.getParameter Setting socketTimeout to: 120000
[junit4:junit4]   2> 310 T2173 oashc.HttpShardHandlerFactory.getParameter Setting urlScheme to: http://
[junit4:junit4]   2> 311 T2173 oashc.HttpShardHandlerFactory.getParameter Setting connTimeout to: 15000
[junit4:junit4]   2> 311 T2173 oashc.HttpShardHandlerFactory.getParameter Setting maxConnectionsPerHost to: 20
[junit4:junit4]   2> 311 T2173 oashc.HttpShardHandlerFactory.getParameter Setting corePoolSize to: 0
[junit4:junit4]   2> 312 T2173 oashc.HttpShardHandlerFactory.getParameter Setting maximumPoolSize to: 2147483647
[junit4:junit4]   2> 312 T2173 oashc.HttpShardHandlerFactory.getParameter Setting maxThreadIdleTime to: 5
[junit4:junit4]   2> 312 T2173 oashc.HttpShardHandlerFactory.getParameter Setting sizeOfQueue to: -1
[junit4:junit4]   2> 313 T2173 oashc.HttpShardHandlerFactory.getParameter Setting fairnessPolicy to: false
[junit4:junit4]   2> 313 T2173 oascsi.HttpClientUtil.createClient Creating new http client, config:maxConnectionsPerHost=20&maxConnections=10000&socketTimeout=120000&connTimeout=15000&retry=false
[junit4:junit4]   2> 320 T2173 oasc.CoreContainer.load Registering Log Listener
[junit4:junit4]   2> 332 T2173 oasc.CoreContainer.initZooKeeper Zookeeper client=127.0.0.1:44771/solr
[junit4:junit4]   2> 333 T2173 oasc.ZkController.checkChrootPath zkHost includes chroot
[junit4:junit4]   2> 333 T2173 oaz.ZooKeeper.<init> Initiating client connection, connectString=127.0.0.1:44771 sessionTimeout=60000 watcher=org.apache.solr.common.cloud.ConnectionManager@1f57d2d
[junit4:junit4]   2> 334 T2173 oascc.ConnectionManager.waitForConnected Waiting for client to connect to ZooKeeper
[junit4:junit4]   2> 334 T2192 oaz.ClientCnxn$SendThread.logStartConnect Opening socket connection to server localhost.localdomain/127.0.0.1:44771. Will not attempt to authenticate using SASL (access denied ("javax.security.auth.AuthPermission" "getLoginConfiguration"))
[junit4:junit4]   2> 335 T2192 oaz.ClientCnxn$SendThread.primeConnection Socket connection established to localhost.localdomain/127.0.0.1:44771, initiating session
[junit4:junit4]   2> 335 T2175 oazs.NIOServerCnxnFactory.run Accepted socket connection from /127.0.0.1:47429
[junit4:junit4]   2> 335 T2175 oazs.ZooKeeperServer.processConnectRequest Client attempting to establish new session at /127.0.0.1:47429
[junit4:junit4]   2> 336 T2177 oazs.ZooKeeperServer.finishSessionInit Established session 0x13d4e3d7aba0002 with negotiated timeout 20000 for client /127.0.0.1:47429
[junit4:junit4]   2> 336 T2192 oaz.ClientCnxn$SendThread.onConnected Session establishment complete on server localhost.localdomain/127.0.0.1:44771, sessionid = 0x13d4e3d7aba0002, negotiated timeout = 20000
[junit4:junit4]   2> 337 T2193 oascc.ConnectionManager.process Watcher org.apache.solr.common.cloud.ConnectionManager@1f57d2d name:ZooKeeperConnection Watcher:127.0.0.1:44771 got event WatchedEvent state:SyncConnected type:None path:null path:null type:None
[junit4:junit4]   2> 337 T2173 oascc.ConnectionManager.waitForConnected Client is connected to ZooKeeper
[junit4:junit4]   2> 338 T2178 oazs.PrepRequestProcessor.pRequest2Txn Processed session termination for sessionid: 0x13d4e3d7aba0002
[junit4:junit4]   2> 339 T2193 oaz.ClientCnxn$EventThread.run EventThread shut down
[junit4:junit4]   2> 339 T2175 oazs.NIOServerCnxn.closeSock Closed socket connection for client /127.0.0.1:47429 which had sessionid 0x13d4e3d7aba0002
[junit4:junit4]   2> 339 T2173 oaz.ZooKeeper.close Session: 0x13d4e3d7aba0002 closed
[junit4:junit4]   2> 339 T2173 oascsi.HttpClientUtil.createClient Creating new http client, config:maxConnections=500&maxConnectionsPerHost=16&socketTimeout=120000&connTimeout=15000
[junit4:junit4]   2> 342 T2173 oaz.ZooKeeper.<init> Initiating client connection, connectString=127.0.0.1:44771/solr sessionTimeout=30000 watcher=org.apache.solr.common.cloud.ConnectionManager@d15349
[junit4:junit4]   2> 343 T2173 oascc.ConnectionManager.waitForConnected Waiting for client to connect to ZooKeeper
[junit4:junit4]   2> 343 T2194 oaz.ClientCnxn$SendThread.logStartConnect Opening socket connection to server localhost.localdomain/127.0.0.1:44771. Will not attempt to authenticate using SASL (access denied ("javax.security.auth.AuthPermission" "getLoginConfiguration"))
[junit4:junit4]   2> 344 T2194 oaz.ClientCnxn$SendThread.primeConnection Socket connection established to localhost.localdomain/127.0.0.1:44771, initiating session
[junit4:junit4]   2> 344 T2175 oazs.NIOServerCnxnFactory.run Accepted socket connection from /127.0.0.1:47430
[junit4:junit4]   2> 344 T2175 oazs.ZooKeeperServer.processConnectRequest Client attempting to establish new session at /127.0.0.1:47430
[junit4:junit4]   2> 345 T2177 oazs.ZooKeeperServer.finishSessionInit Established session 0x13d4e3d7aba0003 with negotiated timeout 20000 for client /127.0.0.1:47430
[junit4:junit4]   2> 345 T2194 oaz.ClientCnxn$SendThread.onConnected Session establishment complete on server localhost.localdomain/127.0.0.1:44771, sessionid = 0x13d4e3d7aba0003, negotiated timeout = 20000
[junit4:junit4]   2> 345 T2195 oascc.ConnectionManager.process Watcher org.apache.solr.common.cloud.ConnectionManager@d15349 name:ZooKeeperConnection Watcher:127.0.0.1:44771/solr got event WatchedEvent state:SyncConnected type:None path:null path:null type:None
[junit4:junit4]   2> 345 T2173 oascc.ConnectionManager.waitForConnected Client is connected to ZooKeeper
[junit4:junit4]   2> 347 T2178 oazs.PrepRequestProcessor.pRequest Got user-level KeeperException when processing sessionid:0x13d4e3d7aba0003 type:create cxid:0x2 zxid:0x1a txntype:-1 reqpath:n/a Error Path:/solr/overseer Error:KeeperErrorCode = NodeExists for /solr/overseer
[junit4:junit4]   2> 348 T2173 oascc.SolrZkClient.makePath makePath: /live_nodes
[junit4:junit4]   2> 349 T2173 oasc.ZkController.createEphemeralLiveNode Register node as live in ZooKeeper:/live_nodes/127.0.0.1:53397_fb_ywo%2Fa
[junit4:junit4]   2> 350 T2178 oazs.PrepRequestProcessor.pRequest Got user-level KeeperException when processing sessionid:0x13d4e3d7aba0003 type:delete cxid:0x8 zxid:0x1c txntype:-1 reqpath:n/a Error Path:/solr/live_nodes/127.0.0.1:53397_fb_ywo%2Fa Error:KeeperErrorCode = NoNode for /solr/live_nodes/127.0.0.1:53397_fb_ywo%2Fa
[junit4:junit4]   2> 350 T2173 oascc.SolrZkClient.makePath makePath: /live_nodes/127.0.0.1:53397_fb_ywo%2Fa
[junit4:junit4]   2> 353 T2173 oascc.SolrZkClient.makePath makePath: /overseer_elect/election
[junit4:junit4]   2> 355 T2178 oazs.PrepRequestProcessor.pRequest Got user-level KeeperException when processing sessionid:0x13d4e3d7aba0003 type:delete cxid:0x16 zxid:0x21 txntype:-1 reqpath:n/a Error Path:/solr/overseer_elect/leader Error:KeeperErrorCode = NoNode for /solr/overseer_elect/leader
[junit4:junit4]   2> 356 T2173 oascc.SolrZkClient.makePath makePath: /overseer_elect/leader
[junit4:junit4]   2> 359 T2173 oasc.Overseer.start Overseer (id=89313593576259587-127.0.0.1:53397_fb_ywo%2Fa-n_0000000000) starting
[junit4:junit4]   2> 359 T2178 oazs.PrepRequestProcessor.pRequest Got user-level KeeperException when processing sessionid:0x13d4e3d7aba0003 type:create cxid:0x1b zxid:0x23 txntype:-1 reqpath:n/a Error Path:/solr/overseer Error:KeeperErrorCode = NodeExists for /solr/overseer
[junit4:junit4]   2> 360 T2178 oazs.PrepRequestProcessor.pRequest Got user-level KeeperException when processing sessionid:0x13d4e3d7aba0003 type:create cxid:0x1c zxid:0x24 txntype:-1 reqpath:n/a Error Path:/solr/overseer Error:KeeperErrorCode = NodeExists for /solr/overseer
[junit4:junit4]   2> 361 T2178 oazs.PrepRequestProcessor.pRequest Got user-level KeeperException when processing sessionid:0x13d4e3d7aba0003 type:create cxid:0x1d zxid:0x25 txntype:-1 reqpath:n/a Error Path:/solr/overseer Error:KeeperErrorCode = NodeExists for /solr/overseer
[junit4:junit4]   2> 362 T2178 oazs.PrepRequestProcessor.pRequest Got user-level KeeperException when processing sessionid:0x13d4e3d7aba0003 type:create cxid:0x1e zxid:0x26 txntype:-1 reqpath:n/a Error Path:/solr/overseer Error:KeeperErrorCode = NodeExists for /solr/overseer
[junit4:junit4]   2> 363 T2197 oasc.OverseerCollectionProcessor.run Process current queue of collection creations
[junit4:junit4]   2> 363 T2173 oascc.SolrZkClient.makePath makePath: /clusterstate.json
[junit4:junit4]   2> 365 T2173 oascc.SolrZkClient.makePath makePath: /aliases.json
[junit4:junit4]   2> 366 T2173 oascc.ZkStateReader.createClusterStateWatchersAndUpdate Updating cluster state from ZooKeeper... 
[junit4:junit4]   2> 368 T2196 oasc.Overseer$ClusterStateUpdater.run Starting to work on the main queue
[junit4:junit4]   2> 370 T2173 oass.SolrDispatchFilter.init user.dir=/mnt/ssd/jenkins/workspace/Lucene-Solr-4.x-Linux/solr/build/solr-core/test/J1
[junit4:junit4]   2> 370 T2173 oass.SolrDispatchFilter.init SolrDispatchFilter.init() done
[junit4:junit4]   2> 370 T2173 oascsi.HttpClientUtil.createClient Creating new http client, config:maxConnections=128&maxConnectionsPerHost=32&followRedirects=false
[junit4:junit4]   2> 373 T2173 oascsi.HttpClientUtil.createClient Creating new http client, config:
[junit4:junit4]   2> 374 T2173 oaz.ZooKeeper.<init> Initiating client connection, connectString=127.0.0.1:44771/solr sessionTimeout=10000 watcher=org.apache.solr.common.cloud.ConnectionManager@1d8d77b
[junit4:junit4]   2> 374 T2173 oascc.ConnectionManager.waitForConnected Waiting for client to connect to ZooKeeper
[junit4:junit4]   2> 374 T2199 oaz.ClientCnxn$SendThread.logStartConnect Opening socket connection to server localhost.localdomain/127.0.0.1:44771. Will not attempt to authenticate using SASL (access denied ("javax.security.auth.AuthPermission" "getLoginConfiguration"))
[junit4:junit4]   2> 375 T2199 oaz.ClientCnxn$SendThread.primeConnection Socket connection established to localhost.localdomain/127.0.0.1:44771, initiating session
[junit4:junit4]   2> 375 T2175 oazs.NIOServerCnxnFactory.run Accepted socket connection from /127.0.0.1:47431
[junit4:junit4]   2> 375 T2175 oazs.ZooKeeperServer.processConnectRequest Client attempting to establish new session at /127.0.0.1:47431
[junit4:junit4]   2> 377 T2177 oazs.ZooKeeperServer.finishSessionInit Established session 0x13d4e3d7aba0004 with negotiated timeout 10000 for client /127.0.0.1:47431
[junit4:junit4]   2> 377 T2199 oaz.ClientCnxn$SendThread.onConnected Session establishment complete on server localhost.localdomain/127.0.0.1:44771, sessionid = 0x13d4e3d7aba0004, negotiated timeout = 10000
[junit4:junit4]   2> 377 T2200 oascc.ConnectionManager.process Watcher org.apache.solr.common.cloud.ConnectionManager@1d8d77b name:ZooKeeperConnection Watcher:127.0.0.1:44771/solr got event WatchedEvent state:SyncConnected type:None path:null path:null type:None
[junit4:junit4]   2> 377 T2173 oascc.ConnectionManager.waitForConnected Client is connected to ZooKeeper
[junit4:junit4]   2> 379 T2173 oascc.ZkStateReader.createClusterStateWatchersAndUpdate Updating cluster state from ZooKeeper... 
[junit4:junit4]   2> 381 T2173 oasc.ChaosMonkey.monkeyLog monkey: init - expire sessions:true cause connection loss:true
[junit4:junit4]   2> 437 T2173 oejs.Server.doStart jetty-8.1.8.v20121106
[junit4:junit4]   2> 439 T2173 oejs.AbstractConnector.doStart Started SelectChannelConnector@127.0.0.1:54993
[junit4:junit4]   2> 440 T2173 oass.SolrDispatchFilter.init SolrDispatchFilter.init()
[junit4:junit4]   2> 440 T2173 oasc.SolrResourceLoader.locateSolrHome JNDI not configured for solr (NoInitialContextEx)
[junit4:junit4]   2> 441 T2173 oasc.SolrResourceLoader.locateSolrHome using system property solr.solr.home: /mnt/ssd/jenkins/workspace/Lucene-Solr-4.x-Linux/solr/build/solr-core/test/J1/./org.apache.solr.cloud.UnloadDistributedZkTest-jetty1-1362817285168
[junit4:junit4]   2> 441 T2173 oasc.CoreContainer$Initializer.initialize looking for solr config file: /mnt/ssd/jenkins/workspace/Lucene-Solr-4.x-Linux/solr/build/solr-core/test/J1/./org.apache.solr.cloud.UnloadDistributedZkTest-jetty1-1362817285168/solr.xml
[junit4:junit4]   2> 441 T2173 oasc.CoreContainer.<init> New CoreContainer 2247513
[junit4:junit4]   2> 442 T2173 oasc.CoreContainer.load Loading CoreContainer using Solr Home: '/mnt/ssd/jenkins/workspace/Lucene-Solr-4.x-Linux/solr/build/solr-core/test/J1/./org.apache.solr.cloud.UnloadDistributedZkTest-jetty1-1362817285168/'
[junit4:junit4]   2> 442 T2173 oasc.SolrResourceLoader.<init> new SolrResourceLoader for directory: '/mnt/ssd/jenkins/workspace/Lucene-Solr-4.x-Linux/solr/build/solr-core/test/J1/./org.apache.solr.cloud.UnloadDistributedZkTest-jetty1-1362817285168/'
[junit4:junit4]   2> 462 T2173 oashc.HttpShardHandlerFactory.getParameter Setting socketTimeout to: 120000
[junit4:junit4]   2> 462 T2173 oashc.HttpShardHandlerFactory.getParameter Setting urlScheme to: http://
[junit4:junit4]   2> 462 T2173 oashc.HttpShardHandlerFactory.getParameter Setting connTimeout to: 15000
[junit4:junit4]   2> 463 T2173 oashc.HttpShardHandlerFactory.getParameter Setting maxConnectionsPerHost to: 20
[junit4:junit4]   2> 463 T2173 oashc.HttpShardHandlerFactory.getParameter Setting corePoolSize to: 0
[junit4:junit4]   2> 464 T2173 oashc.HttpShardHandlerFactory.getParameter Setting maximumPoolSize to: 2147483647
[junit4:junit4]   2> 464 T2173 oashc.HttpShardHandlerFactory.getParameter Setting maxThreadIdleTime to: 5
[junit4:junit4]   2> 464 T2173 oashc.HttpShardHandlerFactory.getParameter Setting sizeOfQueue to: -1
[junit4:junit4]   2> 465 T2173 oashc.HttpShardHandlerFactory.getParameter Setting fairnessPolicy to: false
[junit4:junit4]   2> 465 T2173 oascsi.HttpClientUtil.createClient Creating new http client, config:maxConnectionsPerHost=20&maxConnections=10000&socketTimeout=120000&connTimeout=15000&retry=false
[junit4:junit4]   2> 472 T2173 oasc.CoreContainer.load Registering Log Listener
[junit4:junit4]   2> 484 T2173 oasc.CoreContainer.initZooKeeper Zookeeper client=127.0.0.1:44771/solr
[junit4:junit4]   2> 484 T2173 oasc.ZkController.checkChrootPath zkHost includes chroot
[junit4:junit4]   2> 485 T2173 oaz.ZooKeeper.<init> Initiating client connection, connectString=127.0.0.1:44771 sessionTimeout=60000 watcher=org.apache.solr.common.cloud.ConnectionManager@14f95b0
[junit4:junit4]   2> 486 T2173 oascc.ConnectionManager.waitForConnected Waiting for client to connect to ZooKeeper
[junit4:junit4]   2> 486 T2210 oaz.ClientCnxn$SendThread.logStartConnect Opening socket connection to server localhost.localdomain/127.0.0.1:44771. Will not attempt to authenticate using SASL (access denied ("javax.security.auth.AuthPermission" "getLoginConfiguration"))
[junit4:junit4]   2> 487 T2210 oaz.ClientCnxn$SendThread.primeConnection Socket connection established to localhost.localdomain/127.0.0.1:44771, initiating session
[junit4:junit4]   2> 487 T2175 oazs.NIOServerCnxnFactory.run Accepted socket connection from /127.0.0.1:47432
[junit4:junit4]   2> 487 T2175 oazs.ZooKeeperServer.processConnectRequest Client attempting to establish new session at /127.0.0.1:47432
[junit4:junit4]   2> 488 T2177 oazs.ZooKeeperServer.finishSessionInit Established session 0x13d4e3d7aba0005 with negotiated timeout 20000 for client /127.0.0.1:47432
[junit4:junit4]   2> 488 T2210 oaz.ClientCnxn$SendThread.onConnected Session establishment complete on server localhost.localdomain/127.0.0.1:44771, sessionid = 0x13d4e3d7aba0005, negotiated timeout = 20000
[junit4:junit4]   2> 488 T2211 oascc.ConnectionManager.process Watcher org.apache.solr.common.cloud.ConnectionManager@14f95b0 name:ZooKeeperConnection Watcher:127.0.0.1:44771 got event WatchedEvent state:SyncConnected type:None path:null path:null type:None
[junit4:junit4]   2> 489 T2173 oascc.ConnectionManager.waitForConnected Client is connected to ZooKeeper
[junit4:junit4]   2> 490 T2178 oazs.PrepRequestProcessor.pRequest2Txn Processed session termination for sessionid: 0x13d4e3d7aba0005
[junit4:junit4]   2> 491 T2211 oaz.ClientCnxn$EventThread.run EventThread shut down
[junit4:junit4]   2> 491 T2175 oazs.NIOServerCnxn.closeSock Closed socket connection for client /127.0.0.1:47432 which had sessionid 0x13d4e3d7aba0005
[junit4:junit4]   2> 491 T2173 oaz.ZooKeeper.close Session: 0x13d4e3d7aba0005 closed
[junit4:junit4]   2> 491 T2173 oascsi.HttpClientUtil.createClient Creating new http client, config:maxConnections=500&maxConnectionsPerHost=16&socketTimeout=120000&connTimeout=15000
[junit4:junit4]   2> 494 T2173 oaz.ZooKeeper.<init> Initiating client connection, connectString=127.0.0.1:44771/solr sessionTimeout=30000 watcher=org.apache.solr.common.cloud.ConnectionManager@187092e
[junit4:junit4]   2> 495 T2212 oaz.ClientCnxn$SendThread.logStartConnect Opening socket connection to server localhost.localdomain/127.0.0.1:44771. Will not attempt to authenticate using SASL (access denied ("javax.security.auth.AuthPermission" "getLoginConfiguration"))
[junit4:junit4]   2> 495 T2173 oascc.ConnectionManager.waitForConnected Waiting for client to connect to ZooKeeper
[junit4:junit4]   2> 495 T2212 oaz.ClientCnxn$SendThread.primeConnection Socket connection established to localhost.localdomain/127.0.0.1:44771, initiating session
[junit4:junit4]   2> 495 T2175 oazs.NIOServerCnxnFactory.run Accepted socket connection from /127.0.0.1:47433
[junit4:junit4]   2> 496 T2175 oazs.ZooKeeperServer.processConnectRequest Client attempting to establish new session at /127.0.0.1:47433
[junit4:junit4]   2> 497 T2177 oazs.ZooKeeperServer.finishSessionInit Established session 0x13d4e3d7aba0006 with negotiated timeout 20000 for client /127.0.0.1:47433
[junit4:junit4]   2> 497 T2212 oaz.ClientCnxn$SendThread.onConnected Session establishment complete on server localhost.localdomain/127.0.0.1:44771, sessionid = 0x13d4e3d7aba0006, negotiated timeout = 20000
[junit4:junit4]   2> 497 T2213 oascc.ConnectionManager.process Watcher org.apache.solr.common.cloud.ConnectionManager@187092e name:ZooKeeperConnection Watcher:127.0.0.1:44771/solr got event WatchedEvent state:SyncConnected type:None path:null path:null type:None
[junit4:junit4]   2> 497 T2173 oascc.ConnectionManager.waitForConnected Client is connected to ZooKeeper
[junit4:junit4]   2> 498 T2178 oazs.PrepRequestProcessor.pRequest Got user-level KeeperException when processing sessionid:0x13d4e3d7aba0006 type:create cxid:0x1 zxid:0x2e txntype:-1 reqpath:n/a Error Path:/solr/overseer Error:KeeperErrorCode = NodeExists for /solr/overseer
[junit4:junit4]   2> 499 T2178 oazs.PrepRequestProcessor.pRequest Got user-level KeeperException when processing sessionid:0x13d4e3d7aba0006 type:create cxid:0x2 zxid:0x2f txntype:-1 reqpath:n/a Error Path:/solr/overseer Error:KeeperErrorCode = NodeExists for /solr/overseer
[junit4:junit4]   2> 500 T2173 oascc.ZkStateReader.createClusterStateWatchersAndUpdate Updating cluster state from ZooKeeper... 
[junit4:junit4]   2> 1503 T2173 oasc.ZkController.createEphemeralLiveNode Register node as live in ZooKeeper:/live_nodes/127.0.0.1:54993_fb_ywo%2Fa
[junit4:junit4]   2> 1503 T2178 oazs.PrepRequestProcessor.pRequest Got user-level KeeperException when processing sessionid:0x13d4e3d7aba0006 type:delete cxid:0xb zxid:0x30 txntype:-1 reqpath:n/a Error Path:/solr/live_nodes/127.0.0.1:54993_fb_ywo%2Fa Error:KeeperErrorCode = NoNode for /solr/live_nodes/127.0.0.1:54993_fb_ywo%2Fa
[junit4:junit4]   2> 1504 T2173 oascc.SolrZkClient.makePath makePath: /live_nodes/127.0.0.1:54993_fb_ywo%2Fa
[junit4:junit4]   2> 1507 T2213 oascc.ZkStateReader$3.process Updating live nodes... (2)
[junit4:junit4]   2> 1507 T2195 oascc.ZkStateReader$3.process Updating live nodes... (2)
[junit4:junit4]   2> 1507 T2200 oascc.ZkStateReader$3.process Updating live nodes... (2)
[junit4:junit4]   2> 1511 T2173 oass.SolrDispatchFilter.init user.dir=/mnt/ssd/jenkins/workspace/Lucene-Solr-4.x-Linux/solr/build/solr-core/test/J1
[junit4:junit4]   2> 1511 T2173 oass.SolrDispatchFilter.init SolrDispatchFilter.init() done
[junit4:junit4]   2> 1511 T2173 oascsi.HttpClientUtil.createClient Creating new http client, config:maxConnections=128&maxConnectionsPerHost=32&followRedirects=false
[junit4:junit4]   2> 1573 T2173 oejs.Server.doStart jetty-8.1.8.v20121106
[junit4:junit4]   2> 1575 T2173 oejs.AbstractConnector.doStart Started SelectChannelConnector@127.0.0.1:40007
[junit4:junit4]   2> 1576 T2173 oass.SolrDispatchFilter.init SolrDispatchFilter.init()
[junit4:junit4]   2> 1576 T2173 oasc.SolrResourceLoader.locateSolrHome JNDI not configured for solr (NoInitialContextEx)
[junit4:junit4]   2> 1577 T2173 oasc.SolrResourceLoader.locateSolrHome using system property solr.solr.home: /mnt/ssd/jenkins/workspace/Lucene-Solr-4.x-Linux/solr/build/solr-core/test/J1/./org.apache.solr.cloud.UnloadDistributedZkTest-jetty2-1362817286301
[junit4:junit4]   2> 1577 T2173 oasc.CoreContainer$Initializer.initialize looking for solr config file: /mnt/ssd/jenkins/workspace/Lucene-Solr-4.x-Linux/solr/build/solr-core/test/J1/./org.apache.solr.cloud.UnloadDistributedZkTest-jetty2-1362817286301/solr.xml
[junit4:junit4]   2> 1577 T2173 oasc.CoreContainer.<init> New CoreContainer 31495385
[junit4:junit4]   2> 1578 T2173 oasc.CoreContainer.load Loading CoreContainer using Solr Home: '/mnt/ssd/jenkins/workspace/Lucene-Solr-4.x-Linux/solr/build/solr-core/test/J1/./org.apache.solr.cloud.UnloadDistributedZkTest-jetty2-1362817286301/'
[junit4:junit4]   2> 1578 T2173 oasc.SolrResourceLoader.<init> new SolrResourceLoader for directory: '/mnt/ssd/jenkins/workspace/Lucene-Solr-4.x-Linux/solr/build/solr-core/test/J1/./org.apache.solr.cloud.UnloadDistributedZkTest-jetty2-1362817286301/'
[junit4:junit4]   2> 1598 T2173 oashc.HttpShardHandlerFactory.getParameter Setting socketTimeout to: 120000
[junit4:junit4]   2> 1598 T2173 oashc.HttpShardHandlerFactory.getParameter Setting urlScheme to: http://
[junit4:junit4]   2> 1599 T2173 oashc.HttpShardHandlerFactory.getParameter Setting connTimeout to: 15000
[junit4:junit4]   2> 1599 T2173 oashc.HttpShardHandlerFactory.getParameter Setting maxConnectionsPerHost to: 20
[junit4:junit4]   2> 1599 T2173 oashc.HttpShardHandlerFactory.getParameter Setting corePoolSize to: 0
[junit4:junit4]   2> 1600 T2173 oashc.HttpShardHandlerFactory.getParameter Setting maximumPoolSize to: 2147483647
[junit4:junit4]   2> 1600 T2173 oashc.HttpShardHandlerFactory.getParameter Setting maxThreadIdleTime to: 5
[junit4:junit4]   2> 1600 T2173 oashc.HttpShardHandlerFactory.getParameter Setting sizeOfQueue to: -1
[junit4:junit4]   2> 1601 T2173 oashc.HttpShardHandlerFactory.getParameter Setting fairnessPolicy to: false
[junit4:junit4]   2> 1601 T2173 oascsi.HttpClientUtil.createClient Creating new http client, config:maxConnectionsPerHost=20&maxConnections=10000&socketTimeout=120000&connTimeout=15000&retry=false
[junit4:junit4]   2> 1608 T2173 oasc.CoreContainer.load Registering Log Listener
[junit4:junit4]   2> 1620 T2173 oasc.CoreContainer.initZooKeeper Zookeeper client=127.0.0.1:44771/solr
[junit4:junit4]   2> 1620 T2173 oasc.ZkController.checkChrootPath zkHost includes chroot
[junit4:junit4]   2> 1621 T2173 oaz.ZooKeeper.<init> Initiating client connection, connectString=127.0.0.1:44771 sessionTimeout=60000 watcher=org.apache.solr.common.cloud.ConnectionManager@121753d
[junit4:junit4]   2> 1622 T2173 oascc.ConnectionManager.waitForConnected Waiting for client to connect to ZooKeeper
[junit4:junit4]   2> 1622 T2224 oaz.ClientCnxn$SendThread.logStartConnect Opening socket connection to server localhost.localdomain/127.0.0.1:44771. Will not attempt to authenticate using SASL (access denied ("javax.security.auth.AuthPermission" "getLoginConfiguration"))
[junit4:junit4]   2> 1623 T2224 oaz.ClientCnxn$SendThread.primeConnection Socket connection established to localhost.localdomain/127.0.0.1:44771, initiating session
[junit4:junit4]   2> 1623 T2175 oazs.NIOServerCnxnFactory.run Accepted socket connection from /127.0.0.1:47434
[junit4:junit4]   2> 1623 T2175 oazs.ZooKeeperServer.processConnectRequest Client attempting to establish new session at /127.0.0.1:47434
[junit4:junit4]   2> 1624 T2177 oazs.ZooKeeperServer.finishSessionInit Established session 0x13d4e3d7aba0007 with negotiated timeout 20000 for client /127.0.0.1:47434
[junit4:junit4]   2> 1624 T2224 oaz.ClientCnxn$SendThread.onConnected Session establishment complete on server localhost.localdomain/127.0.0.1:44771, sessionid = 0x13d4e3d7aba0007, negotiated timeout = 20000
[junit4:junit4]   2> 1624 T2225 oascc.ConnectionManager.process Watcher org.apache.solr.common.cloud.ConnectionManager@121753d name:ZooKeeperConnection Watcher:127.0.0.1:44771 got event WatchedEvent state:SyncConnected type:None path:null path:null type:None
[junit4:junit4]   2> 1625 T2173 oascc.ConnectionManager.waitForConnected Client is connected to ZooKeeper
[junit4:junit4]   2> 1626 T2178 oazs.PrepRequestProcessor.pRequest2Txn Processed session termination for sessionid: 0x13d4e3d7aba0007
[junit4:junit4]   2> 1626 T2225 oaz.ClientCnxn$EventThread.run EventThread shut down
[junit4:junit4]   2> 1626 T2175 oazs.NIOServerCnxn.closeSock Closed socket connection for client /127.0.0.1:47434 which had sessionid 0x13d4e3d7aba0007
[junit4:junit4]   2> 1626 T2173 oaz.ZooKeeper.close Session: 0x13d4e3d7aba0007 closed
[junit4:junit4]   2> 1627 T2173 oascsi.HttpClientUtil.createClient Creating new http client, config:maxConnections=500&maxConnectionsPerHost=16&socketTimeout=120000&connTimeout=15000
[junit4:junit4]   2> 1630 T2173 oaz.ZooKeeper.<init> Initiating client connection, connectString=127.0.0.1:44771/solr sessionTimeout=30000 watcher=org.apache.solr.common.cloud.ConnectionManager@1332970
[junit4:junit4]   2> 1631 T2173 oascc.ConnectionManager.waitForConnected Waiting for client to connect to ZooKeeper
[junit4:junit4]   2> 1631 T2226 oaz.ClientCnxn$SendThread.logStartConnect Opening socket connection to server localhost.localdomain/127.0.0.1:44771. Will not attempt to authenticate using SASL (access denied ("javax.security.auth.AuthPermission" "getLoginConfiguration"))
[junit4:junit4]   2> 1631 T2226 oaz.ClientCnxn$SendThread.primeConnection Socket connection established to localhost.localdomain/127.0.0.1:44771, initiating session
[junit4:junit4]   2> 1631 T2175 oazs.NIOServerCnxnFactory.run Accepted socket connection from /127.0.0.1:47435
[junit4:junit4]   2> 1632 T2175 oazs.ZooKeeperServer.processConnectRequest Client attempting to establish new session at /127.0.0.1:47435
[junit4:junit4]   2> 1632 T2177 oazs.ZooKeeperServer.finishSessionInit Established session 0x13d4e3d7aba0008 with negotiated timeout 20000 for client /127.0.0.1:47435
[junit4:junit4]   2> 1632 T2226 oaz.ClientCnxn$SendThread.onConnected Session establishment complete on server localhost.localdomain/127.0.0.1:44771, sessionid = 0x13d4e3d7aba0008, negotiated timeout = 20000
[junit4:junit4]   2> 1633 T2227 oascc.ConnectionManager.process Watcher org.apache.solr.common.cloud.ConnectionManager@1332970 name:ZooKeeperConnection Watcher:127.0.0.1:44771/solr got event WatchedEvent state:SyncConnected type:None path:null path:null type:None
[junit4:junit4]   2> 1633 T2173 oascc.ConnectionManager.waitForConnected Client is connected to ZooKeeper
[junit4:junit4]   2> 1634 T2178 oazs.PrepRequestProcessor.pRequest Got user-level KeeperException when processing sessionid:0x13d4e3d7aba0008 type:create cxid:0x1 zxid:0x36 txntype:-1 reqpath:n/a Error Path:/solr/overseer Error:KeeperErrorCode = NodeExists for /solr/overseer
[junit4:junit4]   2> 1634 T2178 oazs.PrepRequestProcessor.pRequest Got user-level KeeperException when processing sessionid:0x13d4e3d7aba0008 type:create cxid:0x2 zxid:0x37 txntype:-1 reqpath:n/a Error Path:/solr/overseer Error:KeeperErrorCode = NodeExists for /solr/overseer
[junit4:junit4]   2> 1636 T2173 oascc.ZkStateReader.createClusterStateWatchersAndUpdate Updating cluster state from ZooKeeper... 
[junit4:junit4]   2> 2638 T2173 oasc.ZkController.createEphemeralLiveNode Register node as live in ZooKeeper:/live_nodes/127.0.0.1:40007_fb_ywo%2Fa
[junit4:junit4]   2> 2639 T2178 oazs.PrepRequestProcessor.pRequest Got user-level KeeperException when processing sessionid:0x13d4e3d7aba0008 type:delete cxid:0xb zxid:0x38 txntype:-1 reqpath:n/a Error Path:/solr/live_nodes/127.0.0.1:40007_fb_ywo%2Fa Error:KeeperErrorCode = NoNode for /solr/live_nodes/127.0.0.1:40007_fb_ywo%2Fa
[junit4:junit4]   2> 2639 T2173 oascc.SolrZkClient.makePath makePath: /live_nodes/127.0.0.1:40007_fb_ywo%2Fa
[junit4:junit4]   2> 2642 T2200 oascc.ZkStateReader$3.process Updating live nodes... (3)
[junit4:junit4]   2> 2643 T2213 oascc.ZkStateReader$3.process Updating live nodes... (3)
[junit4:junit4]   2> 2643 T2227 oascc.ZkStateReader$3.process Updating live nodes... (3)
[junit4:junit4]   2> 2643 T2195 oascc.ZkStateReader$3.process Updating live nodes... (3)
[junit4:junit4]   2> 2648 T2173 oass.SolrDispatchFilter.init user.dir=/mnt/ssd/jenkins/workspace/Lucene-Solr-4.x-Linux/solr/build/solr-core/test/J1
[junit4:junit4]   2> 2649 T2173 oass.SolrDispatchFilter.init SolrDispatchFilter.init() done
[junit4:junit4]   2> 2649 T2173 oascsi.HttpClientUtil.createClient Creating new http client, config:maxConnections=128&maxConnectionsPerHost=32&followRedirects=false
[junit4:junit4]   2> 2731 T2173 oejs.Server.doStart jetty-8.1.8.v20121106
[junit4:junit4]   2> 2733 T2173 oejs.AbstractConnector.doStart Started SelectChannelConnector@127.0.0.1:33223
[junit4:junit4]   2> 2734 T2173 oass.SolrDispatchFilter.init SolrDispatchFilter.init()
[junit4:junit4]   2> 2734 T2173 oasc.SolrResourceLoader.locateSolrHome JNDI not configured for solr (NoInitialContextEx)
[junit4:junit4]   2> 2735 T2173 oasc.SolrResourceLoader.locateSolrHome using system property solr.solr.home: /mnt/ssd/jenkins/workspace/Lucene-Solr-4.x-Linux/solr/build/solr-core/test/J1/./org.apache.solr.cloud.UnloadDistributedZkTest-jetty3-1362817287440
[junit4:junit4]   2> 2735 T2173 oasc.CoreContainer$Initializer.initialize looking for solr config file: /mnt/ssd/jenkins/workspace/Lucene-Solr-4.x-Linux/solr/build/solr-core/test/J1/./org.apache.solr.cloud.UnloadDistributedZkTest-jetty3-1362817287440/solr.xml
[junit4:junit4]   2> 2735 T2173 oasc.CoreContainer.<init> New CoreContainer 1562923
[junit4:junit4]   2> 2736 T2173 oasc.CoreContainer.load Loading CoreContainer using Solr Home: '/mnt/ssd/jenkins/workspace/Lucene-Solr-4.x-Linux/solr/build/solr-core/test/J1/./org.apache.solr.cloud.UnloadDistributedZkTest-jetty3-1362817287440/'
[junit4:junit4]   2> 2736 T2173 oasc.SolrResourceLoader.<init> new SolrResourceLoader for directory: '/mnt/ssd/jenkins/workspace/Lucene-Solr-4.x-Linux/solr/build/solr-core/test/J1/./org.apache.solr.cloud.UnloadDistributedZkTest-jetty3-1362817287440/'
[junit4:junit4]   2> 2759 T2173 oashc.HttpShardHandlerFactory.getParameter Setting socketTimeout to: 120000
[junit4:junit4]   2> 2759 T2173 oashc.HttpShardHandlerFactory.getParameter Setting urlScheme to: http://
[junit4:junit4]   2> 2760 T2173 oashc.HttpShardHandlerFactory.getParameter Setting connTimeout to: 15000
[junit4:junit4]   2> 2760 T2173 oashc.HttpShardHandlerFactory.getParameter Setting maxConnectionsPerHost to: 20
[junit4:junit4]   2> 2761 T2173 oashc.HttpShardHandlerFactory.getParameter Setting corePoolSize to: 0
[junit4:junit4]   2> 2761 T2173 oashc.HttpShardHandlerFactory.getParameter Setting maximumPoolSize to: 2147483647
[junit4:junit4]   2> 2762 T2173 oashc.HttpShardHandlerFactory.getParameter Setting maxThreadIdleTime to: 5
[junit4:junit4]   2> 2762 T2173 oashc.HttpShardHandlerFactory.getParameter Setting sizeOfQueue to: -1
[junit4:junit4]   2> 2762 T2173 oashc.HttpShardHandlerFactory.getParameter Setting fairnessPolicy to: false
[junit4:junit4]   2> 2763 T2173 oascsi.HttpClientUtil.createClient Creating new http client, config:maxConnectionsPerHost=20&maxConnections=10000&socketTimeout=120000&connTimeout=15000&retry=false
[junit4:junit4]   2> 2771 T2173 oasc.CoreContainer.load Registering Log Listener
[junit4:junit4]   2> 2786 T2173 oasc.CoreContainer.initZooKeeper Zookeeper client=127.0.0.1:44771/solr
[junit4:junit4]   2> 2787 T2173 oasc.ZkController.checkChrootPath zkHost includes chroot
[junit4:junit4]   2> 2787 T2173 oaz.ZooKeeper.<init> Initiating client connection, connectString=127.0.0.1:44771 sessionTimeout=60000 watcher=org.apache.solr.common.cloud.ConnectionManager@1778703
[junit4:junit4]   2> 2788 T2173 oascc.ConnectionManager.waitForConnected Waiting for client to connect to ZooKeeper
[junit4:junit4]   2> 2789 T2238 oaz.ClientCnxn$SendThread.logStartConnect Opening socket connection to server localhost.localdomain/127.0.0.1:44771. Will not attempt to authenticate using SASL (access denied ("javax.security.auth.AuthPermission" "getLoginConfiguration"))
[junit4:junit4]   2> 2789 T2238 oaz.ClientCnxn$SendThread.primeConnection Socket connection established to localhost.localdomain/127.0.0.1:44771, initiating session
[junit4:junit4]   2> 2789 T2175 oazs.NIOServerCnxnFactory.run Accepted socket connection from /127.0.0.1:47467
[junit4:junit4]   2> 2790 T2175 oazs.ZooKeeperServer.processConnectRequest Client attempting to establish new session at /127.0.0.1:47467
[junit4:junit4]   2> 2790 T2177 oazs.ZooKeeperServer.finishSessionInit Established session 0x13d4e3d7aba0009 with negotiated timeout 20000 for client /127.0.0.1:47467
[junit4:junit4]   2> 2791 T2238 oaz.ClientCnxn$SendThread.onConnected Session establishment complete on server localhost.localdomain/127.0.0.1:44771, sessionid = 0x13d4e3d7aba0009, negotiated timeout = 20000
[junit4:junit4]   2> 2791 T2239 oascc.ConnectionManager.process Watcher org.apache.solr.common.cloud.ConnectionManager@1778703 name:ZooKeeperConnection Watcher:127.0.0.1:44771 got event WatchedEvent state:SyncConnected type:None path:null path:null type:None
[junit4:junit4]   2> 2791 T2173 oascc.ConnectionManager.waitForConnected Client is connected to ZooKeeper
[junit4:junit4]   2> 2792 T2178 oazs.PrepRequestProcessor.pRequest2Txn Processed session termination for sessionid: 0x13d4e3d7aba0009
[junit4:junit4]   2> 2793 T2239 oaz.ClientCnxn$EventThread.run EventThread shut down
[junit4:junit4]   2> 2793 T2175 oazs.NIOServerCnxn.closeSock Closed socket connection for client /127.0.0.1:47467 which had sessionid 0x13d4e3d7aba0009
[junit4:junit4]   2> 2793 T2173 oaz.ZooKeeper.close Session: 0x13d4e3d7aba0009 closed
[junit4:junit4]   2> 2793 T2173 oascsi.HttpClientUtil.createClient Creating new http client, config:maxConnections=500&maxConnectionsPerHost=16&socketTimeout=120000&connTimeout=15000
[junit4:junit4]   2> 2796 T2173 oaz.ZooKeeper.<init> Initiating client connection, connectString=127.0.0.1:44771/solr sessionTimeout=30000 watcher=org.apache.solr.common.cloud.ConnectionManager@35dad7
[junit4:junit4]   2> 2797 T2240 oaz.ClientCnxn$SendThread.logStartConnect Opening socket connection to server localhost.localdomain/127.0.0.1:44771. Will not attempt to authenticate using SASL (access denied ("javax.security.auth.AuthPermission" "getLoginConfiguration"))
[junit4:junit4]   2> 2797 T2173 oascc.ConnectionManager.waitForConnected Waiting for client to connect to ZooKeeper
[junit4:junit4]   2> 2797 T2240 oaz.ClientCnxn$SendThread.primeConnection Socket connection established to localhost.localdomain/127.0.0.1:44771, initiating session
[junit4:junit4]   2> 2798 T2175 oazs.NIOServerCnxnFactory.run Accepted socket connection from /127.0.0.1:47468
[junit4:junit4]   2> 2798 T2175 oazs.ZooKeeperServer.processConnectRequest Client attempting to establish new session at /127.0.0.1:47468
[junit4:junit4]   2> 2799 T2177 oazs.ZooKeeperServer.finishSessionInit Established session 0x13d4e3d7aba000a with negotiated timeout 20000 for client /127.0.0.1:47468
[junit4:junit4]   2> 2799 T2240 oaz.ClientCnxn$SendThread.onConnected Session establishment complete on server localhost.localdomain/127.0.0.1:44771, sessionid = 0x13d4e3d7aba000a, negotiated timeout = 20000
[junit4:junit4]   2> 2799 T2241 oascc.ConnectionManager.process Watcher org.apache.solr.common.cloud.ConnectionManager@35dad7 name:ZooKeeperConnection Watcher:127.0.0.1:44771/solr got event WatchedEvent state:SyncConnected type:None path:null path:null type:None
[junit4:junit4]   2> 2799 T2173 oascc.ConnectionManager.waitForConnected Client is connected to ZooKeeper
[junit4:junit4]   2> 2800 T2178 oazs.PrepRequestProcessor.pRequest Got user-level KeeperException when processing sessionid:0x13d4e3d7aba000a type:create cxid:0x1 zxid:0x3e txntype:-1 reqpath:n/a Error Path:/solr/overseer Error:KeeperErrorCode = NodeExists for /solr/overseer
[junit4:junit4]   2> 2801 T2178 oazs.PrepRequestProcessor.pRequest Got user-level KeeperException when processing sessionid:0x13d4e3d7aba000a type:create cxid:0x2 zxid:0x3f txntype:-1 reqpath:n/a Error Path:/solr/overseer Error:KeeperErrorCode = NodeExists for /solr/overseer
[junit4:junit4]   2> 2802 T2173 oascc.ZkStateReader.createClusterStateWatchersAndUpdate Updating cluster state from ZooKeeper... 
[junit4:junit4]   2> 3804 T2173 oasc.ZkController.createEphemeralLiveNode Register node as live in ZooKeeper:/live_nodes/127.0.0.1:33223_fb_ywo%2Fa
[junit4:junit4]   2> 3805 T2178 oazs.PrepRequestProcessor.pRequest Got user-level KeeperException when processing sessionid:0x13d4e3d7aba000a type:delete cxid:0xb zxid:0x40 txntype:-1 reqpath:n/a Error Path:/solr/live_nodes/127.0.0.1:33223_fb_ywo%2Fa Error:KeeperErrorCode = NoNode for /solr/live_nodes/127.0.0.1:33223_fb_ywo%2Fa
[junit4:junit4]   2> 3806 T2173 oascc.SolrZkClient.makePath makePath: /live_nodes/127.0.0.1:33223_fb_ywo%2Fa
[junit4:junit4]   2> 3808 T2195 oascc.ZkStateReader$3.process Updating live nodes... (4)
[junit4:junit4]   2> 3808 T2213 oascc.ZkStateReader$3.process Updating live nodes... (4)
[junit4:junit4]   2> 3808 T2241 oascc.ZkStateReader$3.process Updating live nodes... (4)
[junit4:junit4]   2> 3808 T2200 oascc.ZkStateReader$3.process Updating live nodes... (4)
[junit4:junit4]   2> 3809 T2227 oascc.ZkStateReader$3.process Updating live nodes... (4)
[junit4:junit4]   2> 3813 T2173 oass.SolrDispatchFilter.init user.dir=/mnt/ssd/jenkins/workspace/Lucene-Solr-4.x-Linux/solr/build/solr-core/test/J1
[junit4:junit4]   2> 3813 T2173 oass.SolrDispatchFilter.init SolrDispatchFilter.init() done
[junit4:junit4]   2> 3814 T2173 oascsi.HttpClientUtil.createClient Creating new http client, config:maxConnections=128&maxConnectionsPerHost=32&followRedirects=false
[junit4:junit4]   2> 3889 T2173 oejs.Server.doStart jetty-8.1.8.v20121106
[junit4:junit4]   2> 3891 T2173 oejs.AbstractConnector.doStart Started SelectChannelConnector@127.0.0.1:55973
[junit4:junit4]   2> 3891 T2173 oass.SolrDispatchFilter.init SolrDispatchFilter.init()
[junit4:junit4]   2> 3892 T2173 oasc.SolrResourceLoader.locateSolrHome JNDI not configured for solr (NoInitialContextEx)
[junit4:junit4]   2> 3892 T2173 oasc.SolrResourceLoader.locateSolrHome using system property solr.solr.home: /mnt/ssd/jenkins/workspace/Lucene-Solr-4.x-Linux/solr/build/solr-core/test/J1/./org.apache.solr.cloud.UnloadDistributedZkTest-jetty4-1362817288603
[junit4:junit4]   2> 3893 T2173 oasc.CoreContainer$Initializer.initialize looking for solr config file: /mnt/ssd/jenkins/workspace/Lucene-Solr-4.x-Linux/solr/build/solr-core/test/J1/./org.apache.solr.cloud.UnloadDistributedZkTest-jetty4-1362817288603/solr.xml
[junit4:junit4]   2> 3893 T2173 oasc.CoreContainer.<init> New CoreContainer 2923636
[junit4:junit4]   2> 3894 T2173 oasc.CoreContainer.load Loading CoreContainer using Solr Home: '/mnt/ssd/jenkins/workspace/Lucene-Solr-4.x-Linux/solr/build/solr-core/test/J1/./org.apache.solr.cloud.UnloadDistributedZkTest-jetty4-1362817288603/'
[junit4:junit4]   2> 3894 T2173 oasc.SolrResourceLoader.<init> new SolrResourceLoader for directory: '/mnt/ssd/jenkins/workspace/Lucene-Solr-4.x-Linux/solr/build/solr-core/test/J1/./org.apache.solr.cloud.UnloadDistributedZkTest-jetty4-1362817288603/'
[junit4:junit4]   2> 3921 T2173 oashc.HttpShardHandlerFactory.getParameter Setting socketTimeout to: 120000
[junit4:junit4]   2> 3922 T2173 oashc.HttpShardHandlerFactory.getParameter Setting urlScheme to: http://
[junit4:junit4]   2> 3922 T2173 oashc.HttpShardHandlerFactory.getParameter Setting connTimeout to: 15000
[junit4:junit4]   2> 3923 T2173 oashc.HttpShardHandlerFactory.getParameter Setting maxConnectionsPerHost to: 20
[junit4:junit4]   2> 3923 T2173 oashc.HttpShardHandlerFactory.getParameter Setting corePoolSize to: 0
[junit4:junit4]   2> 3924 T2173 oashc.HttpShardHandlerFactory.getParameter Setting maximumPoolSize to: 2147483647
[junit4:junit4]   2> 3924 T2173 oashc.HttpShardHandlerFactory.getParameter Setting maxThreadIdleTime to: 5
[junit4:junit4]   2> 3925 T2173 oashc.HttpShardHandlerFactory.getParameter Setting sizeOfQueue to: -1
[junit4:junit4]   2> 3925 T2173 oashc.HttpShardHandlerFactory.getParameter Setting fairnessPolicy to: false
[junit4:junit4]   2> 3926 T2173 oascsi.HttpClientUtil.createClient Creating new http client, config:maxConnectionsPerHost=20&maxConnections=10000&socketTimeout=120000&connTimeout=15000&retry=false
[junit4:junit4]   2> 3935 T2173 oasc.CoreContainer.load Registering Log Listener
[junit4:junit4]   2> 3952 T2173 oasc.CoreContainer.initZooKeeper Zookeeper client=127.0.0.1:44771/solr
[junit4:junit4]   2> 3953 T2173 oasc.ZkController.checkChrootPath zkHost includes chroot
[junit4:junit4]   2> 3953 T2173 oaz.ZooKeeper.<init> Initiating client connection, connectString=127.0.0.1:44771 sessionTimeout=60000 watcher=org.apache.solr.common.cloud.ConnectionManager@1994183
[junit4:junit4]   2> 3954 T2252 oaz.ClientCnxn$SendThread.logStartConnect Opening socket connection to server localhost.localdomain/127.0.0.1:44771. Will not attempt to authenticate using SASL (access denied ("javax.security.auth.AuthPermission" "getLoginConfiguration"))
[junit4:junit4]   2> 3954 T2173 oascc.ConnectionManager.waitForConnected Waiting for client to connect to ZooKeeper
[junit4:junit4]   2> 3955 T2252 oaz.ClientCnxn$SendThread.primeConnection Socket connection established to localhost.localdomain/127.0.0.1:44771, initiating session
[junit4:junit4]   2> 3955 T2175 oazs.NIOServerCnxnFactory.run Accepted socket connection from /127.0.0.1:47471
[junit4:junit4]   2> 3955 T2175 oazs.ZooKeeperServer.processConnectRequest Client attempting to establish new session at /127.0.0.1:47471
[junit4:junit4]   2> 3956 T2177 oazs.ZooKeeperServer.finishSessionInit Established session 0x13d4e3d7aba000b with negotiated timeout 20000 for client /127.0.0.1:47471
[junit4:junit4]   2> 3956 T2252 oaz.ClientCnxn$SendThread.onConnected Session establishment complete on server localhost.localdomain/127.0.0.1:44771, sessionid = 0x13d4e3d7aba000b, negotiated timeout = 20000
[junit4:junit4]   2> 3956 T2253 oascc.ConnectionManager.process Watcher org.apache.solr.common.cloud.ConnectionManager@1994183 name:ZooKeeperConnection Watcher:127.0.0.1:44771 got event WatchedEvent state:SyncConnected type:None path:null path:null type:None
[junit4:junit4]   2> 3957 T2173 oascc.ConnectionManager.waitForConnected Client is connected to ZooKeeper
[junit4:junit4]   2> 3958 T2178 oazs.PrepRequestProcessor.pRequest2Txn Processed session termination for sessionid: 0x13d4e3d7aba000b
[junit4:junit4]   2> 3958 T2253 oaz.ClientCnxn$EventThread.run EventThread shut down
[junit4:junit4]   2> 3958 T2175 oazs.NIOServerCnxn.closeSock Closed socket connection for client /127.0.0.1:47471 which had sessionid 0x13d4e3d7aba000b
[junit4:junit4]   2> 3958 T2173 oaz.ZooKeeper.close Session: 0x13d4e3d7aba000b closed
[junit4:junit4]   2> 3959 T2173 oascsi.HttpClientUtil.createClient Creating new http client, config:maxConnections=500&maxConnectionsPerHost=16&socketTimeout=120000&connTimeout=15000
[junit4:junit4]   2> 3963 T2173 oaz.ZooKeeper.<init> Initiating client connection, connectString=127.0.0.1:44771/solr sessionTimeout=30000 watcher=org.apache.solr.common.cloud.ConnectionManager@e73fd4
[junit4:junit4]   2> 3964 T2254 oaz.ClientCnxn$SendThread.logStartConnect Opening socket connection to server localhost.localdomain/127.0.0.1:44771. Will not attempt to authenticate using SASL (access denied ("javax.security.auth.AuthPermission" "getLoginConfiguration"))
[junit4:junit4]   2> 3963 T2173 oascc.ConnectionManager.waitForConnected Waiting for client to connect to ZooKeeper
[junit4:junit4]   2> 3964 T2175 oazs.NIOServerCnxnFactory.run Accepted socket connection from /127.0.0.1:47472
[junit4:junit4]   2> 3964 T2254 oaz.ClientCnxn$SendThread.primeConnection Socket connection established to localhost.localdomain/127.0.0.1:44771, initiating session
[junit4:junit4]   2> 3964 T2175 oazs.ZooKeeperServer.processConnectRequest Client attempting to establish new session at /127.0.0.1:47472
[junit4:junit4]   2> 3965 T2177 oazs.ZooKeeperServer.finishSessionInit Established session 0x13d4e3d7aba000c with negotiated timeout 20000 for client /127.0.0.1:47472
[junit4:junit4]   2> 3965 T2254 oaz.ClientCnxn$SendThread.onConnected Session establishment complete on server localhost.localdomain/127.0.0.1:44771, sessionid = 0x13d4e3d7aba000c, negotiated timeout = 20000
[junit4:junit4]   2> 3965 T2255 oascc.ConnectionManager.process Watcher org.apache.solr.common.cloud.ConnectionManager@e73fd4 name:ZooKeeperConnection Watcher:127.0.0.1:44771/solr got event WatchedEvent state:SyncConnected type:None path:null path:null type:None
[junit4:junit4]   2> 3966 T2173 oascc.ConnectionManager.waitForConnected Client is connected to ZooKeeper
[junit4:junit4]   2> 3967 T2178 oazs.PrepRequestProcessor.pRequest Got user-level KeeperException when processing sessionid:0x13d4e3d7aba000c type:create cxid:0x1 zxid:0x46 txntype:-1 reqpath:n/a Error Path:/solr/overseer Error:KeeperErrorCode = NodeExists for /solr/overseer
[junit4:junit4]   2> 3967 T2178 oazs.PrepRequestProcessor.pRequest Got user-level KeeperException when processing sessionid:0x13d4e3d7aba000c type:create cxid:0x2 zxid:0x47 txntype:-1 reqpath:n/a Error Path:/solr/overseer Error:KeeperErrorCode = NodeExists for /solr/overseer
[junit4:junit4]   2> 3969 T2173 oascc.ZkStateReader.createClusterStateWatchersAndUpdate Updating cluster state from ZooKeeper... 
[junit4:junit4]   2> 4971 T2173 oasc.ZkController.createEphemeralLiveNode Register node as live in ZooKeeper:/live_nodes/127.0.0.1:55973_fb_ywo%2Fa
[junit4:junit4]   2> 4972 T2178 oazs.PrepRequestProcessor.pRequest Got user-level KeeperException when processing sessionid:0x13d4e3d7aba000c type:delete cxid:0xb zxid:0x48 txntype:-1 reqpath:n/a Error Path:/solr/live_nodes/127.0.0.1:55973_fb_ywo%2Fa Error:KeeperErrorCode = NoNode for /solr/live_nodes/127.0.0.1:55973_fb_ywo%2Fa
[junit4:junit4]   2> 4972 T2173 oascc.SolrZkClient.makePath makePath: /live_nodes/127.0.0.1:55973_fb_ywo%2Fa
[junit4:junit4]   2> 4975 T2213 oascc.ZkStateReader$3.process Updating live nodes... (5)
[junit4:junit4]   2> 4976 T2200 oascc.ZkStateReader$3.process Updating live nodes... (5)
[junit4:junit4]   2> 4976 T2241 oascc.ZkStateReader$3.process Updating live nodes... (5)
[junit4:junit4]   2> 4976 T2195 oascc.ZkStateReader$3.process Updating live nodes... (5)
[junit4:junit4]   2> 4976 T2255 oascc.ZkStateReader$3.process Updating live nodes... (5)
[junit4:junit4]   2> 4976 T2227 oascc.ZkStateReader$3.process Updating live nodes... (5)
[junit4:junit4]   2> 4980 T2173 oass.SolrDispatchFilter.init user.dir=/mnt/ssd/jenkins/workspace/Lucene-Solr-4.x-Linux/solr/build/solr-core/test/J1
[junit4:junit4]   2> 4980 T2173 oass.SolrDispatchFilter.init SolrDispatchFilter.init() done
[junit4:junit4]   2> 4981 T2173 oascsi.HttpClientUtil.createClient Creating new http client, config:maxConnections=128&maxConnectionsPerHost=32&followRedirects=false
[junit4:junit4]   2> 4983 T2173 oascsi.HttpClientUtil.createClient Creating new http client, config:maxConnections=128&maxConnectionsPerHost=32&followRedirects=false
[junit4:junit4]   2> 4987 T2207 oasc.CoreContainer.create Creating SolrCore 'unloadcollection1' using instanceDir: /mnt/ssd/jenkins/workspace/Lucene-Solr-4.x-Linux/solr/build/solr-core/test/J1/./org.apache.solr.cloud.UnloadDistributedZkTest-jetty1-1362817285168/unloadcollection1
[junit4:junit4]   2> 4987 T2207 oasc.ZkController.createCollectionZkNode Check for collection zkNode:unloadcollection
[junit4:junit4]   2> 4988 T2207 oasc.ZkController.createCollectionZkNode Creating collection in ZooKeeper:unloadcollection
[junit4:junit4]   2> 4988 T2207 oasc.ZkController.getConfName Looking for collection configName
[junit4:junit4]   2> 4989 T2207 oasc.ZkController.getConfName Only one config set found in zk - using it:conf1
[junit4:junit4]   2> 4990 T2207 oascc.SolrZkClient.makePath makePath: /collections/unloadcollection
[junit4:junit4]   2> 4991 T2207 oasc.ZkController.readConfigName Load collection config from:/collections/unloadcollection
[junit4:junit4]   2> 4992 T2207 oasc.SolrResourceLoader.<init> new SolrResourceLoader for directory: '/mnt/ssd/jenkins/workspace/Lucene-Solr-4.x-Linux/solr/build/solr-core/test/J1/./org.apache.solr.cloud.UnloadDistributedZkTest-jetty1-1362817285168/unloadcollection1/'
[junit4:junit4]   2> 5020 T2207 oasc.SolrConfig.<init> Using Lucene MatchVersion: LUCENE_42
[junit4:junit4]   2> 5076 T2207 oasc.SolrConfig.<init> Loaded SolrConfig: solrconfig.xml
[junit4:junit4]   2> 5077 T2207 oass.IndexSchema.readSchema Reading Solr Schema
[junit4:junit4]   2> 5082 T2207 oass.IndexSchema.readSchema Schema name=test
[junit4:junit4]   2> 5481 T2207 oass.OpenExchangeRatesOrgProvider.init Initialized with rates=open-exchange-rates.json, refreshInterval=1440.
[junit4:junit4]   2> 5487 T2207 oass.IndexSchema.readSchema default search field in schema is text
[junit4:junit4]   2> 5490 T2207 oass.IndexSchema.readSchema unique key field: id
[junit4:junit4]   2> 5500 T2207 oass.FileExchangeRateProvider.reload Reloading exchange rates from file currency.xml
[junit4:junit4]   2> 5504 T2207 oass.FileExchangeRateProvider.reload Reloading exchange rates from file currency.xml
[junit4:junit4]   2> 5507 T2207 oass.OpenExchangeRatesOrgProvider.reload Reloading exchange rates from open-exchange-rates.json
[junit4:junit4]   2> 5508 T2207 oass.OpenExchangeRatesOrgProvider$OpenExchangeRates.<init> WARNING Unknown key IMPORTANT NOTE
[junit4:junit4]   2> 5508 T2207 oass.OpenExchangeRatesOrgProvider$OpenExchangeRates.<init> WARNING Expected key, got STRING
[junit4:junit4]   2> 5509 T2207 oass.OpenExchangeRatesOrgProvider.reload Reloading exchange rates from open-exchange-rates.json
[junit4:junit4]   2> 5509 T2207 oass.OpenExchangeRatesOrgProvider$OpenExchangeRates.<init> WARNING Unknown key IMPORTANT NOTE
[junit4:junit4]   2> 5510 T2207 oass.OpenExchangeRatesOrgProvider$OpenExchangeRates.<init> WARNING Expected key, got STRING
[junit4:junit4]   2> 5510 T2207 oasc.SolrCore.<init> [unloadcollection1] Opening new SolrCore at /mnt/ssd/jenkins/workspace/Lucene-Solr-4.x-Linux/solr/build/solr-core/test/J1/./org.apache.solr.cloud.UnloadDistributedZkTest-jetty1-1362817285168/unloadcollection1/, dataDir=/mnt/ssd/jenkins/workspace/Lucene-Solr-4.x-Linux/solr/build/solr-core/test/J1/./solrtest-UnloadDistributedZkTest-1362817284791/1362817289773unloadcollection1_1n/
[junit4:junit4]   2> 5510 T2207 oasc.JmxMonitoredMap.<init> JMX monitoring is enabled. Adding Solr mbeans to JMX Server: com.sun.jmx.mbeanserver.JmxMBeanServer@53687f
[junit4:junit4]   2> 5511 T2207 oasc.SolrCore.initDirectoryFactory org.apache.solr.core.MockDirectoryFactory
[junit4:junit4]   2> 5512 T2207 oasc.CachingDirectoryFactory.get return new directory for /mnt/ssd/jenkins/workspace/Lucene-Solr-4.x-Linux/solr/build/solr-core/test/J1/./solrtest-UnloadDistributedZkTest-1362817284791/1362817289773unloadcollection1_1n forceNew: false
[junit4:junit4]   2> 5512 T2207 oasc.SolrCore.getNewIndexDir New index directory detected: old=null new=/mnt/ssd/jenkins/workspace/Lucene-Solr-4.x-Linux/solr/build/solr-core/test/J1/./solrtest-UnloadDistributedZkTest-1362817284791/1362817289773unloadcollection1_1n/index/
[junit4:junit4]   2> 5512 T2207 oasc.SolrCore.initIndex WARNING [unloadcollection1] Solr index directory '/mnt/ssd/jenkins/workspace/Lucene-Solr-4.x-Linux/solr/build/solr-core/test/J1/./solrtest-UnloadDistributedZkTest-1362817284791/1362817289773unloadcollection1_1n/index' doesn't exist. Creating new index...
[junit4:junit4]   2> 5513 T2207 oasc.CachingDirectoryFactory.get return new directory for /mnt/ssd/jenkins/workspace/Lucene-Solr-4.x-Linux/solr/build/solr-core/test/J1/./solrtest-UnloadDistributedZkTest-1362817284791/1362817289773unloadcollection1_1n/index forceNew: false
[junit4:junit4]   2> 5514 T2207 oasc.SolrDeletionPolicy.onCommit SolrDeletionPolicy.onCommit: commits:num=1
[junit4:junit4]   2> 		commit{dir=MockDirWrapper(org.apache.lucene.store.RAMDirectory@15dc11c lockFactory=org.apache.lucene.store.NativeFSLockFactory@1d44ef0),segFN=segments_1,generation=1,filenames=[segments_1]
[junit4:junit4]   2> 5514 T2207 oasc.SolrDeletionPolicy.updateCommits newest commit = 1[segments_1]
[junit4:junit4]   2> 5516 T2207 oasup.UpdateRequestProcessorChain.init inserting DistributedUpdateProcessorFactory into updateRequestProcessorChain "dedupe"
[junit4:junit4]   2> 5516 T2207 oasup.UpdateRequestProcessorChain.init inserting DistributedUpdateProcessorFactory into updateRequestProcessorChain "stored_sig"
[junit4:junit4]   2> 5517 T2207 oasup.UpdateRequestProcessorChain.init inserting DistributedUpdateProcessorFactory into updateRequestProcessorChain "distrib-dup-test-chain-implicit"
[junit4:junit4]   2> 5517 T2207 oasc.RequestHandlers.initHandlersFromConfig created standard: solr.StandardRequestHandler
[junit4:junit4]   2> 5518 T2207 oasc.RequestHandlers.initHandlersFromConfig created /get: solr.RealTimeGetHandler
[junit4:junit4]   2> 5518 T2207 oasc.RequestHandlers.initHandlersFromConfig adding lazy requestHandler: solr.ReplicationHandler
[junit4:junit4]   2> 5519 T2207 oasc.RequestHandlers.initHandlersFromConfig created /replication: solr.ReplicationHandler
[junit4:junit4]   2> 5519 T2207 oasc.RequestHandlers.initHandlersFromConfig created /update: solr.UpdateRequestHandler
[junit4:junit4]   2> 5519 T2207 oasc.RequestHandlers.initHandlersFromConfig created /admin/: org.apache.solr.handler.admin.AdminHandlers
[junit4:junit4]   2> 5522 T2207 oashl.XMLLoader.init xsltCacheLifetimeSeconds=60
[junit4:junit4]   2> 5525 T2207 oass.SolrIndexSearcher.<init> Opening Searcher@572577 main
[junit4:junit4]   2> 5525 T2207 oasu.UpdateHandler.clearLog Clearing tlog files, tlogDir=/mnt/ssd/jenkins/workspace/Lucene-Solr-4.x-Linux/solr/build/solr-core/test/J1/./solrtest-UnloadDistributedZkTest-1362817284791/1362817289773unloadcollection1_1n/tlog
[junit4:junit4]   2> 5526 T2207 oasu.CommitTracker.<init> Hard AutoCommit: disabled
[junit4:junit4]   2> 5526 T2207 oasu.CommitTracker.<init> Soft AutoCommit: disabled
[junit4:junit4]   2> 5529 T2257 oasc.SolrCore.registerSearcher [unloadcollection1] Registered new searcher Searcher@572577 main{StandardDirectoryReader(segments_1:1)}
[junit4:junit4]   2> 5530 T2207 oasc.ZkController.publish publishing core=unloadcollection1 state=down
[junit4:junit4]   2> 5531 T2178 oazs.PrepRequestProcessor.pRequest Got user-level KeeperException when processing sessionid:0x13d4e3d7aba0006 type:create cxid:0x40 zxid:0x4c txntype:-1 reqpath:n/a Error Path:/solr/overseer/queue Error:KeeperErrorCode = NoNode for /solr/overseer/queue
[junit4:junit4]   2> 6375 T2196 oascc.ZkStateReader.updateClusterState Updating cloud state from ZooKeeper... 
[junit4:junit4]   2> 6376 T2196 oasc.Overseer$ClusterStateUpdater.updateState Update state numShards=1 message={
[junit4:junit4]   2> 	  "node_name":"127.0.0.1:54993_fb_ywo%2Fa",
[junit4:junit4]   2> 	  "roles":null,
[junit4:junit4]   2> 	  "shard":null,
[junit4:junit4]   2> 	  "core":"unloadcollection1",
[junit4:junit4]   2> 	  "state":"down",
[junit4:junit4]   2> 	  "core_node_name":null,
[junit4:junit4]   2> 	  "collection":"unloadcollection",
[junit4:junit4]   2> 	  "base_url":"http://127.0.0.1:54993/fb_ywo/a",
[junit4:junit4]   2> 	  "numShards":"1",
[junit4:junit4]   2> 	  "operation":"state"}
[junit4:junit4]   2> 6376 T2196 oasc.Overseer$ClusterStateUpdater.createCollection Create collection unloadcollection with numShards 1
[junit4:junit4]   2> 6377 T2196 oasc.Overseer$ClusterStateUpdater.updateState Assigning new node to shard shard=shard1
[junit4:junit4]   2> 6377 T2178 oazs.PrepRequestProcessor.pRequest Got user-level KeeperException when processing sessionid:0x13d4e3d7aba0003 type:create cxid:0x46 zxid:0x4f txntype:-1 reqpath:n/a Error Path:/solr/overseer/queue-work Error:KeeperErrorCode = NoNode for /solr/overseer/queue-work
[junit4:junit4]   2> 6391 T2213 oascc.ZkStateReader$2.process A cluster state change: WatchedEvent state:SyncConnected type:NodeDataChanged path:/clusterstate.json, has occurred - updating... (live nodes size: 5)
[junit4:junit4]   2> 6391 T2200 oascc.ZkStateReader$2.process A cluster state change: WatchedEvent state:SyncConnected type:NodeDataChanged path:/clusterstate.json, has occurred - updating... (live nodes size: 5)
[junit4:junit4]   2> 6391 T2241 oascc.ZkStateReader$2.process A cluster state change: WatchedEvent state:SyncConnected type:NodeDataChanged path:/clusterstate.json, has occurred - updating... (live nodes size: 5)
[junit4:junit4]   2> 6391 T2195 oascc.ZkStateReader$2.process A cluster state change: WatchedEvent state:SyncConnected type:NodeDataChanged path:/clusterstate.json, has occurred - updating... (live nodes size: 5)
[junit4:junit4]   2> 6391 T2255 oascc.ZkStateReader$2.process A cluster state change: WatchedEvent state:SyncConnected type:NodeDataChanged path:/clusterstate.json, has occurred - updating... (live nodes size: 5)
[junit4:junit4]   2> 6391 T2227 oascc.ZkStateReader$2.process A cluster state change: WatchedEvent state:SyncConnected type:NodeDataChanged path:/clusterstate.json, has occurred - updating... (live nodes size: 5)
[junit4:junit4]   2> 6532 T2207 oasc.CoreContainer.registerCore registering core: unloadcollection1
[junit4:junit4]   2> 6533 T2207 oasc.ZkController.register Register replica - core:unloadcollection1 address:http://127.0.0.1:54993/fb_ywo/a collection:unloadcollection shard:shard1
[junit4:junit4]   2> 6534 T2207 oascc.SolrZkClient.makePath makePath: /collections/unloadcollection/leader_elect/shard1/election
[junit4:junit4]   2> 6539 T2178 oazs.PrepRequestProcessor.pRequest Got user-level KeeperException when processing sessionid:0x13d4e3d7aba0006 type:delete cxid:0x51 zxid:0x59 txntype:-1 reqpath:n/a Error Path:/solr/collections/unloadcollection/leaders Error:KeeperErrorCode = NoNode for /solr/collections/unloadcollection/leaders
[junit4:junit4]   2> 6540 T2207 oasc.ShardLeaderElectionContext.runLeaderProcess Running the leader process.
[junit4:junit4]   2> 6540 T2178 oazs.PrepRequestProcessor.pRequest Got user-level KeeperException when processing sessionid:0x13d4e3d7aba0006 type:create cxid:0x52 zxid:0x5a txntype:-1 reqpath:n/a Error Path:/solr/overseer Error:KeeperErrorCode = NodeExists for /solr/overseer
[junit4:junit4]   2> 6542 T2207 oasc.ShardLeaderElectionContext.waitForReplicasToComeUp Enough replicas found to continue.
[junit4:junit4]   2> 6542 T2207 oasc.ShardLeaderElectionContext.runLeaderProcess I may be the new leader - try and sync
[junit4:junit4]   2> 6542 T2207 oasc.SyncStrategy.sync Sync replicas to http://127.0.0.1:54993/fb_ywo/a/unloadcollection1/
[junit4:junit4]   2> 6543 T2207 oasc.SyncStrategy.syncReplicas Sync Success - now sync replicas to me
[junit4:junit4]   2> 6543 T2207 oasc.SyncStrategy.syncToMe http://127.0.0.1:54993/fb_ywo/a/unloadcollection1/ has no replicas
[junit4:junit4]   2> 6543 T2207 oasc.ShardLeaderElectionContext.runLeaderProcess I am the new leader: http://127.0.0.1:54993/fb_ywo/a/unloadcollection1/
[junit4:junit4]   2> 6544 T2207 oascc.SolrZkClient.makePath makePath: /collections/unloadcollection/leaders/shard1
[junit4:junit4]   2> 6546 T2178 oazs.PrepRequestProcessor.pRequest Got user-level KeeperException when processing sessionid:0x13d4e3d7aba0006 type:create cxid:0x5c zxid:0x5e txntype:-1 reqpath:n/a Error Path:/solr/overseer Error:KeeperErrorCode = NodeExists for /solr/overseer
[junit4:junit4]   2> 7894 T2196 oascc.ZkStateReader.updateClusterState Updating cloud state from ZooKeeper... 
[junit4:junit4]   2> 7901 T2195 oascc.ZkStateReader$2.process A cluster state change: WatchedEvent state:SyncConnected type:NodeDataChanged path:/clusterstate.json, has occurred - updating... (live nodes size: 5)
[junit4:junit4]   2> 7901 T2227 oascc.ZkStateReader$2.process A cluster state change: WatchedEvent state:SyncConnected type:NodeDataChanged path:/clusterstate.json, has occurred - updating... (live nodes size: 5)
[junit4:junit4]   2> 7901 T2213 oascc.ZkStateReader$2.process A cluster state change: WatchedEvent state:SyncConnected type:NodeDataChanged path:/clusterstate.json, has occurred - updating... (live nodes size: 5)
[junit4:junit4]   2> 7901 T2255 oascc.ZkStateReader$2.process A cluster state change: WatchedEvent state:SyncConnected type:NodeDataChanged path:/clusterstate.json, has occurred - updating... (live nodes size: 5)
[junit4:junit4]   2> 7901 T2200 oascc.ZkStateReader$2.process A cluster state change: WatchedEvent state:SyncConnected type:NodeDataChanged path:/clusterstate.json, has occurred - updating... (live nodes size: 5)
[junit4:junit4]   2> 7901 T2241 oascc.ZkStateReader$2.process A cluster state change: WatchedEvent state:SyncConnected type:NodeDataChanged path:/clusterstate.json, has occurred - updating... (live nodes size: 5)
[junit4:junit4]   2> 7951 T2207 oasc.ZkController.register We are http://127.0.0.1:54993/fb_ywo/a/unloadcollection1/ and leader is http://127.0.0.1:54993/fb_ywo/a/unloadcollection1/
[junit4:junit4]   2> 7951 T2207 oasc.ZkController.register No LogReplay needed for core=unloadcollection1 baseURL=http://127.0.0.1:54993/fb_ywo/a
[junit4:junit4]   2> 7951 T2207 oasc.ZkController.checkRecovery I am the leader, no recovery necessary
[junit4:junit4]   2> 7952 T2207 oasc.ZkController.publish publishing core=unloadcollection1 state=active
[junit4:junit4]   2> 7969 T2207 oascc.ZkStateReader.updateClusterState Updating cloud state from ZooKeeper... 
[junit4:junit4]   2> 7970 T2207 oasc.CoreContainer.persistFile Persisting cores config to /mnt/ssd/jenkins/workspace/Lucene-Solr-4.x-Linux/solr/build/solr-core/test/J1/./org.apache.solr.cloud.UnloadDistributedZkTest-jetty1-1362817285168/solr.xml
[junit4:junit4]   2> 7977 T2207 oasc.SolrXMLSerializer.persistFile Persisting cores config to /mnt/ssd/jenkins/workspace/Lucene-Solr-4.x-Linux/solr/build/solr-core/test/J1/./org.apache.solr.cloud.UnloadDistributedZkTest-jetty1-1362817285168/solr.xml
[junit4:junit4]   2> 7979 T2207 oass.SolrDispatchFilter.handleAdminRequest /admin/cores {action=CREATE&wt=javabin&version=2&dataDir=/mnt/ssd/jenkins/workspace/Lucene-Solr-4.x-Linux/solr/build/solr-core/test/J1/./solrtest-UnloadDistributedZkTest-1362817284791/1362817289773unloadcollection1_1n&name=unloadcollection1&collection=unloadcollection&numShards=1} status=0 QTime=2992 
[junit4:junit4]   2> 7980 T2173 oascsi.HttpClientUtil.createClient Creating new http client, config:
[junit4:junit4]   2> 7982 T2173 oaz.ZooKeeper.<init> Initiating client connection, connectString=127.0.0.1:44771/solr sessionTimeout=10000 watcher=org.apache.solr.common.cloud.ConnectionManager@113e54b
[junit4:junit4]   2> 7983 T2258 oaz.ClientCnxn$SendThread.logStartConnect Opening socket connection to server localhost.localdomain/127.0.0.1:44771. Will not attempt to authenticate using SASL (access denied ("javax.security.auth.AuthPermission" "getLoginConfiguration"))
[junit4:junit4]   2> 7983 T2173 oascc.ConnectionManager.waitForConnected Waiting for client to connect to ZooKeeper
[junit4:junit4]   2> 7983 T2175 oazs.NIOServerCnxnFactory.run Accepted socket connection from /127.0.0.1:47480
[junit4:junit4]   2> 7983 T2258 oaz.ClientCnxn$SendThread.primeConnection Socket connection established to localhost.localdomain/127.0.0.1:44771, initiating session
[junit4:junit4]   2> 7984 T2175 oazs.ZooKeeperServer.processConnectRequest Client attempting to establish new session at /127.0.0.1:47480
[junit4:junit4]   2> 7985 T2177 oazs.ZooKeeperServer.finishSessionInit Established session 0x13d4e3d7aba000d with negotiated timeout 10000 for client /127.0.0.1:47480
[junit4:junit4]   2> 7985 T2258 oaz.ClientCnxn$SendThread.onConnected Session establishment complete on server localhost.localdomain/127.0.0.1:44771, sessionid = 0x13d4e3d7aba000d, negotiated timeout = 10000
[junit4:junit4]   2> 7986 T2259 oascc.ConnectionManager.process Watcher org.apache.solr.common.cloud.ConnectionManager@113e54b name:ZooKeeperConnection Watcher:127.0.0.1:44771/solr got event WatchedEvent state:SyncConnected type:None path:null path:null type:None
[junit4:junit4]   2> 7986 T2173 oascc.ConnectionManager.waitForConnected Client is connected to ZooKeeper
[junit4:junit4]   2> 7988 T2173 oascc.ZkStateReader.createClusterStateWatchersAndUpdate Updating cluster state from ZooKeeper... 
[junit4:junit4]   2> 7990 T2173 oascc.ZkStateReader.updateClusterState Updating cloud state from ZooKeeper... 
[junit4:junit4]   2> 7991 T2173 oascsi.HttpClientUtil.createClient Creating new http client, config:maxConnections=128&maxConnectionsPerHost=32&followRedirects=false
[junit4:junit4]   2> 7995 T2222 oasc.CoreContainer.create Creating SolrCore 'unloadcollection2' using instanceDir: /mnt/ssd/jenkins/workspace/Lucene-Solr-4.x-Linux/solr/build/solr-core/test/J1/./org.apache.solr.cloud.UnloadDistributedZkTest-jetty2-1362817286301/unloadcollection2
[junit4:junit4]   2> 7996 T2222 oasc.ZkController.createCollectionZkNode Check for collection zkNode:unloadcollection
[junit4:junit4]   2> 7996 T2222 oasc.ZkController.createCollectionZkNode Collection zkNode exists
[junit4:junit4]   2> 7997 T2222 oasc.ZkController.readConfigName Load collection config from:/collections/unloadcollection
[junit4:junit4]   2> 7998 T2222 oasc.SolrResourceLoader.<init> new SolrResourceLoader for directory: '/mnt/ssd/jenkins/workspace/Lucene-Solr-4.x-Linux/solr/build/solr-core/test/J1/./org.apache.solr.cloud.UnloadDistributedZkTest-jetty2-1362817286301/unloadcollection2/'
[junit4:junit4]   2> 8030 T2222 oasc.SolrConfig.<init> Using Lucene MatchVersion: LUCENE_42
[junit4:junit4]   2> 8067 T2222 oasc.SolrConfig.<init> Loaded SolrConfig: solrconfig.xml
[junit4:junit4]   2> 8068 T2222 oass.IndexSchema.readSchema Reading Solr Schema
[junit4:junit4]   2> 8072 T2222 oass.IndexSchema.readSchema Schema name=test
[junit4:junit4]   2> 8484 T2222 oass.OpenExchangeRatesOrgProvider.init Initialized with rates=open-exchange-rates.json, refreshInterval=1440.
[junit4:junit4]   2> 8490 T2222 oass.IndexSchema.readSchema default search field in schema is text
[junit4:junit4]   2> 8493 T2222 oass.IndexSchema.readSchema unique key field: id
[junit4:junit4]   2> 8505 T2222 oass.FileExchangeRateProvider.reload Reloading exchange rates from file currency.xml
[junit4:junit4]   2> 8508 T2222 oass.FileExchangeRateProvider.reload Reloading exchange rates from file currency.xml
[junit4:junit4]   2> 8511 T2222 oass.OpenExchangeRatesOrgProvider.reload Reloading exchange rates from open-exchange-rates.json
[junit4:junit4]   2> 8512 T2222 oass.OpenExchangeRatesOrgProvider$OpenExchangeRates.<init> WARNING Unknown key IMPORTANT NOTE
[junit4:junit4]   2> 8512 T2222 oass.OpenExchangeRatesOrgProvider$OpenExchangeRates.<init> WARNING Expected key, got STRING
[junit4:junit4]   2> 8513 T2222 oass.OpenExchangeRatesOrgProvider.reload Reloading exchange rates from open-exchange-rates.json
[junit4:junit4]   2> 8514 T2222 oass.OpenExchangeRatesOrgProvider$OpenExchangeRates.<init> WARNING Unknown key IMPORTANT NOTE
[junit4:junit4]   2> 8514 T2222 oass.OpenExchangeRatesOrgProvider$OpenExchangeRates.<init> WARNING Expected key, got STRING
[junit4:junit4]   2> 8514 T2222 oasc.SolrCore.<init> [unloadcollection2] Opening new SolrCore at /mnt/ssd/jenkins/workspace/Lucene-Solr-4.x-Linux/solr/build/solr-core/test/J1/./org.apache.solr.cloud.UnloadDistributedZkTest-jetty2-1362817286301/unloadcollection2/, dataDir=/mnt/ssd/jenkins/workspace/Lucene-Solr-4.x-Linux/solr/build/solr-core/test/J1/./solrtest-UnloadDistributedZkTest-1362817284791/1362817292781unloadcollection1_2n/
[junit4:junit4]   2> 8515 T2222 oasc.JmxMonitoredMap.<init> JMX monitoring is enabled. Adding Solr mbeans to JMX Server: com.sun.jmx.mbeanserver.JmxMBeanServer@53687f
[junit4:junit4]   2> 8515 T2222 oasc.SolrCore.initDirectoryFactory org.apache.solr.core.MockDirectoryFactory
[junit4:junit4]   2> 8516 T2222 oasc.CachingDirectoryFactory.get return new directory for /mnt/ssd/jenkins/workspace/Lucene-Solr-4.x-Linux/solr/build/solr-core/test/J1/./solrtest-UnloadDistributedZkTest-1362817284791/1362817292781unloadcollection1_2n forceNew: false
[junit4:junit4]   2> 8516 T2222 oasc.SolrCore.getNewIndexDir New index directory detected: old=null new=/mnt/ssd/jenkins/workspace/Lucene-Solr-4.x-Linux/solr/build/solr-core/test/J1/./solrtest-UnloadDistributedZkTest-1362817284791/1362817292781unloadcollection1_2n/index/
[junit4:junit4]   2> 8516 T2222 oasc.SolrCore.initIndex WARNING [unloadcollection2] Solr index directory '/mnt/ssd/jenkins/workspace/Lucene-Solr-4.x-Linux/solr/build/solr-core/test/J1/./solrtest-UnloadDistributedZkTest-1362817284791/1362817292781unloadcollection1_2n/index' doesn't exist. Creating new index...
[junit4:junit4]   2> 8517 T2222 oasc.CachingDirectoryFactory.get return new directory for /mnt/ssd/jenkins/workspace/Lucene-Solr-4.x-Linux/solr/build/solr-core/test/J1/./solrtest-UnloadDistributedZkTest-1362817284791/1362817292781unloadcollection1_2n/index forceNew: false
[junit4:junit4]   2> 8518 T2222 oasc.SolrDeletionPolicy.onCommit SolrDeletionPolicy.onCommit: commits:num=1
[junit4:junit4]   2> 		commit{dir=MockDirWrapper(org.apache.lucene.store.RAMDirectory@12004d9 lockFactory=org.apache.lucene.store.NativeFSLockFactory@1bd1432),segFN=segments_1,generation=1,filenames=[segments_1]
[junit4:junit4]   2> 8518 T2222 oasc.SolrDeletionPolicy.updateCommits newest commit = 1[segments_1]
[junit4:junit4]   2> 8520 T2222 oasup.UpdateRequestProcessorChain.init inserting DistributedUpdateProcessorFactory into updateRequestProcessorChain "dedupe"
[junit4:junit4]   2> 8520 T2222 oasup.UpdateRequestProcessorChain.init inserting DistributedUpdateProcessorFactory into updateRequestProcessorChain "stored_sig"
[junit4:junit4]   2> 8521 T2222 oasup.UpdateRequestProcessorChain.init inserting DistributedUpdateProcessorFactory into updateRequestProcessorChain "distrib-dup-test-chain-implicit"
[junit4:junit4]   2> 8521 T2222 oasc.RequestHandlers.initHandlersFromConfig created standard: solr.StandardRequestHandler
[junit4:junit4]   2> 8522 T2222 oasc.RequestHandlers.initHandlersFromConfig created /get: solr.RealTimeGetHandler
[junit4:junit4]   2> 8522 T2222 oasc.RequestHandlers.initHandlersFromConfig adding lazy requestHandler: solr.ReplicationHandler
[junit4:junit4]   2> 8522 T2222 oasc.RequestHandlers.initHandlersFromConfig created /replication: solr.ReplicationHandler
[junit4:junit4]   2> 8523 T2222 oasc.RequestHandlers.initHandlersFromConfig created /update: solr.UpdateRequestHandler
[junit4:junit4]   2> 8523 T2222 oasc.RequestHandlers.initHandlersFromConfig created /admin/: org.apache.solr.handler.admin.AdminHandlers
[junit4:junit4]   2> 8526 T2222 oashl.XMLLoader.init xsltCacheLifetimeSeconds=60
[junit4:junit4]   2> 8528 T2222 oass.SolrIndexSearcher.<init> Opening Searcher@148cfe main
[junit4:junit4]   2> 8529 T2222 oasu.UpdateHandler.clearLog Clearing tlog files, tlogDir=/mnt/ssd/jenkins/workspace/Lucene-Solr-4.x-Linux/solr/build/solr-core/test/J1/./solrtest-UnloadDistributedZkTest-1362817284791/1362817292781unloadcollection1_2n/tlog
[junit4:junit4]   2> 8529 T2222 oasu.CommitTracker.<init> Hard AutoCommit: disabled
[junit4:junit4]   2> 8530 T2222 oasu.CommitTracker.<init> Soft AutoCommit: disabled
[junit4:junit4]   2> 8533 T2260 oasc.SolrCore.registerSearcher [unloadcollection2] Registered new searcher Searcher@148cfe main{StandardDirectoryReader(segments_1:1)}
[junit4:junit4]   2> 8534 T2222 oasc.ZkController.publish publishing core=unloadcollection2 state=down
[junit4:junit4]   2> 8534 T2222 oasc.ZkController.publish numShards not found on descriptor - reading it from system property
[junit4:junit4]   2> 9406 T2196 oascc.ZkStateReader.updateClusterState Updating cloud state from ZooKeeper... 
[junit4:junit4]   2> 9407 T2196 oasc.Overseer$ClusterStateUpdater.updateState Update state numShards=1 message={
[junit4:junit4]   2> 	  "node_name":"127.0.0.1:54993_fb_ywo%2Fa",
[junit4:junit4]   2> 	  "roles":null,
[junit4:junit4]   2> 	  "shard":"shard1",
[junit4:junit4]   2> 	  "core":"unloadcollection1",
[junit4:junit4]   2> 	  "state":"active",
[junit4:junit4]   2> 	  "core_node_name":null,
[junit4:junit4]   2> 	  "collection":"unloadcollection",
[junit4:junit4]   2> 	  "base_url":"http://127.0.0.1:54993/fb_ywo/a",
[junit4:junit4]   2> 	  "numShards":"1",
[junit4:junit4]   2> 	  "operation":"state"}
[junit4:junit4]   2> 9409 T2196 oasc.Overseer$ClusterStateUpdater.updateState Update state numShards=2 message={
[junit4:junit4]   2> 	  "node_name":"127.0.0.1:40007_fb_ywo%2Fa",
[junit4:junit4]   2> 	  "roles":null,
[junit4:junit4]   2> 	  "shard":null,
[junit4:junit4]   2> 	  "core":"unloadcollection2",
[junit4:junit4]   2> 	  "state":"down",
[junit4:junit4]   2> 	  "core_node_name":null,
[junit4:junit4]   2> 	  "collection":"unloadcollection",
[junit4:junit4]   2> 	  "base_url":"http://127.0.0.1:40007/fb_ywo/a",
[junit4:junit4]   2> 	  "numShards":"2",
[junit4:junit4]   2> 	  "operation":"state"}
[junit4:junit4]   2> 9409 T2196 oasc.Overseer$ClusterStateUpdater.updateState Collection already exists with numShards=1
[junit4:junit4]   2> 9410 T2196 oasc.Overseer$ClusterStateUpdater.updateState Assigning new node to shard shard=shard1
[junit4:junit4]   2> 9412 T2213 oascc.ZkStateReader$2.process A cluster state change: WatchedEvent state:SyncConnected type:NodeDataChanged path:/clusterstate.json, has occurred - updating... (live nodes size: 5)
[junit4:junit4]   2> 9412 T2200 oascc.ZkStateReader$2.process A cluster state change: WatchedEvent state:SyncConnected type:NodeDataChanged path:/clusterstate.json, has occurred - updating... (live nodes size: 5)
[junit4:junit4]   2> 9412 T2259 oascc.ZkStateReader$2.process A cluster state change: WatchedEvent state:SyncConnected type:NodeDataChanged path:/clusterstate.json, has occurred - updating... (live nodes size: 5)
[junit4:junit4]   2> 9412 T2241 oascc.ZkStateReader$2.process A cluster state change: WatchedEvent state:SyncConnected type:NodeDataChanged path:/clusterstate.json, has occurred - updating... (live nodes size: 5)
[junit4:junit4]   2> 9413 T2255 oascc.ZkStateReader$2.process A cluster state change: WatchedEvent state:SyncConnected type:NodeDataChanged path:/clusterstate.json, has occurred - updating... (live nodes size: 5)
[junit4:junit4]   2> 9412 T2195 oascc.ZkStateReader$2.process A cluster state change: WatchedEvent state:SyncConnected type:NodeDataChanged path:/clusterstate.json, has occurred - updating... (live nodes size: 5)
[junit4:junit4]   2> 9413 T2227 oascc.ZkStateReader$2.process A cluster state change: WatchedEvent state:SyncConnected type:NodeDataChanged path:/clusterstate.json, has occurred - updating... (live nodes size: 5)
[junit4:junit4]   2> 9536 T2222 oasc.CoreContainer.registerCore registering core: unloadcollection2
[junit4:junit4]   2> 9536 T2222 oasc.ZkController.register Register replica - core:unloadcollection2 address:http://127.0.0.1:40007/fb_ywo/a collection:unloadcollection shard:shard1
[junit4:junit4]   2> 9539 T2222 oasc.ZkController.register We are http://127.0.0.1:40007/fb_ywo/a/unloadcollection2/ and leader is http://127.0.0.1:54993/fb_ywo/a/unloadcollection1/
[junit4:junit4]   2> 9539 T2222 oasc.ZkController.register No LogReplay needed for core=unloadcollection2 baseURL=http://127.0.0.1:40007/fb_ywo/a
[junit4:junit4]   2> 9540 T2222 oasc.ZkController.checkRecovery Core needs to recover:unloadcollection2
[junit4:junit4]   2> 9540 T2222 oasu.DefaultSolrCoreState.doRecovery Running recovery - first canceling any ongoing recovery
[junit4:junit4]   2> ASYNC  NEW_CORE C395 name=unloadcollection2 org.apache.solr.core.SolrCore@d78f59 url=http://127.0.0.1:40007/fb_ywo/a/unloadcollection2 node=127.0.0.1:40007_fb_ywo%2Fa C395_STATE=coll:unloadcollection core:unloadcollection2 props:{node_name=127.0.0.1:40007_fb_ywo%2Fa, core=unloadcollection2, state=down, collection=unloadcollection, base_url=http://127.0.0.1:40007/fb_ywo/a}
[junit4:junit4]   2> 9540 T2261 C395 P40007 oasc.RecoveryStrategy.run Starting recovery process.  core=unloadcollection2 recoveringAfterStartup=true
[junit4:junit4]   2> 9541 T2261 C395 P40007 oasc.RecoveryStrategy.doRecovery ###### startupVersions=[]
[junit4:junit4]   2> 9541 T2222 oascc.ZkStateReader.updateClusterState Updating cloud state from ZooKeeper... 
[junit4:junit4]   2> 9541 T2261 C395 P40007 oasc.ZkController.publish publishing core=unloadcollection2 state=recovering
[junit4:junit4]   2> 9541 T2261 C395 P40007 oasc.ZkController.publish numShards not found on descriptor - reading it from system property
[junit4:junit4]   2> 9542 T2222 oasc.CoreContainer.persistFile Persisting cores config to /mnt/ssd/jenkins/workspace/Lucene-Solr-4.x-Linux/solr/build/solr-core/test/J1/./org.apache.solr.cloud.UnloadDistributedZkTest-jetty2-1362817286301/solr.xml
[junit4:junit4]   2> 9542 T2261 C395 P40007 oascsi.HttpClientUtil.createClient Creating new http client, config:maxConnections=128&maxConnectionsPerHost=32&followRedirects=false
[junit4:junit4]   2> 9548 T2222 oasc.SolrXMLSerializer.persistFile Persisting cores config to /mnt/ssd/jenkins/workspace/Lucene-Solr-4.x-Linux/solr/build/solr-core/test/J1/./org.apache.solr.cloud.UnloadDistributedZkTest-jetty2-1362817286301/solr.xml
[junit4:junit4]   2> 9549 T2222 oass.SolrDispatchFilter.handleAdminRequest /admin/cores {action=CREATE&wt=javabin&version=2&dataDir=/mnt/ssd/jenkins/workspace/Lucene-Solr-4.x-Linux/solr/build/solr-core/test/J1/./solrtest-UnloadDistributedZkTest-1362817284791/1362817292781unloadcollection1_2n&name=unloadcollection2&collection=unloadcollection} status=0 QTime=1554 
[junit4:junit4]   2> 9550 T2173 oascc.ZkStateReader.updateClusterState Updating cloud state from ZooKeeper... 
[junit4:junit4]   2> 9551 T2173 oasc.AbstractDistribZkTestBase.waitForRecoveriesToFinish Wait for recoveries to finish - collection: unloadcollection failOnTimeout:true timeout (sec):230
[junit4:junit4]   2> 9552 T2173 oascc.ZkStateReader.updateClusterState Updating cloud state from ZooKeeper... 
[junit4:junit4]   2> 10553 T2173 oascc.ZkStateReader.updateClusterState Updating cloud state from ZooKeeper... 
[junit4:junit4]   2> 10918 T2196 oascc.ZkStateReader.updateClusterState Updating cloud state from ZooKeeper... 
[junit4:junit4]   2> 10918 T2196 oasc.Overseer$ClusterStateUpdater.updateState Update state numShards=2 message={
[junit4:junit4]   2> 	  "node_name":"127.0.0.1:40007_fb_ywo%2Fa",
[junit4:junit4]   2> 	  "roles":null,
[junit4:junit4]   2> 	  "shard":"shard1",
[junit4:junit4]   2> 	  "core":"unloadcollection2",
[junit4:junit4]   2> 	  "state":"recovering",
[junit4:junit4]   2> 	  "core_node_name":null,
[junit4:junit4]   2> 	  "collection":"unloadcollection",
[junit4:junit4]   2> 	  "base_url":"http://127.0.0.1:40007/fb_ywo/a",
[junit4:junit4]   2> 	  "numShards":"2",
[junit4:junit4]   2> 	  "operation":"state"}
[junit4:junit4]   2> 10938 T2227 oascc.ZkStateReader$2.process A cluster state change: WatchedEvent state:SyncConnected type:NodeDataChanged path:/clusterstate.json, has occurred - updating... (live nodes size: 5)
[junit4:junit4]   2> 10938 T2213 oascc.ZkStateReader$2.process A cluster state change: WatchedEvent state:SyncConnected type:NodeDataChanged path:/clusterstate.json, has occurred - updating... (live nodes size: 5)
[junit4:junit4]   2> 10939 T2259 oascc.ZkStateReader$2.process A cluster state change: WatchedEvent state:SyncConnected type:NodeDataChanged path:/clusterstate.json, has occurred - updating... (live nodes size: 5)
[junit4:junit4]   2> 10938 T2195 oascc.ZkStateReader$2.process A cluster state change: WatchedEvent state:SyncConnected type:NodeDataChanged path:/clusterstate.json, has occurred - updating... (live nodes size: 5)
[junit4:junit4]   2> 10938 T2255 oascc.ZkStateReader$2.process A cluster state change: WatchedEvent state:SyncConnected type:NodeDataChanged path:/clusterstate.json, has occurred - updating... (live nodes size: 5)
[junit4:junit4]   2> 10939 T2200 oascc.ZkStateReader$2.process A cluster state change: WatchedEvent state:SyncConnected type:NodeDataChanged path:/clusterstate.json, has occurred - updating... (live nodes size: 5)
[junit4:junit4]   2> 10939 T2241 oascc.ZkStateReader$2.process A cluster state change: WatchedEvent state:SyncConnected type:NodeDataChanged path:/clusterstate.json, has occurred - updating... (live nodes size: 5)
[junit4:junit4]   2> 11546 T2206 oass.SolrDispatchFilter.handleAdminRequest /admin/cores {action=PREPRECOVERY&coreNodeName=127.0.0.1:40007_fb_ywo%252Fa_unloadcollection2&onlyIfLeader=true&wt=javabin&version=2&core=unloadcollection1&state=recovering&checkLive=true&nodeName=127.0.0.1:40007_fb_ywo%252Fa} status=0 QTime=2000 
[junit4:junit4]   2> 11555 T2173 oascc.ZkStateReader.updateClusterState Updating cloud state from ZooKeeper... 
[junit4:junit4]   2> 12557 T2173 oascc.ZkStateReader.updateClusterState Updating cloud state from ZooKeeper... 
[junit4:junit4]   2>  C395_STATE=coll:unloadcollection core:unloadcollection2 props:{node_name=127.0.0.1:40007_fb_ywo%2Fa, shard=shard1, core=unloadcollection2, state=recovering, collection=unloadcollection, base_url=http://127.0.0.1:40007/fb_ywo/a}
[junit4:junit4]   2> 13547 T2261 C395 P40007 oasc.RecoveryStrategy.doRecovery Attempting to PeerSync from http://127.0.0.1:54993/fb_ywo/a/unloadcollection1/ core=unloadcollection2 - recoveringAfterStartup=true
[junit4:junit4]   2> 13548 T2261 C395 P40007 oasu.PeerSync.sync PeerSync: core=unloadcollection2 url=http://127.0.0.1:40007/fb_ywo/a START replicas=[http://127.0.0.1:54993/fb_ywo/a/unloadcollection1/] nUpdates=100
[junit4:junit4]   2> 13548 T2261 C395 P40007 oasu.PeerSync.sync WARNING no frame of reference to tell of we've missed updates
[junit4:junit4]   2> 13548 T2261 C395 P40007 oasc.RecoveryStrategy.doRecovery PeerSync Recovery was not successful - trying replication. core=unloadcollection2
[junit4:junit4]   2> 13548 T2261 C395 P40007 oasc.RecoveryStrategy.doRecovery Starting Replication Recovery. core=unloadcollection2
[junit4:junit4]   2> 13549 T2261 C395 P40007 oasc.RecoveryStrategy.doRecovery Begin buffering updates. core=unloadcollection2
[junit4:junit4]   2> 13549 T2261 C395 P40007 oasu.UpdateLog.bufferUpdates Starting to buffer updates. FSUpdateLog{state=ACTIVE, tlog=null}
[junit4:junit4]   2> 13549 T2261 C395 P40007 oasc.RecoveryStrategy.replicate Attempting to replicate from http://127.0.0.1:54993/fb_ywo/a/unloadcollection1/. core=unloadcollection2
[junit4:junit4]   2> 13549 T2261 C395 P40007 oascsi.HttpClientUtil.createClient Creating new http client, config:maxConnections=128&maxConnectionsPerHost=32&followRedirects=false
[junit4:junit4]   2> ASYNC  NEW_CORE C396 name=unloadcollection1 org.apache.solr.core.SolrCore@4cbcb6 url=http://127.0.0.1:54993/fb_ywo/a/unloadcollection1 node=127.0.0.1:54993_fb_ywo%2Fa C396_STATE=coll:unloadcollection core:unloadcollection1 props:{node_name=127.0.0.1:54993_fb_ywo%2Fa, shard=shard1, core=unloadcollection1, state=active, collection=unloadcollection, base_url=http://127.0.0.1:54993/fb_ywo/a, leader=true}
[junit4:junit4]   2> 13554 T2209 C396 P54993 REQ /get {qt=/get&getVersions=100&distrib=false&wt=javabin&version=2} status=0 QTime=1 
[junit4:junit4]   2> 13557 T2207 C396 P54993 oasu.DirectUpdateHandler2.commit start commit{,optimize=false,openSearcher=false,waitSearcher=true,expungeDeletes=false,softCommit=false,prepareCommit=false}
[junit4:junit4]   2> 13557 T2207 C396 P54993 oasc.SolrDeletionPolicy.onInit SolrDeletionPolicy.onInit: commits:num=1
[junit4:junit4]   2> 		commit{dir=MockDirWrapper(org.apache.lucene.store.RAMDirectory@15dc11c lockFactory=org.apache.lucene.store.NativeFSLockFactory@1d44ef0),segFN=segments_1,generation=1,filenames=[segments_1]
[junit4:junit4]   2> 13558 T2207 C396 P54993 oasc.SolrDeletionPolicy.updateCommits newest commit = 1[segments_1]
[junit4:junit4]   2> 13558 T2207 C396 P54993 oasc.SolrDeletionPolicy.onCommit SolrDeletionPolicy.onCommit: commits:num=2
[junit4:junit4]   2> 		commit{dir=MockDirWrapper(org.apache.lucene.store.RAMDirectory@15dc11c lockFactory=org.apache.lucene.store.NativeFSLockFactory@1d44ef0),segFN=segments_1,generation=1,filenames=[segments_1]
[junit4:junit4]   2> 		commit{dir=MockDirWrapper(org.apache.lucene.store.RAMDirectory@15dc11c lockFactory=org.apache.lucene.store.NativeFSLockFactory@1d44ef0),segFN=segments_2,generation=2,filenames=[segments_2]
[junit4:junit4]   2> 13559 T2173 oascc.ZkStateReader.updateClusterState Updating cloud state from ZooKeeper... 
[junit4:junit4]   2> 13559 T2207 C396 P54993 oasc.SolrDeletionPolicy.updateCommits newest commit = 2[segments_2]
[junit4:junit4]   2> 13559 T2207 C396 P54993 oass.SolrIndexSearcher.<init> Opening Searcher@15ab320 realtime
[junit4:junit4]   2> 13560 T2207 C396 P54993 oasu.DirectUpdateHandler2.commit end_commit_flush
[junit4:junit4]   2> 13560 T2207 C396 P54993 /update {softCommit=false&commit=true&commit_end_point=true&openSearcher=false&waitSearcher=true&wt=javabin&version=2} {commit=} 0 3
[junit4:junit4]   2> 13561 T2261 C395 P40007 oash.ReplicationHandler.inform Commits will be reserved for  10000
[junit4:junit4]   2> 13561 T2261 C395 P40007 oash.SnapPuller.<init>  No value set for 'pollInterval'. Timer Task not started.
[junit4:junit4]   2> 13563 T2206 C396 P54993 oash.ReplicationHandler.inform Commits will be reserved for  10000
[junit4:junit4]   2> 13563 T2206 C396 P54993 REQ /replication {qt=/replication&wt=javabin&version=2&command=indexversion} status=0 QTime=1 
[junit4:junit4]   2> 13564 T2261 C395 P40007 oash.SnapPuller.fetchLatestIndex Master's generation: 2
[junit4:junit4]   2> 13564 T2261 C395 P40007 oash.SnapPuller.fetchLatestIndex Slave's generation: 1
[junit4:junit4]   2> 13564 T2261 C395 P40007 oash.SnapPuller.fetchLatestIndex Starting replication process
[junit4:junit4]   2> 13566 T2209 C396 P54993 REQ /replication {qt=/replication&wt=javabin&version=2&generation=2&command=filelist} status=0 QTime=0 
[junit4:junit4]   2> 13566 T2261 C395 P40007 oash.SnapPuller.fetchLatestIndex Number of files in latest index in master: 1
[junit4:junit4]   2> 13567 T2261 C395 P40007 oasc.CachingDirectoryFactory.get return new directory for /mnt/ssd/jenkins/workspace/Lucene-Solr-4.x-Linux/solr/build/solr-core/test/J1/./solrtest-UnloadDistributedZkTest-1362817284791/1362817292781unloadcollection1_2n/index.20130309092138353 forceNew: false
[junit4:junit4]   2> 13568 T2261 C395 P40007 oash.SnapPuller.fetchLatestIndex Starting download to MockDirWrapper(org.apache.lucene.store.RAMDirectory@c3c1a2 lockFactory=org.apache.lucene.store.NativeFSLockFactory@18f6658) fullCopy=false
[junit4:junit4]   2> 13570 T2207 C396 P54993 REQ /replication {qt=/replication&wt=filestream&checksum=true&generation=2&file=segments_2&command=filecontent} status=0 QTime=0 
[junit4:junit4]   2> 13571 T2261 C395 P40007 oash.SnapPuller.fetchLatestIndex Total time taken for download : 0 secs
[junit4:junit4]   2> 13571 T2261 C395 P40007 oasu.DefaultSolrCoreState.newIndexWriter Creating new IndexWriter...
[junit4:junit4]   2> 13572 T2261 C395 P40007 oasu.DefaultSolrCoreState.newIndexWriter Waiting until IndexWriter is unused... core=unloadcollection2
[junit4:junit4]   2> 13572 T2261 C395 P40007 oasc.SolrDeletionPolicy.onInit SolrDeletionPolicy.onInit: commits:num=2
[junit4:junit4]   2> 		commit{dir=MockDirWrapper(org.apache.lucene.store.RAMDirectory@12004d9 lockFactory=org.apache.lucene.store.NativeFSLockFactory@1bd1432),segFN=segments_1,generation=1,filenames=[segments_1]
[junit4:junit4]   2> 		commit{dir=MockDirWrapper(org.apache.lucene.store.RAMDirectory@12004d9 lockFactory=org.apache.lucene.store.NativeFSLockFactory@1bd1432),segFN=segments_2,generation=2,filenames=[segments_2]
[junit4:junit4]   2> 13573 T2261 C395 P40007 oasc.SolrDeletionPolicy.updateCommits newest commit = 2[segments_2]
[junit4:junit4]   2> 13573 T2261 C395 P40007 oasu.DefaultSolrCoreState.newIndexWriter New IndexWriter is ready to be used.
[junit4:junit4]   2> 13573 T2261 C395 P40007 oass.SolrIndexSearcher.<init> Opening Searcher@13b04ca main
[junit4:junit4]   2> 13574 T2260 oasc.SolrCore.registerSearcher [unloadcollection2] Registered new searcher Searcher@13b04ca main{StandardDirectoryReader(segments_2:1:nrt)}
[junit4:junit4]   2> 13575 T2261 C395 P40007 oash.SnapPuller.fetchLatestIndex removing temporary index download directory files MockDirWrapper(org.apache.lucene.store.RAMDirectory@c3c1a2 lockFactory=org.apache.lucene.store.NativeFSLockFactory@18f6658)
[junit4:junit4]   2> 13575 T2261 C395 P40007 oasc.RecoveryStrategy.replay No replay needed. core=unloadcollection2
[junit4:junit4]   2> 13575 T2261 C395 P40007 oasc.RecoveryStrategy.doRecovery Replication Recovery was successful - registering as Active. core=unloadcollection2
[junit4:junit4]   2> 13575 T2261 C395 P40007 oasc.ZkController.publish publishing core=unloadcollection2 state=active
[junit4:junit4]   2> 13575 T2261 C395 P40007 oasc.ZkController.publish numShards not found on descriptor - reading it from system property
[junit4:junit4]   2> 13576 T2261 C395 P40007 oasc.RecoveryStrategy.doRecovery Finished recovery process. core=unloadcollection2
[junit4:junit4]   2> 13946 T2196 oascc.ZkStateReader.updateClusterState Updating cloud state from ZooKeeper... 
[junit4:junit4]   2> 13946 T2196 oasc.Overseer$ClusterStateUpdater.updateState Update state numShards=2 message={
[junit4:junit4]   2> 	  "node_name":"127.0.0.1:40007_fb_ywo%2Fa",
[junit4:junit4]   2> 	  "roles":null,
[junit4:junit4]   2> 	  "shard":"shard1",
[junit4:junit4]   2> 	  "core":"unloadcollection2",
[junit4:junit4]   2> 	  "state":"active",
[junit4:junit4]   2> 	  "core_node_name":null,
[junit4:junit4]   2> 	  "collection":"unloadcollection",
[junit4:junit4]   2> 	  "base_url":"http://127.0.0.1:40007/fb_ywo/a",
[junit4:junit4]   2> 	  "numShards":"2",
[junit4:junit4]   2> 	  "operation":"state"}
[junit4:junit4]   2> 13949 T2255 oascc.ZkStateReader$2.process A cluster state change: WatchedEvent state:SyncConnected type:NodeDataChanged path:/clusterstate.json, has occurred - updating... (live nodes size: 5)
[junit4:junit4]   2> 13950 T2200 oascc.ZkStateReader$2.process A cluster state change: WatchedEvent state:SyncConnected type:NodeDataChanged path:/clusterstate.json, has occurred - updating... (live nodes size: 5)
[junit4:junit4]   2> 13950 T2213 oascc.ZkStateReader$2.process A cluster state change: WatchedEvent state:SyncConnected type:NodeDataChanged path:/clusterstate.json, has occurred - updating... (live nodes size: 5)
[junit4:junit4]   2> 13950 T2227 oascc.ZkStateReader$2.process A cluster state change: WatchedEvent state:SyncConnected type:NodeDataChanged path:/clusterstate.json, has occurred - updating... (live nodes size: 5)
[junit4:junit4]   2> 13950 T2241 oascc.ZkStateReader$2.process A cluster state change: WatchedEvent state:SyncConnected type:NodeDataChanged path:/clusterstate.json, has occurred - updating... (live nodes size: 5)
[junit4:junit4]   2> 13950 T2195 oascc.ZkStateReader$2.process A cluster state change: WatchedEvent state:SyncConnected type:NodeDataChanged path:/clusterstate.json, has occurred - updating... (live nodes size: 5)
[junit4:junit4]   2> 13950 T2259 oascc.ZkStateReader$2.process A cluster state change: WatchedEvent state:SyncConnected type:NodeDataChanged path:/clusterstate.json, has occurred - updating... (live nodes size: 5)
[junit4:junit4]   2> 14560 T2173 oascc.ZkStateReader.updateClusterState Updating cloud state from ZooKeeper... 
[junit4:junit4]   2> 14561 T2173 oasc.AbstractDistribZkTestBase.waitForRecoveriesToFinish Recoveries finished - collection: unloadcollection
[junit4:junit4]   2> 14562 T2173 oascsi.HttpClientUtil.createClient Creating new http client, config:maxConnections=128&maxConnectionsPerHost=32&followRedirects=false
[junit4:junit4]   2> 14567 T2237 oasc.CoreContainer.create Creating SolrCore 'unloadcollection3' using instanceDir: /mnt/ssd/jenkins/workspace/Lucene-Solr-4.x-Linux/solr/build/solr-core/test/J1/./org.apache.solr.cloud.UnloadDistributedZkTest-jetty3-1362817287440/unloadcollection3
[junit4:junit4]   2> 14568 T2237 oasc.ZkController.createCollectionZkNode Check for collection zkNode:unloadcollection
[junit4:junit4]   2> 14568 T2237 oasc.ZkController.createCollectionZkNode Collection zkNode exists
[junit4:junit4]   2> 14569 T2237 oasc.ZkController.readConfigName Load collection config from:/collections/unloadcollection
[junit4:junit4]   2> 14570 T2237 oasc.SolrResourceLoader.<init> new SolrResourceLoader for directory: '/mnt/ssd/jenkins/workspace/Lucene-Solr-4.x-Linux/solr/build/solr-core/test/J1/./org.apache.solr.cloud.UnloadDistributedZkTest-jetty3-1362817287440/unloadcollection3/'
[junit4:junit4]   2> 14601 T2237 oasc.SolrConfig.<init> Using Lucene MatchVersion: LUCENE_42
[junit4:junit4]   2> 14638 T2237 oasc.SolrConfig.<init> Loaded SolrConfig: solrconfig.xml
[junit4:junit4]   2> 14639 T2237 oass.IndexSchema.readSchema Reading Solr Schema
[junit4:junit4]   2> 14644 T2237 oass.IndexSchema.readSchema Schema name=test
[junit4:junit4]   2> 15051 T2237 oass.OpenExchangeRatesOrgProvider.init Initialized with rates=open-exchange-rates.json, refreshInterval=1440.
[junit4:junit4]   2> 15057 T2237 oass.IndexSchema.readSchema default search field in schema is text
[junit4:junit4]   2> 15060 T2237 oass.IndexSchema.readSchema unique key field: id
[junit4:junit4]   2> 15069 T2237 oass.FileExchangeRateProvider.reload Reloading exchange rates from file currency.xml
[junit4:junit4]   2> 15073 T2237 oass.FileExchangeRateProvider.reload Reloading exchange rates from file currency.xml
[junit4:junit4]   2> 15076 T2237 oass.OpenExchangeRatesOrgProvider.reload Reloading exchange rates from open-exchange-rates.json
[junit4:junit4]   2> 15077 T2237 oass.OpenExchangeRatesOrgProvider$OpenExchangeRates.<init> WARNING Unknown key IMPORTANT NOTE
[junit4:junit4]   2> 15077 T2237 oass.OpenExchangeRatesOrgProvider$OpenExchangeRates.<init> WARNING Expected key, got STRING
[junit4:junit4]   2> 15078 T2237 oass.OpenExchangeRatesOrgProvider.reload Reloading exchange rates from open-exchange-rates.json
[junit4:junit4]   2> 15079 T2237 oass.OpenExchangeRatesOrgProvider$OpenExchangeRates.<init> WARNING Unknown key IMPORTANT NOTE
[junit4:junit4]   2> 15079 T2237 oass.OpenExchangeRatesOrgProvider$OpenExchangeRates.<init> WARNING Expected key, got STRING
[junit4:junit4]   2> 15079 T2237 oasc.SolrCore.<init> [unloadcollection3] Opening new SolrCore at /mnt/ssd/jenkins/workspace/Lucene-Solr-4.x-Linux/solr/build/solr-core/test/J1/./org.apache.solr.cloud.UnloadDistributedZkTest-jetty3-1362817287440/unloadcollection3/, dataDir=/mnt/ssd/jenkins/workspace/Lucene-Solr-4.x-Linux/solr/build/solr-core/test/J1/./solrtest-UnloadDistributedZkTest-1362817284791/1362817299353unloadcollection_3n/
[junit4:junit4]   2> 15080 T2237 oasc.JmxMonitoredMap.<init> JMX monitoring is enabled. Adding Solr mbeans to JMX Server: com.sun.jmx.mbeanserver.JmxMBeanServer@53687f
[junit4:junit4]   2> 15080 T2237 oasc.SolrCore.initDirectoryFactory org.apache.solr.core.MockDirectoryFactory
[junit4:junit4]   2> 15081 T2237 oasc.CachingDirectoryFactory.get return new directory for /mnt/ssd/jenkins/workspace/Lucene-Solr-4.x-Linux/solr/build/solr-core/test/J1/./solrtest-UnloadDistributedZkTest-1362817284791/1362817299353unloadcollection_3n forceNew: false
[junit4:junit4]   2> 15081 T2237 oasc.SolrCore.getNewIndexDir New index directory detected: old=null new=/mnt/ssd/jenkins/workspace/Lucene-Solr-4.x-Linux/solr/build/solr-core/test/J1/./solrtest-UnloadDistributedZkTest-1362817284791/1362817299353unloadcollection_3n/index/
[junit4:junit4]   2> 15082 T2237 oasc.SolrCore.initIndex WARNING [unloadcollection3] Solr index directory '/mnt/ssd/jenkins/workspace/Lucene-Solr-4.x-Linux/solr/build/solr-core/test/J1/./solrtest-UnloadDistributedZkTest-1362817284791/1362817299353unloadcollection_3n/index' doesn't exist. Creating new index...
[junit4:junit4]   2> 15082 T2237 oasc.CachingDirectoryFactory.get return new directory for /mnt/ssd/jenkins/workspace/Lucene-Solr-4.x-Linux/solr/build/solr-core/test/J1/./solrtest-UnloadDistributedZkTest-1362817284791/1362817299353unloadcollection_3n/index forceNew: false
[junit4:junit4]   2> 15083 T2237 oasc.SolrDeletionPolicy.onCommit SolrDeletionPolicy.onCommit: commits:num=1
[junit4:junit4]   2> 		commit{dir=MockDirWrapper(org.apache.lucene.store.RAMDirectory@ee4d22 lockFactory=org.apache.lucene.store.NativeFSLockFactory@14bf734),segFN=segments_1,generation=1,filenames=[segments_1]
[junit4:junit4]   2> 15083 T2237 oasc.SolrDeletionPolicy.updateCommits newest commit = 1[segments_1]
[junit4:junit4]   2> 15085 T2237 oasup.UpdateRequestProcessorChain.init inserting DistributedUpdateProcessorFactory into updateRequestProcessorChain "dedupe"
[junit4:junit4]   2> 15086 T2237 oasup.UpdateRequestProcessorChain.init inserting DistributedUpdateProcessorFactory into updateRequestProcessorChain "stored_sig"
[junit4:junit4]   2> 15086 T2237 oasup.UpdateRequestProcessorChain.init inserting DistributedUpdateProcessorFactory into updateRequestProcessorChain "distrib-dup-test-chain-implicit"
[junit4:junit4]   2> 15087 T2237 oasc.RequestHandlers.initHandlersFromConfig created standard: solr.StandardRequestHandler
[junit4:junit4]   2> 15087 T2237 oasc.RequestHandlers.initHandlersFromConfig created /get: solr.RealTimeGetHandler
[junit4:junit4]   2> 15087 T2237 oasc.RequestHandlers.initHandlersFromConfig adding lazy requestHandler: solr.ReplicationHandler
[junit4:junit4]   2> 15088 T2237 oasc.RequestHandlers.initHandlersFromConfig created /replication: solr.ReplicationHandler
[junit4:junit4]   2> 15088 T2237 oasc.RequestHandlers.initHandlersFromConfig created /update: solr.UpdateRequestHandler
[junit4:junit4]   2> 15089 T2237 oasc.RequestHandlers.initHandlersFromConfig created /admin/: org.apache.solr.handler.admin.AdminHandlers
[junit4:junit4]   2> 15091 T2237 oashl.XMLLoader.init xsltCacheLifetimeSeconds=60
[junit4:junit4]   2> 15094 T2237 oass.SolrIndexSearcher.<init> Opening Searcher@1f02181 main
[junit4:junit4]   2> 15094 T2237 oasu.UpdateHandler.clearLog Clearing tlog files, tlogDir=/mnt/ssd/jenkins/workspace/Lucene-Solr-4.x-Linux/solr/build/solr-core/test/J1/./solrtest-UnloadDistributedZkTest-1362817284791/1362817299353unloadcollection_3n/tlog
[junit4:junit4]   2> 15095 T2237 oasu.CommitTracker.<init> Hard AutoCommit: disabled
[junit4:junit4]   2> 15095 T2237 oasu.CommitTracker.<init> Soft AutoCommit: disabled
[junit4:junit4]   2> 15098 T2264 oasc.SolrCore.registerSearcher [unloadcollection3] Registered new searcher Searcher@1f02181 main{StandardDirectoryReader(segments_1:1)}
[junit4:junit4]   2> 15099 T2237 oasc.ZkController.publish publishing core=unloadcollection3 state=down
[junit4:junit4]   2> 15099 T2237 oasc.ZkController.publish numShards not found on descriptor - reading it from system property
[junit4:junit4]   2> 15454 T2196 oascc.ZkStateReader.updateClusterState Updating cloud state from ZooKeeper... 
[junit4:junit4]   2> 15455 T2196 oasc.Overseer$ClusterStateUpdater.updateState Update state numShards=2 message={
[junit4:junit4]   2> 	  "node_name":"127.0.0.1:33223_fb_ywo%2Fa",
[junit4:junit4]   2> 	  "roles":null,
[junit4:junit4]   2> 	  "shard":null,
[junit4:junit4]   2> 	  "core":"unloadcollection3",
[junit4:junit4]   2> 	  "state":"down",
[junit4:junit4]   2> 	  "core_node_name":null,
[junit4:junit4]   2> 	  "collection":"unloadcollection",
[junit4:junit4]   2> 	  "base_url":"http://127.0.0.1:33223/fb_ywo/a",
[junit4:junit4]   2> 	  "numShards":"2",
[junit4:junit4]   2> 	  "operation":"state"}
[junit4:junit4]   2> 15455 T2196 oasc.Overseer$ClusterStateUpdater.updateState Collection already exists with numShards=1
[junit4:junit4]   2> 15455 T2196 oasc.Overseer$ClusterStateUpdater.updateState Assigning new node to shard shard=shard1
[junit4:junit4]   2> 15459 T2227 oascc.ZkStateReader$2.process A cluster state change: WatchedEvent state:SyncConnected type:NodeDataChanged path:/clusterstate.json, has occurred - updating... (live nodes size: 5)
[junit4:junit4]   2> 15459 T2200 oascc.ZkStateReader$2.process A cluster state change: WatchedEvent state:SyncConnected type:NodeDataChanged path:/clusterstate.json, has occurred - updating... (live nodes size: 5)
[junit4:junit4]   2> 15459 T2195 oascc.ZkStateReader$2.process A cluster state change: WatchedEvent state:SyncConnected type:NodeDataChanged path:/clusterstate.json, has occurred - updating... (live nodes size: 5)
[junit4:junit4]   2> 15459 T2255 oascc.ZkStateReader$2.process A cluster state change: WatchedEvent state:SyncConnected type:NodeDataChanged path:/clusterstate.json, has occurred - updating... (live nodes size: 5)
[junit4:junit4]   2> 15459 T2213 oascc.ZkStateReader$2.process A cluster state change: WatchedEvent state:SyncConnected type:NodeDataChanged path:/clusterstate.json, has occurred - updating... (live nodes size: 5)
[junit4:junit4]   2> 15459 T2241 oascc.ZkStateReader$2.process A cluster state change: WatchedEvent state:SyncConnected type:NodeDataChanged path:/clusterstate.json, has occurred - updating... (live nodes size: 5)
[junit4:junit4]   2> 15459 T2259 oascc.ZkStateReader$2.process A cluster state change: WatchedEvent state:SyncConnected type:NodeDataChanged path:/clusterstate.json, has occurred - updating... (live nodes size: 5)
[junit4:junit4]   2> 16101 T2237 oasc.CoreContainer.registerCore registering core: unloadcollection3
[junit4:junit4]   2> 16101 T2237 oasc.ZkController.register Register replica - core:unloadcollection3 address:http://127.0.0.1:33223/fb_ywo/a collection:unloadcollection shard:shard1
[junit4:junit4]   2> 16104 T2237 oasc.ZkController.register We are http://127.0.0.1:33223/fb_ywo/a/unloadcollection3/ and leader is http://127.0.0.1:54993/fb_ywo/a/unloadcollection1/
[junit4:junit4]   2> 16104 T2237 oasc.ZkController.register No LogReplay needed for core=unloadcollection3 baseURL=http://127.0.0.1:33223/fb_ywo/a
[junit4:junit4]   2> 16105 T2237 oasc.ZkController.checkRecovery Core needs to recover:unloadcollection3
[junit4:junit4]   2> 16105 T2237 oasu.DefaultSolrCoreState.doRecovery Running recovery - first canceling any ongoing recovery
[junit4:junit4]   2> ASYNC  NEW_CORE C397 name=unloadcollection3 org.apache.solr.core.SolrCore@186411a url=http://127.0.0.1:33223/fb_ywo/a/unloadcollection3 node=127.0.0.1:33223_fb_ywo%2Fa C397_STATE=coll:unloadcollection core:unloadcollection3 props:{node_name=127.0.0.1:33223_fb_ywo%2Fa, core=unloadcollection3, state=down, collection=unloadcollection, base_url=http://127.0.0.1:33223/fb_ywo/a}
[junit4:junit4]   2> 16105 T2265 C397 P33223 oasc.RecoveryStrategy.run Starting recovery process.  core=unloadcollection3 recoveringAfterStartup=true
[junit4:junit4]   2> 16106 T2265 C397 P33223 oasc.RecoveryStrategy.doRecovery ###### startupVersions=[]
[junit4:junit4]   2> 16106 T2237 oascc.ZkStateReader.updateClusterState Updating cloud state from ZooKeeper... 
[junit4:junit4]   2> 16106 T2265 C397 P33223 oasc.ZkController.publish publishing core=unloadcollection3 state=recovering
[junit4:junit4]   2> 16107 T2265 C397 P33223 oasc.ZkController.publish numShards not found on descriptor - reading it from system property
[junit4:junit4]   2> 16107 T2237 oasc.CoreContainer.persistFile Persisting cores config to /mnt/ssd/jenkins/workspace/Lucene-Solr-4.x-Linux/solr/build/solr-core/test/J1/./org.apache.solr.cloud.UnloadDistributedZkTest-jetty3-1362817287440/solr.xml
[junit4:junit4]   2> 16108 T2265 C397 P33223 oascsi.HttpClientUtil.createClient Creating new http client, config:maxConnections=128&maxConnectionsPerHost=32&followRedirects=false
[junit4:junit4]   2> 16114 T2237 oasc.SolrXMLSerializer.persistFile Persisting cores config to /mnt/ssd/jenkins/workspace/Lucene-Solr-4.x-Linux/solr/build/solr-core/test/J1/./org.apache.solr.cloud.UnloadDistributedZkTest-jetty3-1362817287440/solr.xml
[junit4:junit4]   2> 16115 T2237 oass.SolrDispatchFilter.handleAdminRequest /admin/cores {action=CREATE&wt=javabin&version=2&dataDir=/mnt/ssd/jenkins/workspace/Lucene-Solr-4.x-Linux/solr/build/solr-core/test/J1/./solrtest-UnloadDistributedZkTest-1362817284791/1362817299353unloadcollection_3n&name=unloadcollection3&collection=unloadcollection} status=0 QTime=1548 
[junit4:junit4]   2> 16115 T2173 oasc.AbstractDistribZkTestBase.waitForRecoveriesToFinish Wait for recoveries to finish - collection: unloadcollection failOnTimeout:true timeout (sec):230
[junit4:junit4]   2> 16116 T2173 oascc.ZkStateReader.updateClusterState Updating cloud state from ZooKeeper... 
[junit4:junit4]   2> 16963 T2196 oascc.ZkStateReader.updateClusterState Updating cloud state from ZooKeeper... 
[junit4:junit4]   2> 16964 T2196 oasc.Overseer$ClusterStateUpdater.updateState Update state numShards=2 message={
[junit4:junit4]   2> 	  "node_name":"127.0.0.1:33223_fb_ywo%2Fa",
[junit4:junit4]   2> 	  "roles":null,
[junit4:junit4]   2> 	  "shard":"shard1",
[junit4:junit4]   2> 	  "core":"unloadcollection3",
[junit4:junit4]   2> 	  "state":"recovering",
[junit4:junit4]   2> 	  "core_node_name":null,
[junit4:junit4]   2> 	  "collection":"unloadcollection",
[junit4:junit4]   2> 	  "base_url":"http://127.0.0.1:33223/fb_ywo/a",
[junit4:junit4]   2> 	  "numShards":"2",
[junit4:junit4]   2> 	  "operation":"state"}
[junit4:junit4]   2> 16967 T2255 oascc.ZkStateReader$2.process A cluster state change: WatchedEvent state:SyncConnected type:NodeDataChanged path:/clusterstate.json, has occurred - updating... (live nodes size: 5)
[junit4:junit4]   2> 16967 T2241 oascc.ZkStateReader$2.process A cluster state change: WatchedEvent state:SyncConnected type:NodeDataChanged path:/clusterstate.json, has occurred - updating... (live nodes size: 5)
[junit4:junit4]   2> 16967 T2195 oascc.ZkStateReader$2.process A cluster state change: WatchedEvent state:SyncConnected type:NodeDataChanged path:/clusterstate.json, has occurred - updating... (live nodes size: 5)
[junit4:junit4]   2> 16967 T2200 oascc.ZkStateReader$2.process A cluster state change: WatchedEvent state:SyncConnected type:NodeDataChanged path:/clusterstate.json, has occurred - updating... (live nodes size: 5)
[junit4:junit4]   2> 16967 T2259 oascc.ZkStateReader$2.process A cluster state change: WatchedEvent state:SyncConnected type:NodeDataChanged path:/clusterstate.json, has occurred - updating... (live nodes size: 5)
[junit4:junit4]   2> 16967 T2227 oascc.ZkStateReader$2.process A cluster state change: WatchedEvent state:SyncConnected type:NodeDataChanged path:/clusterstate.json, has occurred - updating... (live nodes size: 5)
[junit4:junit4]   2> 16967 T2213 oascc.ZkStateReader$2.process A cluster state change: WatchedEvent state:SyncConnected type:NodeDataChanged path:/clusterstate.json, has occurred - updating... (live nodes size: 5)
[junit4:junit4]   2> 17111 T2208 oass.SolrDispatchFilter.handleAdminRequest /admin/cores {action=PREPRECOVERY&coreNodeName=127.0.0.1:33223_fb_ywo%252Fa_unloadcollection3&onlyIfLeader=true&wt=javabin&version=2&core=unloadcollection1&state=recovering&checkLive=true&nodeName=127.0.0.1:33223_fb_ywo%252Fa} status=0 QTime=1000 
[junit4:junit4]   2> 17118 T2173 oascc.ZkStateReader.updateClusterState Updating cloud state from ZooKeeper... 
[junit4:junit4]   2> 18119 T2173 oascc.ZkStateReader.updateClusterState Updating cloud state from ZooKeeper... 
[junit4:junit4]   2>  C397_STATE=coll:unloadcollection core:unloadcollection3 props:{node_name=127.0.0.1:33223_fb_ywo%2Fa, shard=shard1, core=unloadcollection3, state=recovering, collection=unloadcollection, base_url=http://127.0.0.1:33223/fb_ywo/a}
[junit4:junit4]   2> 19113 T2265 C397 P33223 oasc.RecoveryStrategy.doRecovery Attempting to PeerSync from http://127.0.0.1:54993/fb_ywo/a/unloadcollection1/ core=unloadcollection3 - recoveringAfterStartup=true
[junit4:junit4]   2> 19113 T2265 C397 P33223 oasu.PeerSync.sync PeerSync: core=unloadcollection3 url=http://127.0.0.1:33223/fb_ywo/a START replicas=[http://127.0.0.1:54993/fb_ywo/a/unloadcollection1/] nUpdates=100
[junit4:junit4]   2> 19113 T2265 C397 P33223 oasu.PeerSync.sync WARNING no frame of reference to tell of we've missed updates
[junit4:junit4]   2> 19114 T2265 C397 P33223 oasc.RecoveryStrategy.doRecovery PeerSync Recovery was not successful - trying replication. core=unloadcollection3
[junit4:junit4]   2> 19114 T2265 C397 P33223 oasc.RecoveryStrategy.doRecovery Starting Replication Recovery. core=unloadcollection3
[junit4:junit4]   2> 19114 T2265 C397 P33223 oasc.RecoveryStrategy.doRecovery Begin buffering updates. core=unloadcollection3
[junit4:junit4]   2> 19114 T2265 C397 P33223 oasu.UpdateLog.bufferUpdates Starting to buffer updates. FSUpdateLog{state=ACTIVE, tlog=null}
[junit4:junit4]   2> 19114 T2265 C397 P33223 oasc.RecoveryStrategy.replicate Attempting to replicate from http://127.0.0.1:54993/fb_ywo/a/unloadcollection1/. core=unloadcollection3
[junit4:junit4]   2> 19114 T2265 C397 P33223 oascsi.HttpClientUtil.createClient Creating new http client, config:maxConnections=128&maxConnectionsPerHost=32&followRedirects=false
[junit4:junit4]   2> 19115 T2208 C396 P54993 REQ /get {qt=/get&getVersions=100&distrib=false&wt=javabin&version=2} status=0 QTime=0 
[junit4:junit4]   2> 19118 T2207 C396 P54993 oasu.DirectUpdateHandler2.commit start commit{,optimize=false,openSearcher=false,waitSearcher=true,expungeDeletes=false,softCommit=false,prepareCommit=false}
[junit4:junit4]   2> 19119 T2207 C396 P54993 oasc.SolrDeletionPolicy.onCommit SolrDeletionPolicy.onCommit: commits:num=2
[junit4:junit4]   2> 		commit{dir=MockDirWrapper(org.apache.lucene.store.RAMDirectory@15dc11c lockFactory=org.apache.lucene.store.NativeFSLockFactory@1d44ef0),segFN=segments_2,generation=2,filenames=[segments_2]
[junit4:junit4]   2> 		commit{dir=MockDirWrapper(org.apache.lucene.store.RAMDirectory@15dc11c lockFactory=org.apache.lucene.store.NativeFSLockFactory@1d44ef0),segFN=segments_3,generation=3,filenames=[segments_3]
[junit4:junit4]   2> 19119 T2207 C396 P54993 oasc.SolrDeletionPolicy.updateCommits newest commit = 3[segments_3]
[junit4:junit4]   2> 19119 T2207 C396 P54993 oasu.DirectUpdateHandler2.commit end_commit_flush
[junit4:junit4]   2> 19120 T2207 C396 P54993 /update {softCommit=false&commit=true&commit_end_point=true&openSearcher=false&waitSearcher=true&wt=javabin&version=2} {commit=} 0 2
[junit4:junit4]   2> 19120 T2265 C397 P33223 oash.ReplicationHandler.inform Commits will be reserved for  10000
[junit4:junit4]   2> 19120 T2265 C397 P33223 oash.SnapPuller.<init>  No value set for 'pollInterval'. Timer Task not started.
[junit4:junit4]   2> 19121 T2173 oascc.ZkStateReader.updateClusterState Updating cloud state from ZooKeeper... 
[junit4:junit4]   2> 19122 T2206 C396 P54993 REQ /replication {qt=/replication&wt=javabin&version=2&command=indexversion} status=0 QTime=0 
[junit4:junit4]   2> 19122 T2265 C397 P33223 oash.SnapPuller.fetchLatestIndex Master's generation: 3
[junit4:junit4]   2> 19123 T2265 C397 P33223 oash.SnapPuller.fetchLatestIndex Slave's generation: 1
[junit4:junit4]   2> 19123 T2265 C397 P33223 oash.SnapPuller.fetchLatestIndex Starting replication process
[junit4:junit4]   2> 19124 T2208 C396 P54993 REQ /replication {qt=/replication&wt=javabin&version=2&generation=3&command=filelist} status=0 QTime=0 
[junit4:junit4]   2> 19125 T2265 C397 P33223 oash.SnapPuller.fetchLatestIndex Number of files in latest index in master: 1
[junit4:junit4]   2> 19126 T2265 C397 P33223 oasc.CachingDirectoryFactory.get return new directory for /mnt/ssd/jenkins/workspace/Lucene-Solr-4.x-Linux/solr/build/solr-core/test/J1/./solrtest-UnloadDistributedZkTest-1362817284791/1362817299353unloadcollection_3n/index.20130309092143912 forceNew: false
[junit4:junit4]   2> 19126 T2265 C397 P33223 oash.SnapPuller.fetchLatestIndex Starting download to MockDirWrapper(org.apache.lucene.store.RAMDirectory@8e04dd lockFactory=org.apache.lucene.store.NativeFSLockFactory@11d680b) fullCopy=false
[junit4:junit4]   2> 19129 T2207 C396 P54993 REQ /replication {qt=/replication&wt=filestream&checksum=true&generation=3&file=segments_3&command=filecontent} status=0 QTime=0 
[junit4:junit4]   2> 19130 T2265 C397 P33223 oash.SnapPuller.fetchLatestIndex Total time taken for download : 0 secs
[junit4:junit4]   2> 19130 T2265 C397 P33223 oasu.DefaultSolrCoreState.newIndexWriter Creating new IndexWriter...
[junit4:junit4]   2> 19130 T2265 C397 P33223 oasu.DefaultSolrCoreState.newIndexWriter Waiting until IndexWriter is unused... core=unloadcollection3
[junit4:junit4]   2> 19131 T2265 C397 P33223 oasc.SolrDeletionPolicy.onInit SolrDeletionPolicy.onInit: commits:num=2
[junit4:junit4]   2> 		commit{dir=MockDirWrapper(org.apache.lucene.store.RAMDirectory@ee4d22 lockFactory=org.apache.lucene.store.NativeFSLockFactory@14bf734),segFN=segments_1,generation=1,filenames=[segments_1]
[junit4:junit4]   2> 		commit{dir=MockDirWrapper(org.apache.lucene.store.RAMDirectory@ee4d22 lockFactory=org.apache.lucene.store.NativeFSLockFactory@14bf734),segFN=segments_3,generation=3,filenames=[segments_3]
[junit4:junit4]   2> 19131 T2265 C397 P33223 oasc.SolrDeletionPolicy.updateCommits newest commit = 3[segments_3]
[junit4:junit4]   2> 19132 T2265 C397 P33223 oasu.DefaultSolrCoreState.newIndexWriter New IndexWriter is ready to be used.
[junit4:junit4]   2> 19132 T2265 C397 P33223 oass.SolrIndexSearcher.<init> Opening Searcher@e85b6d main
[junit4:junit4]   2> 19133 T2264 oasc.SolrCore.registerSearcher [unloadcollection3] Registered new searcher Searcher@e85b6d main{StandardDirectoryReader(segments_3:1:nrt)}
[junit4:junit4]   2> 19133 T2265 C397 P33223 oash.SnapPuller.fetchLatestIndex removing temporary index download directory files MockDirWrapper(org.apache.lucene.store.RAMDirectory@8e04dd lockFactory=org.apache.lucene.store.NativeFSLockFactory@11d680b)
[junit4:junit4]   2> 19133 T2265 C397 P33223 oasc.RecoveryStrategy.replay No replay needed. core=unloadcollection3
[junit4:junit4]   2> 19133 T2265 C397 P33223 oasc.RecoveryStrategy.doRecovery Replication Recovery was successful - registering as Active. core=unloadcollection3
[junit4:junit4]   2> 19134 T2265 C397 P33223 oasc.ZkController.publish publishing core=unloadcollection3 state=active
[junit4:junit4]   2> 19134 T2265 C397 P33223 oasc.ZkController.publish numShards not found on descriptor - reading it from system property
[junit4:junit4]   2> 19135 T2265 C397 P33223 oasc.RecoveryStrategy.doRecovery Finished recovery process. core=unloadcollection3
[junit4:junit4]   2> 19972 T2196 oascc.ZkStateReader.updateClusterState Updating cloud state from ZooKeeper... 
[junit4:junit4]   2> 19973 T2196 oasc.Overseer$ClusterStateUpdater.updateState Update state numShards=2 message={
[junit4:junit4]   2> 	  "node_name":"127.0.0.1:33223_fb_ywo%2Fa",
[junit4:junit4]   2> 	  "roles":null,
[junit4:junit4]   2> 	  "shard":"shard1",
[junit4:junit4]   2> 	  "core":"unloadcollection3",
[junit4:junit4]   2> 	  "state":"active",
[junit4:junit4]   2> 	  "core_node_name":null,
[junit4:junit4]   2> 	  "collection":"unloadcollection",
[junit4:junit4]   2> 	  "base_url":"http://127.0.0.1:33223/fb_ywo/a",
[junit4:junit4]   2> 	  "numShards":"2",
[junit4:junit4]   2> 	  "operation":"state"}
[junit4:junit4]   2> 19978 T2241 oascc.ZkStateReader$2.process A cluster state change: WatchedEvent state:SyncConnected type:NodeDataChanged path:/clusterstate.json, has occurred - updating... (live nodes size: 5)
[junit4:junit4]   2> 19978 T2227 oascc.ZkStateReader$2.process A cluster state change: WatchedEvent state:SyncConnected type:NodeDataChanged path:/clusterstate.json, has occurred - updating... (live nodes size: 5)
[junit4:junit4]   2> 19978 T2259 oascc.ZkStateReader$2.process A cluster state change: WatchedEvent state:SyncConnected type:NodeDataChanged path:/clusterstate.json, has occurred - updating... (live nodes size: 5)
[junit4:junit4]   2> 19978 T2213 oascc.ZkStateReader$2.process A cluster state change: WatchedEvent state:SyncConnected type:NodeDataChanged path:/clusterstate.json, has occurred - updating... (live nodes size: 5)
[junit4:junit4]   2> 19978 T2195 oascc.ZkStateReader$2.process A cluster state change: WatchedEvent state:SyncConnected type:NodeDataChanged path:/clusterstate.json, has occurred - updating... (live nodes size: 5)
[junit4:junit4]   2> 19978 T2200 oascc.ZkStateReader$2.process A cluster state change: WatchedEvent state:SyncConnected type:NodeDataChanged path:/clusterstate.json, has occurred - updating... (live nodes size: 5)
[junit4:junit4]   2> 19978 T2255 oascc.ZkStateReader$2.process A cluster state change: WatchedEvent state:SyncConnected type:NodeDataChanged path:/clusterstate.json, has occurred - updating... (live nodes size: 5)
[junit4:junit4]   2> 20123 T2173 oascc.ZkStateReader.updateClusterState Updating cloud state from ZooKeeper... 
[junit4:junit4]   2> 20124 T2173 oasc.AbstractDistribZkTestBase.waitForRecoveriesToFinish Recoveries finished - collection: unloadcollection
[junit4:junit4]   2> 20125 T2173 oascsi.HttpClientUtil.createClient Creating new http client, config:maxConnections=128&maxConnectionsPerHost=32&followRedirects=false
[junit4:junit4]   2>  C397_STATE=coll:unloadcollection core:unloadcollection3 props:{node_name=127.0.0.1:33223_fb_ywo%2Fa, shard=shard1, core=unloadcollection3, state=active, collection=unloadcollection, base_url=http://127.0.0.1:33223/fb_ywo/a}
[junit4:junit4]   2> 20142 T2236 C397 P33223 /update {update.distrib=FROMLEADER&distrib.from=http://127.0.0.1:54993/fb_ywo/a/unloadcollection1/&wt=javabin&version=2} {add=[20 (1429017518327988224)]} 0 1
[junit4:junit4]   2>  C395_STATE=coll:unloadcollection core:unloadcollection2 props:{node_name=127.0.0.1:40007_fb_ywo%2Fa, shard=shard1, core=unloadcollection2, state=active, collection=unloadcollection, base_url=http://127.0.0.1:40007/fb_ywo/a}
[junit4:junit4]   2> 20145 T2221 C395 P40007 /update {update.distrib=FROMLEADER&distrib.from=http://127.0.0.1:54993/fb_ywo/a/unloadcollection1/&wt=javabin&version=2} {add=[20 (1429017518327988224)]} 0 1
[junit4:junit4]   2> 20146 T2209 C396 P54993 /update {update.distrib=TOLEADER&distrib.from=http://127.0.0.1:33223/fb_ywo/a/unloadcollection3/&wt=javabin&version=2} {add=[20 (1429017518327988224)]} 0 9
[junit4:junit4]   2> 20146 T2235 C397 P33223 /update {wt=javabin&version=2} {add=[20]} 0 11
[junit4:junit4]   2> 20153 T2234 C397 P33223 /update {update.distrib=FROMLEADER&distrib.from=http://127.0.0.1:54993/fb_ywo/a/unloadcollection1/&wt=javabin&version=2} {add=[21 (1429017518341619712)]} 0 1
[junit4:junit4]   2> 20153 T2223 C395 P40007 /update {update.distrib=FROMLEADER&distrib.from=http://127.0.0.1:54993/fb_ywo/a/unloadcollection1/&wt=javabin&version=2} {add=[21 (1429017518341619712)]} 0 1
[junit4:junit4]   2> 20153 T2206 C396 P54993 /update {update.distrib=TOLEADER&distrib.from=http://127.0.0.1:33223/fb_ywo/a/unloadcollection3/&wt=javabin&version=2} {add=[21 (1429017518341619712)]} 0 3
[junit4:junit4]   2> 20154 T2237 C397 P33223 /update {wt=javabin&version=2} {add=[21]} 0 6
[junit4:junit4]   2> 20160 T2235 C397 P33223 /update {update.distrib=FROMLEADER&distrib.from=http://127.0.0.1:54993/fb_ywo/a/unloadcollection1/&wt=javabin&version=2} {add=[22 (1429017518348959744)]} 0 1
[junit4:junit4]   2> 20160 T2222 C395 P40007 /update {update.distrib=FROMLEADER&distrib.from=http://127.0.0.1:54993/fb_ywo/a/unloadcollection1/&wt=javabin&version=2} {add=[22 (1429017518348959744)]} 0 1
[junit4:junit4]   2> 20161 T2208 C396 P54993 /update {update.distrib=TOLEADER&distrib.from=http://127.0.0.1:33223/fb_ywo/a/unloadcollection3/&wt=javabin&version=2} {add=[22 (1429017518348959744)]} 0 4
[junit4:junit4]   2> 20161 T2236 C397 P33223 /update {wt=javabin&version=2} {add=[22]} 0 5
[junit4:junit4]   2> 20167 T2237 C397 P33223 /update {update.distrib=FROMLEADER&distrib.from=http://127.0.0.1:54993/fb_ywo/a/unloadcollection1/&wt=javabin&version=2} {add=[23 (1429017518357348352)]} 0 0
[junit4:junit4]   2> 20168 T2220 C395 P40007 /update {update.distrib=FROMLEADER&distrib.from=http://127.0.0.1:54993/fb_ywo/a/unloadcollection1/&wt=javabin&version=2} {add=[23 (1429017518357348352)]} 0 1
[junit4:junit4]   2> 20168 T2207 C396 P54993 /update {update.distrib=TOLEADER&distrib.from=http://127.0.0.1:33223/fb_ywo/a/unloadcollection3/&wt=javabin&version=2} {add=[23 (1429017518357348352)]} 0 3
[junit4:junit4]   2> 20168 T2234 C397 P33223 /update {wt=javabin&version=2} {add=[23]} 0 5
[junit4:junit4]   2> 20174 T2221 C395 P40007 /update {update.distrib=FROMLEADER&distrib.from=http://127.0.0.1:54993/fb_ywo/a/unloadcollection1/&wt=javabin&version=2} {add=[24 (1429017518364688384)]} 0 0
[junit4:junit4]   2> 20174 T2236 C397 P33223 /update {update.distrib=FROMLEADER&distrib.from=http://127.0.0.1:54993/fb_ywo/a/unloadcollection1/&wt=javabin&version=2} {add=[24 (1429017518364688384)]} 0 0
[junit4:junit4]   2> 20175 T2209 C396 P54993 /update {update.distrib=TOLEADER&distrib.from=http://127.0.0.1:33223/fb_ywo/a/unloadcollection3/&wt=javabin&version=2} {add=[24 (1429017518364688384)]} 0 3
[junit4:junit4]   2> 20176 T2235 C397 P33223 /update {wt=javabin&version=2} {add=[24]} 0 6
[junit4:junit4]   2> 20181 T2223 C395 P40007 /update {update.distrib=FROMLEADER&distrib.from=http://127.0.0.1:54993/fb_ywo/a/unloadcollection1/&wt=javabin&version=2} {add=[25 (1429017518372028416)]} 0 0
[junit4:junit4]   2> 20181 T2234 C397 P33223 /update {update.distrib=FROMLEADER&distrib.from=http://127.0.0.1:54993/fb_ywo/a/unloadcollection1/&wt=javabin&version=2} {add=[25 (1429017518372028416)]} 0 0
[junit4:junit4]   2> 20182 T2206 C396 P54993 /update {update.distrib=TOLEADER&distrib.from=http://127.0.0.1:33223/fb_ywo/a/unloadcollection3/&wt=javabin&version=2} {add=[25 (1429017518372028416)]} 0 3
[junit4:junit4]   2> 20182 T2237 C397 P33223 /update {wt=javabin&version=2} {add=[25]} 0 5
[junit4:junit4]   2> 20188 T2235 C397 P33223 /update {update.distrib=FROMLEADER&distrib.from=http://127.0.0.1:54993/fb_ywo/a/unloadcollection1/&wt=javabin&version=2} {add=[26 (1429017518379368448)]} 0 0
[junit4:junit4]   2> 20188 T2222 C395 P40007 /update {update.distrib=FROMLEADER&distrib.from=http://127.0.0.1:54993/fb_ywo/a/unloadcollection1/&wt=javabin&version=2} {add=[26 (1429017518379368448)]} 0 0
[junit4:junit4]   2> 20189 T2208 C396 P54993 /update {update.distrib=TOLEADER&distrib.from=http://127.0.0.1:33223/fb_ywo/a/unloadcollection3/&wt=javabin&version=2} {add=[26 (1429017518379368448)]} 0 3
[junit4:junit4]   2> 20189 T2236 C397 P33223 /update {wt=javabin&version=2} {add=[26]} 0 5
[junit4:junit4]   2> 20195 T2237 C397 P33223 /update {update.distrib=FROMLEADER&distrib.from=http://127.0.0.1:54993/fb_ywo/a/unloadcollection1/&wt=javabin&version=2} {add=[27 (1429017518386708480)]} 0 0
[junit4:junit4]   2> 20195 T2220 C395 P40007 /update {update.distrib=FROMLEADER&distrib.from=http://127.0.0.1:54993/fb_ywo/a/unloadcollection1/&wt=javabin&version=2} {add=[27 (1429017518386708480)]} 0 0
[junit4:junit4]   2> 20196 T2207 C396 P54993 /update {update.distrib=TOLEADER&distrib.from=http://127.0.0.1:33223/fb_ywo/a/unloadcollection3/&wt=javabin&version=2} {add=[27 (1429017518386708480)]} 0 3
[junit4:junit4]   2> 20196 T2234 C397 P33223 /update {wt=javabin&version=2} {add=[27]} 0 5
[junit4:junit4]   2> 20202 T2221 C395 P40007 /update {update.distrib=FROMLEADER&distrib.from=http://127.0.0.1:54993/fb_ywo/a/unloadcollection1/&wt=javabin&version=2} {add=[28 (1429017518394048512)]} 0 0
[junit4:junit4]   2> 20202 T2236 C397 P33223 /update {update.distrib=FROMLEADER&distrib.from=http://127.0.0.1:54993/fb_ywo/a/unloadcollection1/&wt=javabin&version=2} {add=[28 (1429017518394048512)]} 0 0
[junit4:junit4]   2> 20203 T2209 C396 P54993 /update {update.distrib=TOLEADER&distrib.from=http://127.0.0.1:33223/fb_ywo/a/unloadcollection3/&wt=javabin&version=2} {add=[28 (1429017518394048512)]} 0 3
[junit4:junit4]   2> 20204 T2235 C397 P33223 /update {wt=javabin&version=2} {add=[28]} 0 6
[junit4:junit4]   2> 20209 T2223 C395 P40007 /update {update.distrib=FROMLEADER&distrib.from=http://127.0.0.1:54993/fb_ywo/a/unloadcollection1/&wt=javabin&version=2} {add=[29 (1429017518401388544)]} 0 0
[junit4:junit4]   2> 20209 T2234 C397 P33223 /update {update.distrib=FROMLEADER&distrib.from=http://127.0.0.1:54993/fb_ywo/a/unloadcollection1/&wt=javabin&version=2} {add=[29 (1429017518401388544)]} 0 0
[junit4:junit4]   2> 20210 T2206 C396 P54993 /update {update.distrib=TOLEADER&distrib.from=http://127.0.0.1:33223/fb_ywo/a/unloadcollection3/&wt=javabin&version=2} {add=[29 (1429017518401388544)]} 0 3
[junit4:junit4]   2> 20210 T2237 C397 P33223 /update {wt=javabin&version=2} {add=[29]} 0 5
[junit4:junit4]   2> 20216 T2235 C397 P33223 /update {update.distrib=FROMLEADER&distrib.from=http://127.0.0.1:54993/fb_ywo/a/unloadcollection1/&wt=javabin&version=2} {add=[30 (1429017518408728576)]} 0 0
[junit4:junit4]   2> 20216 T2222 C395 P40007 /update {update.distrib=FROMLEADER&distrib.from=http://127.0.0.1:54993/fb_ywo/a/unloadcollection1/&wt=javabin&version=2} {add=[30 (1429017518408728576)]} 0 0
[junit4:junit4]   2> 20217 T2208 C396 P54993 /update {update.distrib=TOLEADER&distrib.from=http://127.0.0.1:33223/fb_ywo/a/unloadcollection3/&wt=javabin&version=2} {add=[30 (1429017518408728576)]} 0 3
[junit4:junit4]   2> 20217 T2236 C397 P33223 /update {wt=javabin&version=2} {add=[30]} 0 5
[junit4:junit4]   2> 20223 T2237 C397 P33223 /update {update.distrib=FROMLEADER&distrib.from=http://127.0.0.1:54993/fb_ywo/a/unloadcollection1/&wt=javabin&version=2} {add=[31 (1429017518416068608)]} 0 0
[junit4:junit4]   2> 20224 T2220 C395 P40007 /update {update.distrib=FROMLEADER&distrib.from=http://127.0.0.1:54993/fb_ywo/a/unloadcollection1/&wt=javabin&version=2} {add=[31 (1429017518416068608)]} 0 1
[junit4:junit4]   2> 20224 T2207 C396 P54993 /update {update.distrib=TOLEADER&distrib.from=http://127.0.0.1:33223/fb_ywo/a/unloadcollection3/&wt=javabin&version=2} {add=[31 (1429017518416068608)]} 0 3
[junit4:junit4]   2> 20225 T2234 C397 P33223 /update {wt=javabin&version=2} {add=[31]} 0 6
[junit4:junit4]   2> 20231 T2221 C395 P40007 /update {update.distrib=FROMLEADER&distrib.from=http://127.0.0.1:54993/fb_ywo/a/unloadcollection1/&wt=javabin&version=2} {add=[32 (1429017518423408640)]} 0 1
[junit4:junit4]   2> 20231 T2236 C397 P33223 /update {update.distrib=FROMLEADER&distrib.from=http://127.0.0.1:54993/fb_ywo/a/unloadcollection1/&wt=javabin&version=2} {add=[32 (1429017518423408640)]} 0 1
[junit4:junit4]   2> 20232 T2209 C396 P54993 /update {update.distrib=TOLEADER&distrib.from=http://127.0.0.1:33223/fb_ywo/a/unloadcollection3/&wt=javabin&version=2} {add=[32 (1429017518423408640)]} 0 4
[junit4:junit4]   2> 20232 T2235 C397 P33223 /update {wt=javabin&version=2} {add=[32]} 0 5
[junit4:junit4]   2> 20238 T2223 C395 P40007 /update {update.distrib=FROMLEADER&distrib.from=http://127.0.0.1:54993/fb_ywo/a/unloadcollection1/&wt=javabin&version=2} {add=[33 (1429017518431797248)]} 0 0
[junit4:junit4]   2> 20238 T2234 C397 P33223 /update {update.distrib=FROMLEADER&distrib.from=http://127.0.0.1:54993/fb_ywo/a/unloadcollection1/&wt=javabin&version=2} {add=[33 (1429017518431797248)]} 0 0
[junit4:junit4]   2> 20239 T2206 C396 P54993 /update {update.distrib=TOLEADER&distrib.from=http://127.0.0.1:33223/fb_ywo/a/unloadcollection3/&wt=javabin&version=2} {add=[33 (1429017518431797248)]} 0 3
[junit4:junit4]   2> 20239 T2237 C397 P33223 /update {wt=javabin&version=2} {add=[33]} 0 5
[junit4:junit4]   2> 20245 T2235 C397 P33223 /update {update.distrib=FROMLEADER&distrib.from=http://127.0.0.1:54993/fb_ywo/a/unloadcollection1/&wt=javabin&version=2} {add=[34 (1429017518439137280)]} 0 0
[junit4:junit4]   2> 20245 T2222 C395 P40007 /update {update.distrib=FROMLEADER&distrib.from=http://127.0.0.1:54993/fb_ywo/a/unloadcollection1/&wt=javabin&version=2} {add=[34 (1429017518439137280)]} 0 0
[junit4:junit4]   2> 20246 T2208 C396 P54993 /update {update.distrib=TOLEADER&distrib.from=http://127.0.0.1:33223/fb_ywo/a/unloadcollection3/&wt=javabin&version=2} {add=[34 (1429017518439137280)]} 0 3
[junit4:junit4]   2> 20246 T2236 C397 P33223 /update {wt=javabin&version=2} {add=[34]} 0 5
[junit4:junit4]   2> 20252 T2237 C397 P33223 /update {update.distrib=FROMLEADER&distrib.from=http://127.0.0.1:54993/fb_ywo/a/unloadcollection1/&wt=javabin&version=2} {add=[35 (1429017518446477312)]} 0 0
[junit4:junit4]   2> 20252 T2220 C395 P40007 /update {update.distrib=FROMLEADER&distrib.from=http://127.0.0.1:54993/fb_ywo/a/unloadcollection1/&wt=javabin&version=2} {add=[35 (1429017518446477312)]} 0 0
[junit4:junit4]   2> 20253 T2207 C396 P54993 /update {update.distrib=TOLEADER&distrib.from=http://127.0.0.1:33223/fb_ywo/a/unloadcollection3/&wt=javabin&version=2} {add=[35 (1429017518446477312)]} 0 3
[junit4:junit4]   2> 20254 T2234 C397 P33223 /update {wt=javabin&version=2} {add=[35]} 0 6
[junit4:junit4]   2> 20259 T2221 C395 P40007 /update {update.distrib=FROMLEADER&distrib.from=http://127.0.0.1:54993/fb_ywo/a/unloadcollection1/&wt=javabin&version=2} {add=[36 (1429017518453817344)]} 0 0
[junit4:junit4]   2> 20260 T2236 C397 P33223 /update {update.distrib=FROMLEADER&distrib.from=http://127.0.0.1:54993/fb_ywo/a/unloadcollection1/&wt=javabin&version=2} {add=[36 (1429017518453817344)]} 0 1
[junit4:junit4]   2> 20260 T2209 C396 P54993 /update {update.distrib=TOLEADER&distrib.from=http://127.0.0.1:33223/fb_ywo/a/unloadcollection3/&wt=javabin&version=2} {add=[36 (1429017518453817344)]} 0 3
[junit4:junit4]   2> 20261 T2235 C397 P33223 /update {wt=javabin&version=2} {add=[36]} 0 6
[junit4:junit4]   2> 20266 T2234 C397 P33223 /update {update.distrib=FROMLEADER&distrib.from=http://127.0.0.1:54993/fb_ywo/a/unloadcollection1/&wt=javabin&version=2} {add=[37 (1429017518461157376)]} 0 0
[junit4:junit4]   2> 20266 T2223 C395 P40007 /update {update.distrib=FROMLEADER&distrib.from=http://127.0.0.1:54993/fb_ywo/a/unloadcollection1/&wt=javabin&version=2} {add=[37 (1429017518461157376)]} 0 0
[junit4:junit4]   2> 20267 T2206 C396 P54993 /update {update.distrib=TOLEADER&distrib.from=http://127.0.0.1:33223/fb_ywo/a/unloadcollection3/&wt=javabin&version=2} {add=[37 (1429017518461157376)]} 0 3
[junit4:junit4]   2> 20268 T2237 C397 P33223 /update {wt=javabin&version=2} {add=[37]} 0 5
[junit4:junit4]   2> 20273 T2235 C397 P33223 /update {update.distrib=FROMLEADER&distrib.from=http://127.0.0.1:54993/fb_ywo/a/unloadcollection1/&wt=javabin&version=2} {add=[38 (1429017518468497408)]} 0 0
[junit4:junit4]   2> 20273 T2222 C395 P40007 /update {update.distrib=FROMLEADER&distrib.from=http://127.0.0.1:54993/fb_ywo/a/unloadcollection1/&wt=javabin&version=2} {add=[38 (1429017518468497408)]} 0 0
[junit4:junit4]   2> 20274 T2208 C396 P54993 /update {update.distrib=TOLEADER&distrib.from=http://127.0.0.1:33223/fb_ywo/a/unloadcollection3/&wt=javabin&version=2} {add=[38 (1429017518468497408)]} 0 3
[junit4:junit4]   2> 20275 T2236 C397 P33223 /update {wt=javabin&version=2} {add=[38]} 0 6
[junit4:junit4]   2> 20280 T2237 C397 P33223 /update {update.distrib=FROMLEADER&distrib.from=http://127.0.0.1:54993/fb_ywo/a/unloadcollection1/&wt=javabin&version=2} {add=[39 (1429017518475837440)]} 0 0
[junit4:junit4]   2> 20280 T2220 C395 P40007 /update {update.distrib=FROMLEADER&distrib.from=http://127.0.0.1:54993/fb_ywo/a/unloadcollection1/&wt=javabin&version=2} {add=[39 (1429017518475837440)]} 0 0
[junit4:junit4]   2> 20281 T2207 C396 P54993 /update {update.distrib=TOLEADER&distrib.from=http://127.0.0.1:33223/fb_ywo/a/unloadcollection3/&wt=javabin&version=2} {add=[39 (1429017518475837440)]} 0 3
[junit4:junit4]   2> 20281 T2234 C397 P33223 /update {wt=javabin&version=2} {add=[39]} 0 5
[junit4:junit4]   2> 20286 T2236 C397 P33223 /update {update.distrib=FROMLEADER&distrib.from=http://127.0.0.1:54993/fb_ywo/a/unloadcollection1/&wt=javabin&version=2} {add=[40 (1429017518482128896)]} 0 0
[junit4:junit4]   2> 20286 T2221 C395 P40007 /update {update.distrib=FROMLEADER&distrib.from=http://127.0.0.1:54993/fb_ywo/a/unloadcollection1/&wt=javabin&version=2} {add=[40 (1429017518482128896)]} 0 0
[junit4:junit4]   2> 20287 T2209 C396 P54993 /update {update.distrib=TOLEADER&distrib.from=http://127.0.0.1:33223/fb_ywo/a/unloadcollection3/&wt=javabin&version=2} {add=[40 (1429017518482128896)]} 0 3
[junit4:junit4]   2> 20288 T2235 C397 P33223 /update {wt=javabin&version=2} {add=[40]} 0 5
[junit4:junit4]   2> 20293 T2234 C397 P33223 /update {update.distrib=FROMLEADER&distrib.from=http://127.0.0.1:54993/fb_ywo/a/unloadcollection1/&wt=javabin&version=2} {add=[41 (1429017518489468928)]} 0 0
[junit4:junit4]   2> 20293 T2223 C395 P40007 /update {update.distrib=FROMLEADER&distrib.from=http://127.0.0.1:54993/fb_ywo/a/unloadcollection1/&wt=javabin&version=2} {add=[41 (1429017518489468928)]} 0 0
[junit4:junit4]   2> 20294 T2206 C396 P54993 /update {update.distrib=TOLEADER&distrib.from=http://127.0.0.1:33223/fb_ywo/a/unloadcollection3/&wt=javabin&version=2} {add=[41 (1429017518489468928)]} 0 3
[junit4:junit4]   2> 20295 T2237 C397 P33223 /update {wt=javabin&version=2} {add=[41]} 0 6
[junit4:junit4]   2> 20302 T2235 C397 P33223 /update {update.distrib=FROMLEADER&distrib.from=http://127.0.0.1:54993/fb_ywo/a/unloadcollection1/&wt=javabin&version=2} {add=[42 (1429017518497857536)]} 0 1
[junit4:junit4]   2> 20302 T2222 C395 P40007 /update {update.distrib=FROMLEADER&distrib.from=http://127.0.0.1:54993/fb_ywo/a/unloadcollection1/&wt=javabin&version=2} {add=[42 (1429017518497857536)]} 0 1
[junit4:junit4]   2> 20302 T2208 C396 P54993 /update {update.distrib=TOLEADER&distrib.from=http://127.0.0.1:33223/fb_ywo/a/unloadcollection3/&wt=javabin&version=2} {add=[42 (1429017518497857536)]} 0 4
[junit4:junit4]   2> 20303 T2236 C397 P33223 /update {wt=javabin&version=2} {add=[42]} 0 6
[junit4:junit4]   2> 20310 T2220 C395 P40007 /update {update.distrib=FROMLEADER&distrib.from=http://127.0.0.1:54993/fb_ywo/a/unloadcollection1/&wt=javabin&version=2} {add=[43 (1429017518506246144)]} 0 1
[junit4:junit4]   2> 20311 T2237 C397 P33223 /update {update.distrib=FROMLEADER&distrib.from=http://127.0.0.1:54993/fb_ywo/a/unloadcollection1/&wt=javabin&version=2} {add=[43 (1429017518506246144)]} 0 2
[junit4:junit4]   2> 20312 T2207 C396 P54993 /update {update.distrib=TOLEADER&distrib.from=http://127.0.0.1:33223/fb_ywo/a/unloadcollection3/&wt=javabin&version=2} {add=[43 (1429017518506246144)]} 0 5
[junit4:junit4]   2> 20313 T2234 C397 P33223 /update {wt=javabin&version=2} {add=[43]} 0 8
[junit4:junit4]   2> 20321 T2221 C395 P40007 /update {update.distrib=FROMLEADER&distrib.from=http://127.0.0.1:54993/fb_ywo/a/unloadcollection1/&wt=javabin&version=2} {add=[44 (1429017518516731904)]} 0 1
[junit4:junit4]   2> 20321 T2236 C397 P33223 /update {update.distrib=FROMLEADER&distrib.from=http://127.0.0.1:54993/fb_ywo/a/unloadcollection1/&wt=javabin&version=2} {add=[44 (1429017518516731904)]} 0 1
[junit4:junit4]   2> 20322 T2209 C396 P54993 /update {update.distrib=TOLEADER&distrib.from=http://127.0.0.1:33223/fb_ywo/a/unloadcollection3/&wt=javabin&version=2} {add=[44 (1429017518516731904)]} 0 5
[junit4:junit4]   2> 20323 T2235 C397 P33223 /update {wt=javabin&version=2} {add=[44]} 0 8
[junit4:junit4]   2> 20329 T2234 C397 P33223 /update {update.distrib=FROMLEADER&distrib.from=http://127.0.0.1:54993/fb_ywo/a/unloadcollection1/&wt=javabin&version=2} {add=[45 (1429017518527217664)]} 0 1
[junit4:junit4]   2> 20329 T2223 C395 P40007 /update {update.distrib=FROMLEADER&distrib.from=http://127.0.0.1:54993/fb_ywo/a/unloadcollection1/&wt=javabin&version=2} {add=[45 (1429017518527217664)]} 0 1
[junit4:junit4]   2> 20329 T2206 C396 P54993 /update {update.distrib=TOLEADER&distrib.from=http://127.0.0.1:33223/fb_ywo/a/unloadcollection3/&wt=javabin&version=2} {add=[45 (1429017518527217664)]} 0 2
[junit4:junit4]   2> 20330 T2237 C397 P33223 /update {wt=javabin&version=2} {add=[45]} 0 5
[junit4:junit4]   2> 20335 T2222 C395 P40007 /update {update.distrib=FROMLEADER&distrib.from=http://127.0.0.1:54993/fb_ywo/a/unloadcollection1/&wt=javabin&version=2} {add=[46 (1429017518533509120)]} 0 0
[junit4:junit4]   2> 20335 T2235 C397 P33223 /update {update.distrib=FROMLEADER&distrib.from=http://127.0.0.1:54993/fb_ywo/a/unloadcollection1/&wt=javabin&version=2} {add=[46 (1429017518533509120)]} 0 0
[junit4:junit4]   2> 20336 T2208 C396 P54993 /update {update.distrib=TOLEADER&distrib.from=http://127.0.0.1:33223/fb_ywo/a/unloadcollection3/&wt=javabin&version=2} {add=[46 (1429017518533509120)]} 0 3
[junit4:junit4]   2> 20336 T2236 C397 P33223 /update {wt=javabin&version=2} {add=[46]} 0 5
[junit4:junit4]   2> 20342 T2220 C395 P40007 /update {update.distrib=FROMLEADER&distrib.from=http://127.0.0.1:54993/fb_ywo/a/unloadcollection1/&wt=javabin&version=2} {add=[47 (1429017518540849152)]} 0 1
[junit4:junit4]   2> 20342 T2237 C397 P33223 /update {update.distrib=FROMLEADER&distrib.from=http://127.0.0.1:54993/fb_ywo/a/unloadcollection1/&wt=javabin&version=2} {add=[47 (1429017518540849152)]} 0 0
[junit4:junit4]   2> 20343 T2207 C396 P54993 /update {update.distrib=TOLEADER&distrib.from=http://127.0.0.1:33223/fb_ywo/a/unloadcollection3/&wt=javabin&version=2} {add=[47 (1429017518540849152)]} 0 3
[junit4:junit4]   2> 20343 T2234 C397 P33223 /update {wt=javabin&version=2} {add=[47]} 0 5
[junit4:junit4]   2> 20348 T2221 C395 P40007 /update {update.distrib=FROMLEADER&distrib.from=http://127.0.0.1:54993/fb_ywo/a/unloadcollection1/&wt=javabin&version=2} {add=[48 (1429017518547140608)]} 0 0
[junit4:junit4]   2> 20348 T2236 C397 P33223 /update {update.distrib=FROMLEADER&distrib.from=http://127.0.0.1:54993/fb_ywo/a/unloadcollection1/&wt=javabin&version=2} {add=[48 (1429017518547140608)]} 0 0
[junit4:junit4]   2> 20349 T2209 C396 P54993 /update {update.distrib=TOLEADER&distrib.from=http://127.0.0.1:33223/fb_ywo/a/unloadcollection3/&wt=javabin&version=2} {add=[48 (1429017518547140608)]} 0 3
[junit4:junit4]   2> 20349 T2235 C397 P33223 /update {wt=javabin&version=2} {add=[48]} 0 4
[junit4:junit4]   2> 20355 T2234 C397 P33223 /update {update.distrib=FROMLEADER&distrib.from=http://127.0.0.1:54993/fb_ywo/a/unloadcollection1/&wt=javabin&version=2} {add=[49 (1429017518553432064)]} 0 1
[junit4:junit4]   2> 20355 T2223 C395 P40007 /update {update.distrib=FROMLEADER&distrib.from=http://127.0.0.1:54993/fb_ywo/a/unloadcollection1/&wt=javabin&version=2} {add=[49 (1429017518553432064)]} 0 1
[junit4:junit4]   2> 20355 T2206 C396 P54993 /update {update.distrib=TOLEADER&distrib.from=http://127.0.0.1:33223/fb_ywo/a/unloadcollection3/&wt=javabin&version=2} {add=[49 (1429017518553432064)]} 0 3
[junit4:junit4]   2> 20356 T2237 C397 P33223 /update {wt=javabin&version=2} {add=[49]} 0 5
[junit4:junit4]   2> 20361 T2235 C397 P33223 /update {update.distrib=FROMLEADER&distrib.from=http://127.0.0.1:54993/fb_ywo/a/unloadcollection1/&wt=javabin&version=2} {add=[50 (1429017518560772096)]} 0 0
[junit4:junit4]   2> 20361 T2222 C395 P40007 /update {update.distrib=FROMLEADER&distrib.from=http://127.0.0.1:54993/fb_ywo/a/unloadcollection1/&wt=javabin&version=2} {add=[50 (1429017518560772096)]} 0 0
[junit4:junit4]   2> 20362 T2208 C396 P54993 /update {update.distrib=TOLEADER&distrib.from=http://127.0.0.1:33223/fb_ywo/a/unloadcollection3/&wt=javabin&version=2} {add=[50 (1429017518560772096)]} 0 3
[junit4:junit4]   2> 20362 T2236 C397 P33223 /update {wt=javabin&version=2} {add=[50]} 0 4
[junit4:junit4]   2> 20368 T2220 C395 P40007 /update {update.distrib=FROMLEADER&distrib.from=http://127.0.0.1:54993/fb_ywo/a/unloadcollection1/&wt=javabin&version=2} {add=[51 (1429017518568112128)]} 0 1
[junit4:junit4]   2> 20368 T2237 C397 P33223 /update {update.distrib=FROMLEADER&distrib.from=http://127.0.0.1:54993/fb_ywo/a/unloadcollection1/&wt=javabin&version=2} {add=[51 (1429017518568112128)]} 0 1
[junit4:junit4]   2> 20368 T2207 C396 P54993 /update {update.distrib=TOLEADER&distrib.from=http://127.0.0.1:33223/fb_ywo/a/unloadcollection3/&wt=javabin&version=2} {add=[51 (1429017518568112128)]} 0 3
[junit4:junit4]   2> 20369 T2234 C397 P33223 /update {wt=javabin&version=2} {add=[51]} 0 5
[junit4:junit4]   2> 20374 T2221 C395 P40007 /update {update.distrib=FROMLEADER&distrib.from=http://127.0.0.1:54993/fb_ywo/a/unloadcollection1/&wt=javabin&version=2} {add=[52 (1429017518574403584)]} 0 0
[junit4:junit4]   2> 20374 T2236 C397 P33223 /update {update.distrib=FROMLEADER&distrib.from=http://127.0.0.1:54993/fb_ywo/a/unloadcollection1/&wt=javabin&version=2} {add=[52 (1429017518574403584)]} 0 0
[junit4:junit4]   2> 20375 T2209 C396 P54993 /update {update.distrib=TOLEADER&distrib.from=http://127.0.0.1:33223/fb_ywo/a/unloadcollection3/&wt=javabin&version=2} {add=[52 (1429017518574403584)]} 0 3
[junit4:junit4]   2> 20375 T2235 C397 P33223 /update {wt=javabin&version=2} {add=[52]} 0 5
[junit4:junit4]   2> 20380 T2223 C395 P40007 /update {update.distrib=FROMLEADER&distrib.from=http://127.0.0.1:54993/fb_ywo/a/unloadcollection1/&wt=javabin&version=2} {add=[53 (1429017518580695040)]} 0 0
[junit4:junit4]   2> 20380 T2234 C397 P33223 /update {update.distrib=FROMLEADER&distrib.from=http://127.0.0.1:54993/fb_ywo/a/unloadcollection1/&wt=javabin&version=2} {add=[53 (1429017518580695040)]} 0 0
[junit4:junit4]   2> 20381 T2206 C396 P54993 /update {update.distrib=TOLEADER&distrib.from=http://127.0.0.1:33223/fb_ywo/a/unloadcollection3/&wt=javabin&version=2} {add=[53 (1429017518580695040)]} 0 3
[junit4:junit4]   2> 20382 T2237 C397 P33223 /update {wt=javabin&version=2} {add=[53]} 0 5
[junit4:junit4]   2> 20387 T2235 C397 P33223 /update {update.distrib=FROMLEADER&distrib.from=http://127.0.0.1:54993/fb_ywo/a/unloadcollection1/&wt=javabin&version=2} {add=[54 (1429017518588035072)]} 0 0
[junit4:junit4]   2> 20387 T2222 C395 P40007 /update {update.distrib=FROMLEADER&distrib.from=http://127.0.0.1:54993/fb_ywo/a/unloadcollection1/&wt=javabin&version=2} {add=[54 (1429017518588035072)]} 0 0
[junit4:junit4]   2> 20388 T2208 C396 P54993 /update {update.distrib=TOLEADER&distrib.from=http://127.0.0.1:33223/fb_ywo/a/unloadcollection3/&wt=javabin&version=2} {add=[54 (1429017518588035072)]} 0 3
[junit4:junit4]   2> 20389 T2236 C397 P33223 /update {wt=javabin&version=2} {add=[54]} 0 6
[junit4:junit4]   2> 20394 T2220 C395 P40007 /update {update.distrib=FROMLEADER&distrib.from=http://127.0.0.1:54993/fb_ywo/a/unloadcollection1/&wt=javabin&version=2} {add=[55 (1429017518595375104)]} 0 0
[junit4:junit4]   2> 20394 T2237 C397 P33223 /update {update.distrib=FROMLEADER&distrib.from=http://127.0.0.1:54993/fb_ywo/a/unloadcollection1/&wt=javabin&version=2} {add=[55 (1429017518595375104)]} 0 0
[junit4:junit4]   2> 20395 T2207 C396 P54993 /update {update.distrib=TOLEADER&distrib.from=http://127.0.0.1:33223/fb_ywo/a/unloadcollection3/&wt=javabin&version=2} {add=[55 (1429017518595375104)]} 0 3
[junit4:junit4]   2> 20395 T2234 C397 P33223 /update {wt=javabin&version=2} {add=[55]} 0 5
[junit4:junit4]   2> 20401 T2221 C395 P40007 /update {update.distrib=FROMLEADER&distrib.from=http://127.0.0.1:54993/fb_ywo/a/unloadcollection1/&wt=javabin&version=2} {add=[56 (1429017518602715136)]} 0 1
[junit4:junit4]   2> 20401 T2236 C397 P33223 /update {update.distrib=FROMLEADER&distrib.from=http://127.0.0.1:54993/fb_ywo/a/unloadcollection1/&wt=javabin&version=2} {add=[56 (1429017518602715136)]} 0 1
[junit4:junit4]   2> 20401 T2209 C396 P54993 /update {update.distrib=TOLEADER&distrib.from=http://127.0.0.1:33223/fb_ywo/a/unloadcollection3/&wt=javabin&version=2} {add=[56 (1429017518602715136)]} 0 2
[junit4:junit4]   2> 20402 T2235 C397 P33223 /update {wt=javabin&version=2} {add=[56]} 0 5
[junit4:junit4]   2> 20408 T2222 C395 P40007 /update {update.distrib=FROMLEADER&distrib.from=http://127.0.0.1:54993/fb_ywo/a/unloadcollection1/&wt=javabin&version=2} {add=[57 (1429017518609006592)]} 0 1
[junit4:junit4]   2> 20408 T2234 C397 P33223 /update {update.distrib=FROMLEADER&distrib.from=http://127.0.0.1:54993/fb_ywo/a/unloadcollection1/&wt=javabin&version=2} {add=[57 (1429017518609006592)]} 0 1
[junit4:junit4]   2> 20408 T2206 C396 P54993 /update {update.distrib=TOLEADER&distrib.from=http://127.0.0.1:33223/fb_ywo/a/unloadcollection3/&wt=javabin&version=2} {add=[57 (1429017518609006592)]} 0 3
[junit4:junit4]   2> 20409 T2237 C397 P33223 /update {wt=javabin&version=2} {add=[57]} 0 5
[junit4:junit4]   2> 20414 T2235 C397 P33223 /update {update.distrib=FROMLEADER&distrib.from=http://127.0.0.1:54993/fb_ywo/a/unloadcollection1/&wt=javabin&version=2} {add=[58 (1429017518616346624)]} 0 0
[junit4:junit4]   2> 20414 T2220 C395 P40007 /update {update.distrib=FROMLEADER&distrib.from=http://127.0.0.1:54993/fb_ywo/a/unloadcollection1/&wt=javabin&version=2} {add=[58 (1429017518616346624)]} 0 0
[junit4:junit4]   2> 20415 T2208 C396 P54993 /update {update.distrib=TOLEADER&distrib.from=http://127.0.0.1:33223/fb_ywo/a/unloadcollection3/&wt=javabin&version=2} {add=[58 (1429017518616346624)]} 0 3
[junit4:junit4]   2> 20415 T2236 C397 P33223 /update {wt=javabin&version=2} {add=[58]} 0 5
[junit4:junit4]   2> 20421 T2221 C395 P40007 /update {update.distrib=FROMLEADER&distrib.from=http://127.0.0.1:54993/fb_ywo/a/unloadcollection1/&wt=javabin&version=2} {add=[59 (1429017518623686656)]} 0 1
[junit4:junit4]   2> 20421 T2237 C397 P33223 /update {update.distrib=FROMLEADER&distrib.from=http://127.0.0.1:54993/fb_ywo/a/unloadcollection1/&wt=javabin&version=2} {add=[59 (1429017518623686656)]} 0 1
[junit4:junit4]   2> 20421 T2207 C396 P54993 /update {update.distrib=TOLEADER&distrib.from=http://127.0.0.1:33223/fb_ywo/a/unloadcollection3/&wt=javabin&version=2} {add=[59 (1429017518623686656)]} 0 3
[junit4:junit4]   2> 20422 T2234 C397 P33223 /update {wt=javabin&version=2} {add=[59]} 0 5
[junit4:junit4]   2> 20427 T2236 C397 P33223 /update {update.distrib=FROMLEADER&distrib.from=http://127.0.0.1:54993/fb_ywo/a/unloadcollection1/&wt=javabin&version=2} {add=[60 (1429017518629978112)]} 0 0
[junit4:junit4]   2> 20427 T2223 C395 P40007 /update {update.distrib=FROMLEADER&distrib.from=http://127.0.0.1:54993/fb_ywo/a/unloadcollection1/&wt=javabin&version=2} {add=[60 (1429017518629978112)]} 0 0
[junit4:junit4]   2> 20428 T2209 C396 P54993 /update {update.distrib=TOLEADER&distrib.from=http://127.0.0.1:33223/fb_ywo/a/unloadcollection3/&wt=javabin&version=2} {add=[60 (1429017518629978112)]} 0 3
[junit4:junit4]   2> 20428 T2235 C397 P33223 /update {wt=javabin&version=2} {add=[60]} 0 4
[junit4:junit4]   2> 20434 T2234 C397 P33223 /update {update.distrib=FROMLEADER&distrib.from=http://127.0.0.1:54993/fb_ywo/a/unloadcollection1/&wt=javabin&version=2} {add=[61 (1429017518637318144)]} 0 0
[junit4:junit4]   2> 20434 T2222 C395 P40007 /update {update.distrib=FROMLEADER&distrib.from=http://127.0.0.1:54993/fb_ywo/a/unloadcollection1/&wt=javabin&version=2} {add=[61 (1429017518637318144)]} 0 0
[junit4:junit4]   2> 20435 T2206 C396 P54993 /update {update.distrib=TOLEADER&distrib.from=http://127.0.0.1:33223/fb_ywo/a/unloadcollection3/&wt=javabin&version=2} {add=[61 (1429017518637318144)]} 0 3
[junit4:junit4]   2> 20435 T2237 C397 P33223 /update {wt=javabin&version=2} {add=[61]} 0 5
[junit4:junit4]   2> 20441 T2220 C395 P40007 /update {update.distrib=FROMLEADER&distrib.from=http://127.0.0.1:54993/fb_ywo/a/unloadcollection1/&wt=javabin&version=2} {add=[62 (1429017518644658176)]} 0 1
[junit4:junit4]   2> 20441 T2235 C397 P33223 /update {update.distrib=FROMLEADER&distrib.from=http://127.0.0.1:54993/fb_ywo/a/unloadcollection1/&wt=javabin&version=2} {add=[62 (1429017518644658176)]} 0 1
[junit4:junit4]   2> 20441 T2208 C396 P54993 /update {update.distrib=TOLEADER&distrib.from=http://127.0.0.1:33223/fb_ywo/a/unloadcollection3/&wt=javabin&version=2} {add=[62 (1429017518644658176)]} 0 3
[junit4:junit4]   2> 20442 T2236 C397 P33223 /update {wt=javabin&version=2} {add=[62]} 0 5
[junit4:junit4]   2> 20447 T2237 C397 P33223 /update {update.distrib=FROMLEADER&distrib.from=http://127.0.0.1:54993/fb_ywo/a/unloadcollection1/&wt=javabin&version=2} {add=[63 (1429017518650949632)]} 0 0
[junit4:junit4]   2> 20447 T2221 C395 P40007 /update {update.distrib=FROMLEADER&distrib.from=http://127.0.0.1:54993/fb_ywo/a/unloadcollection1/&wt=javabin&version=2} {add=[63 (1429017518650949632)]} 0 0
[junit4:junit4]   2> 20448 T2207 C396 P54993 /update {update.distrib=TOLEADER&distrib.from=http://127.0.0.1:33223/fb_ywo/a/unloadcollection3/&wt=javabin&version=2} {add=[63 (1429017518650949632)]} 0 3
[junit4:junit4]   2> 20448 T2234 C397 P33223 /update {wt=javabin&version=2} {add=[63]} 0 4
[junit4:junit4]   2> 20454 T2223 C395 P40007 /update {update.distrib=FROMLEADER&distrib.from=http://127.0.0.1:54993/fb_ywo/a/unloadcollection1/&wt=javabin&version=2} {add=[64 (1429017518658289664)]} 0 1
[junit4:junit4]   2> 20454 T2236 C397 P33223 /update {update.distrib=FROMLEADER&distrib.from=http://127.0.0.1:54993/fb_ywo/a/unloadcollection1/&wt=javabin&version=2} {add=[64 (1429017518658289664)]} 0 1
[junit4:junit4]   2> 20454 T2209 C396 P54993 /update {update.distrib=TOLEADER&distrib.from=http://127.0.0.1:33223/fb_ywo/a/unloadcollection3/&wt=javabin&version=2} {add=[64 (1429017518658289664)]} 0 3
[junit4:junit4]   2> 20455 T2235 C397 P33223 /update {wt=javabin&version=2} {add=[64]} 0 5
[junit4:junit4]   2> 20460 T2234 C397 P33223 /update {update.distrib=FROMLEADER&distrib.from=http://127.0.0.1:54993/fb_ywo/a/unloadcollection1/&wt=javabin&version=2} {add=[65 (1429017518664581120)]} 0 0
[junit4:junit4]   2> 20460 T2222 C395 P40007 /update {update.distrib=FROMLEADER&distrib.from=http://127.0.0.1:54993/fb_ywo/a/unloadcollection1/&wt=javabin&version=2} {add=[65 (1429017518664581120)]} 0 0
[junit4:junit4]   2> 20461 T2206 C396 P54993 /update {update.distrib=TOLEADER&distrib.from=http://127.0.0.1:33223/fb_ywo/a/unloadcollection3/&wt=javabin&version=2} {add=[65 (1429017518664581120)]} 0 3
[junit4:junit4]   2> 20462 T2237 C397 P33223 /update {wt=javabin&version=2} {add=[65]} 0 5
[junit4:junit4]   2> 20467 T2220 C395 P40007 /update {update.distrib=FROMLEADER&distrib.from=http://127.0.0.1:54993/fb_ywo/a/unloadcollection1/&wt=javabin&version=2} {add=[66 (1429017518671921152)]} 0 0
[junit4:junit4]   2> 20467 T2235 C397 P33223 /update {update.distrib=FROMLEADER&distrib.from=http://127.0.0.1:54993/fb_ywo/a/unloadcollection1/&wt=javabin&version=2} {add=[66 (1429017518671921152)]} 0 0
[junit4:junit4]   2> 20468 T2208 C396 P54993 /update {update.distrib=TOLEADER&distrib.from=http://127.0.0.1:33223/fb_ywo/a/unloadcollection3/&wt=javabin&version=2} {add=[66 (1429017518671921152)]} 0 3
[junit4:junit4]   2> 20468 T2236 C397 P33223 /update {wt=javabin&version=2} {add=[66]} 0 5
[junit4:junit4]   2> 20473 T2237 C397 P33223 /update {update.distrib=FROMLEADER&distrib.from=http://127.0.0.1:54993/fb_ywo/a/unloadcollection1/&wt=javabin&version=2} {add=[67 (1429017518678212608)]} 0 0
[junit4:junit4]   2> 20474 T2221 C395 P40007 /update {update.distrib=FROMLEADER&distrib.from=http://127.0.0.1:54993/fb_ywo/a/unloadcollection1/&wt=javabin&version=2} {add=[67 (1429017518678212608)]} 0 1
[junit4:junit4]   2> 20474 T2207 C396 P54993 /update {update.distrib=TOLEADER&distrib.from=http://127.0.0.1:33223/fb_ywo/a/unloadcollection3/&wt=javabin&version=2} {add=[67 (1429017518678212608)]} 0 3
[junit4:junit4]   2> 20475 T2234 C397 P33223 /update {wt=javabin&version=2} {add=[67]} 0 5
[junit4:junit4]   2> 20480 T2223 C395 P40007 /update {update.distrib=FROMLEADER&distrib.from=http://127.0.0.1:54993/fb_ywo/a/unloadcollection1/&wt=javabin&version=2} {add=[68 (1429017518685552640)]} 0 1
[junit4:junit4]   2> 20480 T2236 C397 P33223 /update {update.distrib=FROMLEADER&distrib.from=http://127.0.0.1:54993/fb_ywo/a/unloadcollection1/&wt=javabin&version=2} {add=[68 (1429017518685552640)]} 0 0
[junit4:junit4]   2> 20481 T2209 C396 P54993 /update {update.distrib=TOLEADER&distrib.from=http://127.0.0.1:33223/fb_ywo/a/unloadcollection3/&wt=javabin&version=2} {add=[68 (1429017518685552640)]} 0 3
[junit4:junit4]   2> 20481 T2235 C397 P33223 /update {wt=javabin&version=2} {add=[68]} 0 5
[junit4:junit4]   2> 20487 T2222 C395 P40007 /update {update.distrib=FROMLEADER&distrib.from=http://127.0.0.1:54993/fb_ywo/a/unloadcollection1/&wt=javabin&version=2} {add=[69 (1429017518691844096)]} 0 1
[junit4:junit4]   2> 20487 T2234 C397 P33223 /update {update.distrib=FROMLEADER&distrib.from=http://127.0.0.1:54993/fb_ywo/a/unloadcollection1/&wt=javabin&version=2} {add=[69 (1429017518691844096)]} 0 1
[junit4:junit4]   2> 20487 T2206 C396 P54993 /update {update.distrib=TOLEADER&distrib.from=http://127.0.0.1:33223/fb_ywo/a/unloadcollection3/&wt=javabin&version=2} {add=[69 (1429017518691844096)]} 0 3
[junit4:junit4]   2> 20488 T2237 C397 P33223 /update {wt=javabin&version=2} {add=[69]} 0 5
[junit4:junit4]   2> 20493 T2235 C397 P33223 /update {update.distrib=FROMLEADER&distrib.from=http://127.0.0.1:54993/fb_ywo/a/unloadcollection1/&wt=javabin&version=2} {add=[70 (1429017518699184128)]} 0 0
[junit4:junit4]   2> 20493 T2220 C395 P40007 /update {update.distrib=FROMLEADER&distrib.from=http://127.0.0.1:54993/fb_ywo/a/unloadcollection1/&wt=javabin&version=2} {add=[70 (1429017518699184128)]} 0 0
[junit4:junit4]   2> 20494 T2208 C396 P54993 /update {update.distrib=TOLEADER&distrib.from=http://127.0.0.1:33223/fb_ywo/a/unloadcollection3/&wt=javabin&version=2} {add=[70 (1429017518699184128)]} 0 3
[junit4:junit4]   2> 20494 T2236 C397 P33223 /update {wt=javabin&version=2} {add=[70]} 0 4
[junit4:junit4]   2> 20500 T2221 C395 P40007 /update {update.distrib=FROMLEADER&distrib.from=http://127.0.0.1:54993/fb_ywo/a/unloadcollection1/&wt=javabin&version=2} {add=[71 (1429017518706524160)]} 0 1
[junit4:junit4]   2> 20500 T2237 C397 P33223 /update {update.distrib=FROMLEADER&distrib.from=http://127.0.0.1:54993/fb_ywo/a/unloadcollection1/&wt=javabin&version=2} {add=[71 (1429017518706524160)]} 0 1
[junit4:junit4]   2> 20500 T2207 C396 P54993 /update {update.distrib=TOLEADER&distrib.from=http://127.0.0.1:33223/fb_ywo/a/unloadcollection3/&wt=javabin&version=2} {add=[71 (1429017518706524160)]} 0 3
[junit4:junit4]   2> 20501 T2234 C397 P33223 /update {wt=javabin&version=2} {add=[71]} 0 5
[junit4:junit4]   2> 20506 T2236 C397 P33223 /update {update.distrib=FROMLEADER&distrib.from=http://127.0.0.1:54993/fb_ywo/a/unloadcollection1/&wt=javabin&version=2} {add=[72 (1429017518712815616)]} 0 0
[junit4:junit4]   2> 20506 T2223 C395 P40007 /update {update.distrib=FROMLEADER&distrib.from=http://127.0.0.1:54993/fb_ywo/a/unloadcollection1/&wt=javabin&version=2} {add=[72 (1429017518712815616)]} 0 0
[junit4:junit4]   2> 20506 T2209 C396 P54993 /update {update.distrib=TOLEADER&distrib.from=http://127.0.0.1:33223/fb_ywo/a/unloadcollection3/&wt=javabin&version=2} {add=[72 (1429017518712815616)]} 0 2
[junit4:junit4]   2> 20507 T2235 C397 P33223 /update {wt=javabin&version=2} {add=[72]} 0 5
[junit4:junit4]   2> 20513 T2234 C397 P33223 /update {update.distrib=FROMLEADER&distrib.from=http://127.0.0.1:54993/fb_ywo/a/unloadcollection1/&wt=javabin&version=2} {add=[73 (1429017518719107072)]} 0 1
[junit4:junit4]   2> 20513 T2222 C395 P40007 /update {update.distrib=FROMLEADER&distrib.from=http://127.0.0.1:54993/fb_ywo/a/unloadcollection1/&wt=javabin&version=2} {add=[73 (1429017518719107072)]} 0 1
[junit4:junit4]   2> 20513 T2206 C396 P54993 /update {update.distrib=TOLEADER&distrib.from=http://127.0.0.1:33223/fb_ywo/a/unloadcollection3/&wt=javabin&version=2} {add=[73 (1429017518719107072)]} 0 3
[junit4:junit4]   2> 20514 T2237 C397 P33223 /update {wt=javabin&version=2} {add=[73]} 0 5
[junit4:junit4]   2> 20519 T2235 C397 P33223 /update {update.distrib=FROMLEADER&distrib.from=http://127.0.0.1:54993/fb_ywo/a/unloadcollection1/&wt=javabin&version=2} {add=[74 (1429017518726447104)]} 0 0
[junit4:junit4]   2> 20519 T2220 C395 P40007 /update {update.distrib=FROMLEADER&distrib.from=http://127.0.0.1:54993/fb_ywo/a/unloadcollection1/&wt=javabin&version=2} {add=[74 (1429017518726447104)]} 0 0
[junit4:junit4]   2> 20520 T2208 C396 P54993 /update {update.distrib=TOLEADER&distrib.from=http://127.0.0.1:33223/fb_ywo/a/unloadcollection3/&wt=javabin&version=2} {add=[74 (1429017518726447104)]} 0 3
[junit4:junit4]   2> 20520 T2236 C397 P33223 /update {wt=javabin&version=2} {add=[74]} 0 5
[junit4:junit4]   2> 20526 T2237 C397 P33223 /update {update.distrib=FROMLEADER&distrib.from=http://127.0.0.1:54993/fb_ywo/a/unloadcollection1/&wt=javabin&version=2} {add=[75 (1429017518732738560)]} 0 1
[junit4:junit4]   2> 20526 T2221 C395 P40007 /update {update.distrib=FROMLEADER&distrib.from=http://127.0.0.1:54993/fb_ywo/a/unloadcollection1/&wt=javabin&version=2} {add=[75 (1429017518732738560)]} 0 1
[junit4:junit4]   2> 20526 T2207 C396 P54993 /update {update.distrib=TOLEADER&distrib.from=http://127.0.0.1:33223/fb_ywo/a/unloadcollection3/&wt=javabin&version=2} {add=[75 (1429017518732738560)]} 0 3
[junit4:junit4]   2> 20527 T2234 C397 P33223 /update {wt=javabin&version=2} {add=[75]} 0 5
[junit4:junit4]   2> 20532 T2223 C395 P40007 /update {update.distrib=FROMLEADER&distrib.from=http://127.0.0.1:54993/fb_ywo/a/unloadcollection1/&wt=javabin&version=2} {add=[76 (1429017518740078592)]} 0 0
[junit4:junit4]   2> 20532 T2235 C397 P33223 /update {update.distrib=FROMLEADER&distrib.from=http://127.0.0.1:54993/fb_ywo/a/unloadcollection1/&wt=javabin&version=2} {add=[76 (1429017518740078592)]} 0 0
[junit4:junit4]   2> 20533 T2209 C396 P54993 /update {update.distrib=TOLEADER&distrib.from=http://127.0.0.1:33223/fb_ywo/a/unloadcollection3/&wt=javabin&version=2} {add=[76 (1429017518740078592)]} 0 3
[junit4:junit4]   2> 20533 T2236 C397 P33223 /update {wt=javabin&version=2} {add=[76]} 0 4
[junit4:junit4]   2> 20539 T2235 C397 P33223 /update {update.distrib=FROMLEADER&distrib.from=http://127.0.0.1:54993/fb_ywo/a/unloadcollection1/&wt=javabin&version=2} {add=[77 (1429017518747418624)]} 0 0
[junit4:junit4]   2> 20539 T2222 C395 P40007 /update {update.distrib=FROMLEADER&distrib.from=http://127.0.0.1:54993/fb_ywo/a/unloadcollection1/&wt=javabin&version=2} {add=[77 (1429017518747418624)]} 0 0
[junit4:junit4]   2> 20540 T2206 C396 P54993 /update {update.distrib=TOLEADER&distrib.from=http://127.0.0.1:33223/fb_ywo/a/unloadcollection3/&wt=javabin&version=2} {add=[77 (1429017518747418624)]} 0 3
[junit4:junit4]   2> 20540 T2234 C397 P33223 /update {wt=javabin&version=2} {add=[77]} 0 5
[junit4:junit4]   2> 20546 T2237 C397 P33223 /update {update.distrib=FROMLEADER&distrib.from=http://127.0.0.1:54993/fb_ywo/a/unloadcollection1/&wt=javabin&version=2} {add=[78 (1429017518753710080)]} 0 1
[junit4:junit4]   2> 20546 T2220 C395 P40007 /update {update.distrib=FROMLEADER&distrib.from=http://127.0.0.1:54993/fb_ywo/a/unloadcollection1/&wt=javabin&version=2} {add=[78 (1429017518753710080)]} 0 1
[junit4:junit4]   2> 20546 T2207 C396 P54993 /update {update.distrib=TOLEADER&distrib.from=http://127.0.0.1:33223/fb_ywo/a/unloadcollection3/&wt=javabin&version=2} {add=[78 (1429017518753710080)]} 0 3
[junit4:junit4]   2> 20547 T2236 C397 P33223 /update {wt=javabin&version=2} {add=[78]} 0 5
[junit4:junit4]   2> 20552 T2234 C397 P33223 /update {update.distrib=FROMLEADER&distrib.from=http://127.0.0.1:54993/fb_ywo/a/unloadcollection1/&wt=javabin&version=2} {add=[79 (1429017518761050112)]} 0 0
[junit4:junit4]   2> 20552 T2223 C395 P40007 /update {update.distrib=FROMLEADER&distrib.from=http://127.0.0.1:54993/fb_ywo/a/unloadcollection1/&wt=javabin&version=2} {add=[79 (1429017518761050112)]} 0 0
[junit4:junit4]   2> 20553 T2209 C396 P54993 /update {update.distrib=TOLEADER&distrib.from=http://127.0.0.1:33223/fb_ywo/a/unloadcollection3/&wt=javabin&version=2} {add=[79 (1429017518761050112)]} 0 3
[junit4:junit4]   2> 20553 T2235 C397 P33223 /update {wt=javabin&version=2} {add=[79]} 0 5
[junit4:junit4]   2> 20559 T2236 C397 P33223 /update {update.distrib=FROMLEADER&distrib.from=http://127.0.0.1:54993/fb_ywo/a/unloadcollection1/&wt=javabin&version=2} {add=[80 (1429017518767341568)]} 0 1
[junit4:junit4]   2> 20559 T2222 C395 P40007 /update {update.distrib=FROMLEADER&distrib.from=http://127.0.0.1:54993/fb_ywo/a/unloadcollection1/&wt=javabin&version=2} {add=[80 (1429017518767341568)]} 0 1
[junit4:junit4]   2> 20559 T2206 C396 P54993 /update {update.distrib=TOLEADER&distrib.from=http://127.0.0.1:33223/fb_ywo/a/unloadcollection3/&wt=javabin&version=2} {add=[80 (1429017518767341568)]} 0 3
[junit4:junit4]   2> 20560 T2237 C397 P33223 /update {wt=javabin&version=2} {add=[80]} 0 5
[junit4:junit4]   2> 20565 T2221 C395 P40007 /update {update.distrib=FROMLEADER&distrib.from=http://127.0.0.1:54993/fb_ywo/a/unloadcollection1/&wt=javabin&version=2} {add=[81 (1429017518774681600)]} 0 0
[junit4:junit4]   2> 20565 T2235 C397 P33223 /update {update.distrib=FROMLEADER&distrib.from=http://127.0.0.1:54993/fb_ywo/a/unloadcollection1/&wt=javabin&version=2} {add=[81 (1429017518774681600)]} 0 0
[junit4:junit4]   2> 20566 T2208 C396 P54993 /update {update.distrib=TOLEADER&distrib.from=http://127.0.0.1:33223/fb_ywo/a/unloadcollection3/&wt=javabin&version=2} {add=[81 (1429017518774681600)]} 0 3
[junit4:junit4]   2> 20566 T2234 C397 P33223 /update {wt=javabin&version=2} {add=[81]} 0 4
[junit4:junit4]   2> 20572 T2237 C397 P33223 /update {update.distrib=FROMLEADER&distrib.from=http://127.0.0.1:54993/fb_ywo/a/unloadcollection1/&wt=javabin&version=2} {add=[82 (1429017518782021632)]} 0 1
[junit4:junit4]   2> 20572 T2220 C395 P40007 /update {update.distrib=FROMLEADER&distrib.from=http://127.0.0.1:54993/fb_ywo/a/unloadcollection1/&wt=javabin&version=2} {add=[82 (1429017518782021632)]} 0 1
[junit4:junit4]   2> 20572 T2207 C396 P54993 /update {update.distrib=TOLEADER&distrib.from=http://127.0.0.1:33223/fb_ywo/a/unloadcollection3/&wt=javabin&version=2} {add=[82 (1429017518782021632)]} 0 3
[junit4:junit4]   2> 20573 T2236 C397 P33223 /update {wt=javabin&version=2} {add=[82]} 0 5
[junit4:junit4]   2> 20578 T2223 C395 P40007 /update {update.distrib=FROMLEADER&distrib.from=http://127.0.0.1:54993/fb_ywo/a/unloadcollection1/&wt=javabin&version=2} {add=[83 (1429017518788313088)]} 0 0
[junit4:junit4]   2> 20578 T2234 C397 P33223 /update {update.distrib=FROMLEADER&distrib.from=http://127.0.0.1:54993/fb_ywo/a/unloadcollection1/&wt=javabin&version=2} {add=[83 (1429017518788313088)]} 0 0
[junit4:junit4]   2> 20579 T2209 C396 P54993 /update {update.distrib=TOLEADER&distrib.from=http://127.0.0.1:33223/fb_ywo/a/unloadcollection3/&wt=javabin&version=2} {add=[83 (1429017518788313088)]} 0 3
[junit4:junit4]   2> 20579 T2235 C397 P33223 /update {wt=javabin&version=2} {add=[83]} 0 5
[junit4:junit4]   2> 20585 T2236 C397 P33223 /update {update.distrib=FROMLEADER&distrib.from=http://127.0.0.1:54993/fb_ywo/a/unloadcollection1/&wt=javabin&version=2} {add=[84 (1429017518794604544)]} 0 1
[junit4:junit4]   2> 20585 T2222 C395 P40007 /update {update.distrib=FROMLEADER&distrib.from=http://127.0.0.1:54993/fb_ywo/a/unloadcollection1/&wt=javabin&version=2} {add=[84 (1429017518794604544)]} 0 1
[junit4:junit4]   2> 20585 T2206 C396 P54993 /update {update.distrib=TOLEADER&distrib.from=http://127.0.0.1:33223/fb_ywo/a/unloadcollection3/&wt=javabin&version=2} {add=[84 (1429017518794604544)]} 0 3
[junit4:junit4]   2> 20586 T2237 C397 P33223 /update {wt=javabin&version=2} {add=[84]} 0 5
[junit4:junit4]   2> 20592 T2235 C397 P33223 /update {update.distrib=FROMLEADER&distrib.from=http://127.0.0.1:54993/fb_ywo/a/unloadcollection1/&wt=javabin&version=2} {add=[85 (1429017518801944576)]} 0 1
[junit4:junit4]   2> 20592 T2221 C395 P40007 /update {update.distrib=FROMLEADER&distrib.from=http://127.0.0.1:54993/fb_ywo/a/unloadcollection1/&wt=javabin&version=2} {add=[85 (1429017518801944576)]} 0 1
[junit4:junit4]   2> 20592 T2208 C396 P54993 /update {update.distrib=TOLEADER&distrib.from=http://127.0.0.1:33223/fb_ywo/a/unloadcollection3/&wt=javabin&version=2} {add=[85 (1429017518801944576)]} 0 3
[junit4:junit4]   2> 20593 T2234 C397 P33223 /update {wt=javabin&version=2} {add=[85]} 0 5
[junit4:junit4]   2> 20598 T2220 C395 P40007 /update {update.distrib=FROMLEADER&distrib.from=http://127.0.0.1:54993/fb_ywo/a/unloadcollection1/&wt=javabin&version=2} {add=[86 (1429017518809284608)]} 0 0
[junit4:junit4]   2> 20598 T2237 C397 P33223 /update {update.distrib=FROMLEADER&distrib.from=http://127.0.0.1:54993/fb_ywo/a/unloadcollection1/&wt=javabin&version=2} {add=[86 (1429017518809284608)]} 0 0
[junit4:junit4]   2> 20599 T2207 C396 P54993 /update {update.distrib=TOLEADER&distrib.from=http://127.0.0.1:33223/fb_ywo/a/unloadcollection3/&wt=javabin&version=2} {add=[86 (1429017518809284608)]} 0 3
[junit4:junit4]   2> 20599 T2236 C397 P33223 /update {wt=javabin&version=2} {add=[86]} 0 4
[junit4:junit4]   2> 20605 T2223 C395 P40007 /update {update.distrib=FROMLEADER&distrib.from=http://127.0.0.1:54993/fb_ywo/a/unloadcollection1/&wt=javabin&version=2} {add=[87 (1429017518816624640)]} 0 1
[junit4:junit4]   2> 20605 T2234 C397 P33223 /update {update.distrib=FROMLEADER&distrib.from=http://127.0.0.1:54993/fb_ywo/a/unloadcollection1/&wt=javabin&version=2} {add=[87 (1429017518816624640)]} 0 1
[junit4:junit4]   2> 20605 T2209 C396 P54993 /update {update.distrib=TOLEADER&distrib.from=http://127.0.0.1:33223/fb_ywo/a/unloadcollection3/&wt=javabin&version=2} {add=[87 (1429017518816624640)]} 0 3
[junit4:junit4]   2> 20606 T2235 C397 P33223 /update {wt=javabin&version=2} {add=[87]} 0 5
[junit4:junit4]   2> 20612 T2236 C397 P33223 /update {update.distrib=FROMLEADER&distrib.from=http://127.0.0.1:54993/fb_ywo/a/unloadcollection1/&wt=javabin&version=2} {add=[88 (1429017518822916096)]} 0 1
[junit4:junit4]   2> 20612 T2222 C395 P40007 /update {update.distrib=FROMLEADER&distrib.from=http://127.0.0.1:54993/fb_ywo/a/unloadcollection1/&wt=javabin&version=2} {add=[88 (1429017518822916096)]} 0 1
[junit4:junit4]   2> 20612 T2206 C396 P54993 /update {update.distrib=TOLEADER&distrib.from=http://127.0.0.1:33223/fb_ywo/a/unloadcollection3/&wt=javabin&version=2} {add=[88 (1429017518822916096)]} 0 3
[junit4:junit4]   2> 20613 T2237 C397 P33223 /update {wt=javabin&version=2} {add=[88]} 0 5
[junit4:junit4]   2> 20619 T2221 C395 P40007 /update {update.distrib=FROMLEADER&distrib.from=http://127.0.0.1:54993/fb_ywo/a/unloadcollection1/&wt=javabin&version=2} {add=[89 (1429017518830256128)]} 0 1
[junit4:junit4]   2> 20619 T2235 C397 P33223 /update {update.distrib=FROMLEADER&distrib.from=http://127.0.0.1:54993/fb_ywo/a/unloadcollection1/&wt=javabin&version=2} {add=[89 (1429017518830256128)]} 0 0
[junit4:junit4]   2> 20620 T2208 C396 P54993 /update {update.distrib=TOLEADER&distrib.from=http://127.0.0.1:33223/fb_ywo/a/unloadcollection3/&wt=javabin&version=2} {add=[89 (1429017518830256128)]} 0 4
[junit4:junit4]   2> 20620 T2234 C397 P33223 /update {wt=javabin&version=2} {add=[89]} 0 5
[junit4:junit4]   2> 20626 T2237 C397 P33223 /update {update.distrib=FROMLEADER&distrib.from=http://127.0.0.1:54993/fb_ywo/a/unloadcollection1/&wt=javabin&version=2} {add=[90 (1429017518838644736)]} 0 0
[junit4:junit4]   2> 20626 T2220 C395 P40007 /update {update.distrib=FROMLEADER&distrib.from=http://127.0.0.1:54993/fb_ywo/a/unloadcollection1/&wt=javabin&version=2} {add=[90 (1429017518838644736)]} 0 0
[junit4:junit4]   2> 20627 T2207 C396 P54993 /update {update.distrib=TOLEADER&distrib.from=http://127.0.0.1:33223/fb_ywo/a/unloadcollection3/&wt=javabin&version=2} {add=[90 (1429017518838644736)]} 0 3
[junit4:junit4]   2> 20627 T2236 C397 P33223 /update {wt=javabin&version=2} {add=[90]} 0 5
[junit4:junit4]   2> 20633 T2223 C395 P40007 /update {update.distrib=FROMLEADER&distrib.from=http://127.0.0.1:54993/fb_ywo/a/unloadcollection1/&wt=javabin&version=2} {add=[91 (1429017518844936192)]} 0 1
[junit4:junit4]   2> 20633 T2234 C397 P33223 /update {update.distrib=FROMLEADER&distrib.from=http://127.0.0.1:54993/fb_ywo/a/unloadcollection1/&wt=javabin&version=2} {add=[91 (1429017518844936192)]} 0 1
[junit4:junit4]   2> 20633 T2209 C396 P54993 /update {update.distrib=TOLEADER&distrib.from=http://127.0.0.1:3322

[...truncated too long message...]

eadPoolExecutor.java:1103)
[junit4:junit4]   2> 	        at java.util.concurrent.ThreadPoolExecutor$Worker.run(ThreadPoolExecutor.java:603)
[junit4:junit4]   2> 	        at java.lang.Thread.run(Thread.java:722)
[junit4:junit4]   2> 	  96) Thread[id=2561, name=searcherExecutor-1317-thread-1, state=WAITING, group=TGRP-ChaosMonkeySafeLeaderTest]
[junit4:junit4]   2> 	        at sun.misc.Unsafe.park(Native Method)
[junit4:junit4]   2> 	        at java.util.concurrent.locks.LockSupport.park(LockSupport.java:175)
[junit4:junit4]   2> 	        at java.util.concurrent.locks.AbstractQueuedSynchronizer$ConditionObject.await(AbstractQueuedSynchronizer.java:2038)
[junit4:junit4]   2> 	        at java.util.concurrent.LinkedBlockingQueue.take(LinkedBlockingQueue.java:439)
[junit4:junit4]   2> 	        at java.util.concurrent.ThreadPoolExecutor.getTask(ThreadPoolExecutor.java:1045)
[junit4:junit4]   2> 	        at java.util.concurrent.ThreadPoolExecutor.runWorker(ThreadPoolExecutor.java:1103)
[junit4:junit4]   2> 	        at java.util.concurrent.ThreadPoolExecutor$Worker.run(ThreadPoolExecutor.java:603)
[junit4:junit4]   2> 	        at java.lang.Thread.run(Thread.java:722)
[junit4:junit4]   2> 	  97) Thread[id=2418, name=Thread-1087, state=WAITING, group=TGRP-ChaosMonkeySafeLeaderTest]
[junit4:junit4]   2> 	        at java.lang.Object.wait(Native Method)
[junit4:junit4]   2> 	        at java.lang.Object.wait(Object.java:502)
[junit4:junit4]   2> 	        at org.apache.solr.core.CloserThread.run(CoreContainer.java:1920)
[junit4:junit4]   2> 	  98) Thread[id=2414, name=TEST-ChaosMonkeySafeLeaderTest.testDistribSearch-seed#[3BEF0DA708BE9CD7]-SendThread(localhost.localdomain:59958), state=TIMED_WAITING, group=TGRP-ChaosMonkeySafeLeaderTest]
[junit4:junit4]   2> 	        at java.lang.Thread.sleep(Native Method)
[junit4:junit4]   2> 	        at org.apache.zookeeper.client.StaticHostProvider.next(StaticHostProvider.java:86)
[junit4:junit4]   2> 	        at org.apache.zookeeper.ClientCnxn$SendThread.startConnect(ClientCnxn.java:937)
[junit4:junit4]   2> 	        at org.apache.zookeeper.ClientCnxn$SendThread.run(ClientCnxn.java:993)
[junit4:junit4]   2> 	  99) Thread[id=2406, name=qtp20959012-2406 Selector1, state=RUNNABLE, group=TGRP-ChaosMonkeySafeLeaderTest]
[junit4:junit4]   2> 	        at sun.nio.ch.EPollArrayWrapper.interrupt(Native Method)
[junit4:junit4]   2> 	        at sun.nio.ch.EPollArrayWrapper.interrupt(EPollArrayWrapper.java:274)
[junit4:junit4]   2> 	        at sun.nio.ch.EPollSelectorImpl.wakeup(EPollSelectorImpl.java:193)
[junit4:junit4]   2> 	        at java.nio.channels.spi.AbstractSelector$1.interrupt(AbstractSelector.java:210)
[junit4:junit4]   2> 	        at java.nio.channels.spi.AbstractSelector.begin(AbstractSelector.java:216)
[junit4:junit4]   2> 	        at sun.nio.ch.EPollSelectorImpl.doSelect(EPollSelectorImpl.java:80)
[junit4:junit4]   2> 	        at sun.nio.ch.SelectorImpl.lockAndDoSelect(SelectorImpl.java:86)
[junit4:junit4]   2> 	        at sun.nio.ch.SelectorImpl.select(SelectorImpl.java:97)
[junit4:junit4]   2> 	        at org.eclipse.jetty.io.nio.SelectorManager$SelectSet.doSelect(SelectorManager.java:569)
[junit4:junit4]   2> 	        at org.eclipse.jetty.io.nio.SelectorManager$1.run(SelectorManager.java:290)
[junit4:junit4]   2> 	        at org.eclipse.jetty.util.thread.QueuedThreadPool.runJob(QueuedThreadPool.java:608)
[junit4:junit4]   2> 	        at org.eclipse.jetty.util.thread.QueuedThreadPool$3.run(QueuedThreadPool.java:543)
[junit4:junit4]   2> 	        at java.lang.Thread.run(Thread.java:722)
[junit4:junit4]   2> 	  100) Thread[id=2680, name=qtp25554994-2680 Acceptor1 SelectChannelConnector@127.0.0.1:43476, state=RUNNABLE, group=TGRP-ChaosMonkeySafeLeaderTest]
[junit4:junit4]   2> 	        at org.eclipse.jetty.server.nio.SelectChannelConnector.getConnection(SelectChannelConnector.java:160)
[junit4:junit4]   2> 	        at org.eclipse.jetty.server.AbstractConnector$Acceptor.run(AbstractConnector.java:934)
[junit4:junit4]   2> 	        at org.eclipse.jetty.util.thread.QueuedThreadPool.runJob(QueuedThreadPool.java:608)
[junit4:junit4]   2> 	        at org.eclipse.jetty.util.thread.QueuedThreadPool$3.run(QueuedThreadPool.java:543)
[junit4:junit4]   2> 	        at java.lang.Thread.run(Thread.java:722)
[junit4:junit4]   2> 7226203 T2446 oaz.ClientCnxn$SendThread.logStartConnect Opening socket connection to server localhost.localdomain/127.0.0.1:59958. Will not attempt to authenticate using SASL (access denied ("javax.security.auth.AuthPermission" "getLoginConfiguration"))
[junit4:junit4]   2> 7226203 T2446 oaz.ClientCnxn$SendThread.run WARNING Session 0x13d4e3ccd58000c for server null, unexpected error, closing socket connection and attempting reconnect java.net.ConnectException: Connection refused
[junit4:junit4]   2> 	at sun.nio.ch.SocketChannelImpl.checkConnect(Native Method)
[junit4:junit4]   2> 	at sun.nio.ch.SocketChannelImpl.finishConnect(SocketChannelImpl.java:692)
[junit4:junit4]   2> 	at org.apache.zookeeper.ClientCnxnSocketNIO.doTransport(ClientCnxnSocketNIO.java:350)
[junit4:junit4]   2> 	at org.apache.zookeeper.ClientCnxn$SendThread.run(ClientCnxn.java:1068)
[junit4:junit4]   2> 
[junit4:junit4]   2> 7226245 T2708 oaz.ClientCnxn$SendThread.logStartConnect Opening socket connection to server localhost.localdomain/127.0.0.1:59958. Will not attempt to authenticate using SASL (access denied ("javax.security.auth.AuthPermission" "getLoginConfiguration"))
[junit4:junit4]   2> 7226246 T2708 oaz.ClientCnxn$SendThread.run WARNING Session 0x13d4e3ccd580024 for server null, unexpected error, closing socket connection and attempting reconnect java.net.ConnectException: Connection refused
[junit4:junit4]   2> 	at sun.nio.ch.SocketChannelImpl.checkConnect(Native Method)
[junit4:junit4]   2> 	at sun.nio.ch.SocketChannelImpl.finishConnect(SocketChannelImpl.java:692)
[junit4:junit4]   2> 	at org.apache.zookeeper.ClientCnxnSocketNIO.doTransport(ClientCnxnSocketNIO.java:350)
[junit4:junit4]   2> 	at org.apache.zookeeper.ClientCnxn$SendThread.run(ClientCnxn.java:1068)
[junit4:junit4]   2> 
[junit4:junit4]   2> NOTE: test params are: codec=FastDecompressionCompressingStoredFields(storedFieldsFormat=CompressingStoredFieldsFormat(compressionMode=FAST_DECOMPRESSION, chunkSize=246), termVectorsFormat=CompressingTermVectorsFormat(compressionMode=FAST_DECOMPRESSION, chunkSize=246)), sim=DefaultSimilarity, locale=sl_SI, timezone=America/Grenada
[junit4:junit4]   2> NOTE: Linux 3.2.0-38-generic i386/Oracle Corporation 1.8.0-ea (32-bit)/cpus=8,threads=125,free=165796736,total=340787200
[junit4:junit4]   2> NOTE: All tests run in this JVM: [SliceStateTest, DocumentBuilderTest, TestPropInjectDefaults, SyncSliceTest, TestReversedWildcardFilterFactory, TestQueryUtils, DirectUpdateHandlerOptimizeTest, TestSurroundQueryParser, PolyFieldTest, TestPluginEnable, TestConfig, JsonLoaderTest, UUIDFieldTest, TestWriterPerf, DistributedTermsComponentTest, FastVectorHighlighterTest, RegexBoostProcessorTest, SchemaVersionSpecificBehaviorTest, ResourceLoaderTest, TestIBSimilarityFactory, TestSolrDeletionPolicy1, PeerSyncTest, LukeRequestHandlerTest, TestJoin, TestRealTimeGet, TermsComponentTest, SolrInfoMBeanTest, TestReplicationHandler, WordBreakSolrSpellCheckerTest, SuggesterFSTTest, PluginInfoTest, SolrCoreTest, TestSearchPerf, SearchHandlerTest, UpdateRequestProcessorFactoryTest, FieldMutatingUpdateProcessorTest, PrimUtilsTest, TestFastWriter, CircularListTest, CoreAdminHandlerTest, QueryElevationComponentTest, DistributedSpellCheckComponentTest, PreAnalyzedFieldTest, SpatialFilterTest, SpellingQueryConverterTest, TestQuerySenderListener, TestGroupingSearch, TestXIncludeConfig, TestDocSet, TestSolrCoreProperties, FileBasedSpellCheckerTest, OverseerTest, DistributedQueryElevationComponentTest, TestValueSourceCache, TestSort, SOLR749Test, SystemInfoHandlerTest, BinaryUpdateRequestHandlerTest, AlternateDirectoryTest, ScriptEngineTest, TestFastLRUCache, TestSolrQueryParser, TestDocumentBuilder, StatelessScriptUpdateProcessorFactoryTest, ZkControllerTest, TestBadConfig, BasicDistributedZkTest, ChaosMonkeySafeLeaderTest]
[junit4:junit4]   2> NOTE: reproduce with: ant test  -Dtestcase=ChaosMonkeySafeLeaderTest -Dtests.seed=3BEF0DA708BE9CD7 -Dtests.multiplier=3 -Dtests.slow=true -Dtests.locale=sl_SI -Dtests.timezone=America/Grenada -Dtests.file.encoding=UTF-8
[junit4:junit4] ERROR   0.00s J0 | ChaosMonkeySafeLeaderTest (suite) <<<
[junit4:junit4]    > Throwable #1: java.lang.Exception: Suite timeout exceeded (>= 7200000 msec).
[junit4:junit4]    > 	at __randomizedtesting.SeedInfo.seed([3BEF0DA708BE9CD7]:0)
[junit4:junit4] Completed on J0 in 7226.32s, 1 test, 2 errors <<< FAILURES!

[...truncated 13 lines...]
BUILD FAILED
/mnt/ssd/jenkins/workspace/Lucene-Solr-4.x-Linux/build.xml:381: The following error occurred while executing this line:
/mnt/ssd/jenkins/workspace/Lucene-Solr-4.x-Linux/build.xml:361: The following error occurred while executing this line:
/mnt/ssd/jenkins/workspace/Lucene-Solr-4.x-Linux/build.xml:39: The following error occurred while executing this line:
/mnt/ssd/jenkins/workspace/Lucene-Solr-4.x-Linux/solr/build.xml:183: The following error occurred while executing this line:
/mnt/ssd/jenkins/workspace/Lucene-Solr-4.x-Linux/solr/common-build.xml:449: The following error occurred while executing this line:
/mnt/ssd/jenkins/workspace/Lucene-Solr-4.x-Linux/lucene/common-build.xml:1213: The following error occurred while executing this line:
/mnt/ssd/jenkins/workspace/Lucene-Solr-4.x-Linux/lucene/common-build.xml:877: There were test failures: 270 suites, 1140 tests, 3 suite-level errors, 1 error, 1 failure, 13 ignored (7 assumptions)

Total time: 159 minutes 48 seconds
Build step 'Invoke Ant' marked build as failure
Archiving artifacts
Recording test results
Description set: Java: 32bit/jdk1.8.0-ea-b79 -client -XX:+UseG1GC -XX:MarkStackSize=256K
Email was triggered for: Failure
Sending email for trigger: Failure