You are viewing a plain text version of this content. The canonical link for it is here.
Posted to commits@tomee.apache.org by Apache Jenkins Server <je...@builds.apache.org> on 2023/06/08 17:27:31 UTC

Build failed in Jenkins: TomEE » tomee-8.x-build-full-java8 #87

See <https://ci-builds.apache.org/job/Tomee/job/tomee-8.x-build-full-java8/87/display/redirect>

Changes:


------------------------------------------
[...truncated 48.77 MB...]
[ERROR] 		at java.lang.reflect.Method.invoke(Method.java:498)
[ERROR] 		at org.apache.openejb.core.interceptor.ReflectionInvocationContext$Invocation.invoke(ReflectionInvocationContext.java:205)
[ERROR] 		at org.apache.openejb.core.interceptor.ReflectionInvocationContext.proceed(ReflectionInvocationContext.java:186)
[ERROR] 		at org.apache.openejb.core.interceptor.InterceptorStack.invoke(InterceptorStack.java:85)
[ERROR] 		at org.apache.openejb.core.singleton.SingletonContainer._invoke(SingletonContainer.java:272)
[ERROR] 		at org.apache.openejb.core.singleton.SingletonContainer.invoke(SingletonContainer.java:221)
[ERROR] 		at org.apache.openejb.server.ejbd.EjbRequestHandler.doEjbObject_BUSINESS_METHOD(EjbRequestHandler.java:371)
[ERROR] 		at org.apache.openejb.server.ejbd.EjbRequestHandler.processRequest(EjbRequestHandler.java:182)
[ERROR] 		at org.apache.openejb.server.ejbd.EjbDaemon.processEjbRequest(EjbDaemon.java:360)
[ERROR] 		at org.apache.openejb.server.ejbd.EjbDaemon.service(EjbDaemon.java:247)
[ERROR] 		at org.apache.openejb.server.ejbd.EjbServer.service(EjbServer.java:104)
[ERROR] 		at org.apache.openejb.server.httpd.ServerServlet.service(ServerServlet.java:60)
[ERROR] 		at javax.servlet.http.HttpServlet.service(HttpServlet.java:623)
[ERROR] 		at org.apache.catalina.core.ApplicationFilterChain.internalDoFilter(ApplicationFilterChain.java:209)
[ERROR] 		at org.apache.catalina.core.ApplicationFilterChain.doFilter(ApplicationFilterChain.java:153)
[ERROR] 		at org.apache.catalina.core.StandardWrapperValve.invoke(StandardWrapperValve.java:167)
[ERROR] 		at org.apache.catalina.core.StandardContextValve.invoke(StandardContextValve.java:90)
[ERROR] 		at org.apache.tomee.catalina.OpenEJBValve.invoke(OpenEJBValve.java:45)
[ERROR] 		at org.apache.catalina.core.StandardHostValve.invoke(StandardHostValve.java:130)
[ERROR] 		at org.apache.catalina.valves.ErrorReportValve.invoke(ErrorReportValve.java:93)
[ERROR] 		at org.apache.tomee.catalina.OpenEJBSecurityListener$RequestCapturer.invoke(OpenEJBSecurityListener.java:97)
[ERROR] 		at org.apache.catalina.valves.AbstractAccessLogValve.invoke(AbstractAccessLogValve.java:673)
[ERROR] 		at org.apache.catalina.core.StandardEngineValve.invoke(StandardEngineValve.java:74)
[ERROR] 		at org.apache.catalina.connector.CoyoteAdapter.service(CoyoteAdapter.java:343)
[ERROR] 		at org.apache.coyote.http11.Http11Processor.service(Http11Processor.java:389)
[ERROR] 		at org.apache.coyote.AbstractProcessorLight.process(AbstractProcessorLight.java:63)
[ERROR] 		at org.apache.coyote.AbstractProtocol$ConnectionHandler.process(AbstractProtocol.java:926)
[ERROR] 		at org.apache.tomcat.util.net.NioEndpoint$SocketProcessor.doRun(NioEndpoint.java:1791)
[ERROR] 		at org.apache.tomcat.util.net.SocketProcessorBase.run(SocketProcessorBase.java:52)
[ERROR] 		at org.apache.tomcat.util.threads.ThreadPoolExecutor.runWorker(ThreadPoolExecutor.java:1191)
[ERROR] 		at org.apache.tomcat.util.threads.ThreadPoolExecutor$Worker.run(ThreadPoolExecutor.java:659)
[ERROR] 		at org.apache.tomcat.util.threads.TaskThread$WrappingRunnable.run(TaskThread.java:61)
[ERROR] 		at java.lang.Thread.run(Thread.java:750)
[ERROR] 08-Jun-2023 17:26:33.426 SEVERE [http-nio-41927-exec-620] org.apache.openejb.core.transaction.EjbTransactionUtil.handleSystemException EjbTransactionUtil.handleSystemException: javax.enterprise.inject.spi.DeploymentException: couldn't start owb context
[ERROR] 	org.apache.openejb.OpenEJBRuntimeException: javax.enterprise.inject.spi.DeploymentException: couldn't start owb context
[ERROR] 		at org.apache.tomee.catalina.deployment.TomcatWebappDeployer.deploy(TomcatWebappDeployer.java:56)
[ERROR] 		at org.apache.openejb.assembler.DeployerEjb.deploy(DeployerEjb.java:177)
[ERROR] 		at org.apache.openejb.assembler.DeployerEjb.deploy(DeployerEjb.java:140)
[ERROR] 		at sun.reflect.GeneratedMethodAccessor134.invoke(Unknown Source)
[ERROR] 		at sun.reflect.DelegatingMethodAccessorImpl.invoke(DelegatingMethodAccessorImpl.java:43)
[ERROR] 		at java.lang.reflect.Method.invoke(Method.java:498)
[ERROR] 		at org.apache.openejb.core.interceptor.ReflectionInvocationContext$Invocation.invoke(ReflectionInvocationContext.java:205)
[ERROR] 		at org.apache.openejb.core.interceptor.ReflectionInvocationContext.proceed(ReflectionInvocationContext.java:186)
[ERROR] 		at org.apache.openejb.security.internal.InternalSecurityInterceptor.invoke(InternalSecurityInterceptor.java:35)
[ERROR] 		at sun.reflect.GeneratedMethodAccessor106.invoke(Unknown Source)
[ERROR] 		at sun.reflect.DelegatingMethodAccessorImpl.invoke(DelegatingMethodAccessorImpl.java:43)
[ERROR] 		at java.lang.reflect.Method.invoke(Method.java:498)
[ERROR] 		at org.apache.openejb.core.interceptor.ReflectionInvocationContext$Invocation.invoke(ReflectionInvocationContext.java:205)
[ERROR] 		at org.apache.openejb.core.interceptor.ReflectionInvocationContext.proceed(ReflectionInvocationContext.java:186)
[ERROR] 		at org.apache.openejb.monitoring.StatsInterceptor.record(StatsInterceptor.java:184)
[ERROR] 		at org.apache.openejb.monitoring.StatsInterceptor.invoke(StatsInterceptor.java:103)
[ERROR] 		at sun.reflect.GeneratedMethodAccessor105.invoke(Unknown Source)
[ERROR] 		at sun.reflect.DelegatingMethodAccessorImpl.invoke(DelegatingMethodAccessorImpl.java:43)
[ERROR] 		at java.lang.reflect.Method.invoke(Method.java:498)
[ERROR] 		at org.apache.openejb.core.interceptor.ReflectionInvocationContext$Invocation.invoke(ReflectionInvocationContext.java:205)
[ERROR] 		at org.apache.openejb.core.interceptor.ReflectionInvocationContext.proceed(ReflectionInvocationContext.java:186)
[ERROR] 		at org.apache.openejb.core.interceptor.InterceptorStack.invoke(InterceptorStack.java:85)
[ERROR] 		at org.apache.openejb.core.singleton.SingletonContainer._invoke(SingletonContainer.java:272)
[ERROR] 		at org.apache.openejb.core.singleton.SingletonContainer.invoke(SingletonContainer.java:221)
[ERROR] 		at org.apache.openejb.server.ejbd.EjbRequestHandler.doEjbObject_BUSINESS_METHOD(EjbRequestHandler.java:371)
[ERROR] 		at org.apache.openejb.server.ejbd.EjbRequestHandler.processRequest(EjbRequestHandler.java:182)
[ERROR] 		at org.apache.openejb.server.ejbd.EjbDaemon.processEjbRequest(EjbDaemon.java:360)
[ERROR] 		at org.apache.openejb.server.ejbd.EjbDaemon.service(EjbDaemon.java:247)
[ERROR] 		at org.apache.openejb.server.ejbd.EjbServer.service(EjbServer.java:104)
[ERROR] 		at org.apache.openejb.server.httpd.ServerServlet.service(ServerServlet.java:60)
[ERROR] 		at javax.servlet.http.HttpServlet.service(HttpServlet.java:623)
[ERROR] 		at org.apache.catalina.core.ApplicationFilterChain.internalDoFilter(ApplicationFilterChain.java:209)
[ERROR] 		at org.apache.catalina.core.ApplicationFilterChain.doFilter(ApplicationFilterChain.java:153)
[ERROR] 		at org.apache.catalina.core.StandardWrapperValve.invoke(StandardWrapperValve.java:167)
[ERROR] 		at org.apache.catalina.core.StandardContextValve.invoke(StandardContextValve.java:90)
[ERROR] 		at org.apache.tomee.catalina.OpenEJBValve.invoke(OpenEJBValve.java:45)
[ERROR] 		at org.apache.catalina.core.StandardHostValve.invoke(StandardHostValve.java:130)
[ERROR] 		at org.apache.catalina.valves.ErrorReportValve.invoke(ErrorReportValve.java:93)
[ERROR] 		at org.apache.tomee.catalina.OpenEJBSecurityListener$RequestCapturer.invoke(OpenEJBSecurityListener.java:97)
[ERROR] 		at org.apache.catalina.valves.AbstractAccessLogValve.invoke(AbstractAccessLogValve.java:673)
[ERROR] 		at org.apache.catalina.core.StandardEngineValve.invoke(StandardEngineValve.java:74)
[ERROR] 		at org.apache.catalina.connector.CoyoteAdapter.service(CoyoteAdapter.java:343)
[ERROR] 		at org.apache.coyote.http11.Http11Processor.service(Http11Processor.java:389)
[ERROR] 		at org.apache.coyote.AbstractProcessorLight.process(AbstractProcessorLight.java:63)
[ERROR] 		at org.apache.coyote.AbstractProtocol$ConnectionHandler.process(AbstractProtocol.java:926)
[ERROR] 		at org.apache.tomcat.util.net.NioEndpoint$SocketProcessor.doRun(NioEndpoint.java:1791)
[ERROR] 		at org.apache.tomcat.util.net.SocketProcessorBase.run(SocketProcessorBase.java:52)
[ERROR] 		at org.apache.tomcat.util.threads.ThreadPoolExecutor.runWorker(ThreadPoolExecutor.java:1191)
[ERROR] 		at org.apache.tomcat.util.threads.ThreadPoolExecutor$Worker.run(ThreadPoolExecutor.java:659)
[ERROR] 		at org.apache.tomcat.util.threads.TaskThread$WrappingRunnable.run(TaskThread.java:61)
[ERROR] 		at java.lang.Thread.run(Thread.java:750)
[ERROR] 	Caused by: javax.enterprise.inject.spi.DeploymentException: couldn't start owb context
[ERROR] 		at org.apache.openejb.cdi.ThreadSingletonServiceImpl.initialize(ThreadSingletonServiceImpl.java:271)
[ERROR] 		at org.apache.openejb.cdi.CdiBuilder.build(CdiBuilder.java:43)
[ERROR] 		at org.apache.openejb.assembler.classic.Assembler.createApplication(Assembler.java:974)
[ERROR] 		at org.apache.openejb.assembler.classic.Assembler.createApplication(Assembler.java:762)
[ERROR] 		at org.apache.tomee.catalina.TomcatWebAppBuilder.startInternal(TomcatWebAppBuilder.java:1340)
[ERROR] 		at org.apache.tomee.catalina.TomcatWebAppBuilder.configureStart(TomcatWebAppBuilder.java:1162)
[ERROR] 		at org.apache.tomee.catalina.GlobalListenerSupport.lifecycleEvent(GlobalListenerSupport.java:134)
[ERROR] 		at org.apache.catalina.util.LifecycleBase.fireLifecycleEvent(LifecycleBase.java:123)
[ERROR] 		at org.apache.catalina.core.StandardContext.startInternal(StandardContext.java:4852)
[ERROR] 		at org.apache.catalina.util.LifecycleBase.start(LifecycleBase.java:183)
[ERROR] 		at org.apache.catalina.core.ContainerBase.addChildInternal(ContainerBase.java:683)
[ERROR] 		at org.apache.catalina.core.ContainerBase.addChild(ContainerBase.java:658)
[ERROR] 		at org.apache.catalina.core.StandardHost.addChild(StandardHost.java:662)
[ERROR] 		at org.apache.tomee.catalina.TomcatWebAppBuilder.deployWar(TomcatWebAppBuilder.java:687)
[ERROR] 		at org.apache.tomee.catalina.TomcatWebAppBuilder.deployWebApps(TomcatWebAppBuilder.java:616)
[ERROR] 		at org.apache.tomee.catalina.deployment.TomcatWebappDeployer.deploy(TomcatWebappDeployer.java:47)
[ERROR] 		... 50 more
[ERROR] 	Caused by: org.apache.openejb.OpenEJBRuntimeException: org.apache.webbeans.exception.WebBeansConfigurationException: Injection point type : Field Injection Point, field name :  instance, Bean Owner : [Baz, WebBeansType:MANAGED, Name:null, API Types:[org.jboss.cdi.tck.tests.lookup.dynamic.broken.raw.Baz,java.lang.Object], Qualifiers:[javax.enterprise.inject.Default,javax.enterprise.inject.Any]] needs to define type argument for javax.enterprise.inject.Instance
[ERROR] 		at org.apache.openejb.cdi.OpenEJBLifecycle.startApplication(OpenEJBLifecycle.java:200)
[ERROR] 		at org.apache.openejb.cdi.ThreadSingletonServiceImpl.initialize(ThreadSingletonServiceImpl.java:269)
[ERROR] 		... 65 more
[ERROR] 	Caused by: org.apache.webbeans.exception.WebBeansConfigurationException: Injection point type : Field Injection Point, field name :  instance, Bean Owner : [Baz, WebBeansType:MANAGED, Name:null, API Types:[org.jboss.cdi.tck.tests.lookup.dynamic.broken.raw.Baz,java.lang.Object], Qualifiers:[javax.enterprise.inject.Default,javax.enterprise.inject.Any]] needs to define type argument for javax.enterprise.inject.Instance
[ERROR] 		at org.apache.webbeans.container.InjectionResolver.checkInjectionPointType(InjectionResolver.java:174)
[ERROR] 		at org.apache.webbeans.container.BeanManagerImpl.validate(BeanManagerImpl.java:1214)
[ERROR] 		at org.apache.webbeans.util.WebBeansUtil.validate(WebBeansUtil.java:1521)
[ERROR] 		at org.apache.webbeans.config.BeansDeployer.validate(BeansDeployer.java:1220)
[ERROR] 		at org.apache.webbeans.config.BeansDeployer.validateInjectionPoints(BeansDeployer.java:1131)
[ERROR] 		at org.apache.webbeans.config.BeansDeployer.deploy(BeansDeployer.java:323)
[ERROR] 		at org.apache.openejb.cdi.OpenEJBLifecycle.startApplication(OpenEJBLifecycle.java:196)
[ERROR] 		... 66 more
[ERROR] 08-Jun-2023 17:26:36.635 INFO [http-nio-41927-exec-623] org.apache.openejb.util.JarExtractor.extract Extracting jar: /home/jenkins/jenkins-agent/712657a4/workspace/Tomee/tomee-8.x-build-full-java8/tck/cdi-tomee/target/workdir/207/429c50e58c9751403f8160c0bb6a479bd593d645.war
[ERROR] 08-Jun-2023 17:26:36.737 INFO [http-nio-41927-exec-623] org.apache.openejb.util.JarExtractor.extract Extracted path: /home/jenkins/jenkins-agent/712657a4/workspace/Tomee/tomee-8.x-build-full-java8/tck/cdi-tomee/target/workdir/207/429c50e58c9751403f8160c0bb6a479bd593d645
[ERROR] 08-Jun-2023 17:26:36.738 INFO [http-nio-41927-exec-623] org.apache.tomee.catalina.TomcatWebAppBuilder.deployWebApps using default host: localhost
[ERROR] 08-Jun-2023 17:26:36.738 INFO [http-nio-41927-exec-623] org.apache.tomee.catalina.TomcatWebAppBuilder.init ------------------------- localhost -> /429c50e58c9751403f8160c0bb6a479bd593d645
[ERROR] 08-Jun-2023 17:26:36.738 INFO [http-nio-41927-exec-623] org.apache.openejb.util.OptionsLog.info Using 'openejb.session.manager=org.apache.tomee.catalina.session.QuickSessionManager'
[ERROR] 08-Jun-2023 17:26:37.393 INFO [http-nio-41927-exec-623] org.apache.openejb.config.ConfigurationFactory.configureApplication Configuring enterprise application: /home/jenkins/jenkins-agent/712657a4/workspace/Tomee/tomee-8.x-build-full-java8/tck/cdi-tomee/target/workdir/207/429c50e58c9751403f8160c0bb6a479bd593d645
[ERROR] 08-Jun-2023 17:26:37.488 INFO [http-nio-41927-exec-623] org.apache.openejb.util.OptionsLog.info Using 'openejb.strict.interface.declaration=true'
[ERROR] 08-Jun-2023 17:26:37.518 INFO [http-nio-41927-exec-623] org.apache.openejb.util.OptionsLog.info Using 'openejb.strict.interface.declaration=true'
[ERROR] 08-Jun-2023 17:26:37.592 INFO [http-nio-41927-exec-623] org.apache.openejb.config.AppInfoBuilder.build Enterprise application "/home/jenkins/jenkins-agent/712657a4/workspace/Tomee/tomee-8.x-build-full-java8/tck/cdi-tomee/target/workdir/207/429c50e58c9751403f8160c0bb6a479bd593d645" loaded.
[ERROR] 08-Jun-2023 17:26:37.592 INFO [http-nio-41927-exec-623] org.apache.openejb.assembler.classic.Assembler.createApplication Assembling app: /home/jenkins/jenkins-agent/712657a4/workspace/Tomee/tomee-8.x-build-full-java8/tck/cdi-tomee/target/workdir/207/429c50e58c9751403f8160c0bb6a479bd593d645
[ERROR] 08-Jun-2023 17:26:37.711 INFO [http-nio-41927-exec-623] org.apache.openejb.cdi.CdiBuilder.initSingleton Existing thread singleton service in SystemInstance(): org.apache.openejb.cdi.ThreadSingletonServiceImpl@130161f7
[ERROR] 08-Jun-2023 17:26:37.743 INFO [http-nio-41927-exec-623] org.apache.openejb.cdi.OpenEJBLifecycle.startApplication OpenWebBeans Container is starting...
[ERROR] 08-Jun-2023 17:26:38.229 INFO [http-nio-41927-exec-623] org.apache.openejb.cdi.OpenEJBLifecycle.startApplication OpenWebBeans Container has started, it took 485 ms.
[ERROR] 08-Jun-2023 17:26:38.255 WARNING [http-nio-41927-exec-623] org.apache.batchee.container.services.ServicesManager.init You didn't specify org.apache.batchee.jmx.application and JMX is already registered, skipping
[ERROR] 08-Jun-2023 17:26:38.273 INFO [http-nio-41927-exec-623] org.apache.openejb.assembler.classic.Assembler.createApplication Deployed Application(path=/home/jenkins/jenkins-agent/712657a4/workspace/Tomee/tomee-8.x-build-full-java8/tck/cdi-tomee/target/workdir/207/429c50e58c9751403f8160c0bb6a479bd593d645)
[ERROR] 08-Jun-2023 17:26:38.601 INFO [http-nio-41927-exec-623] org.apache.jasper.servlet.TldScanner.scanJars At least one JAR was scanned for TLDs yet contained no TLDs. Enable debug logging for this logger for a complete list of JARs that were scanned but no TLDs were found in them. Skipping unneeded JARs during scanning can improve startup time and JSP compilation time.
[ERROR] 08-Jun-2023 17:26:38.608 INFO [http-nio-41927-exec-623] org.apache.tomee.myfaces.TomEEMyFacesContainerInitializer.addListener Installing <listener>org.apache.myfaces.webapp.StartupServletContextListener</listener>
[ERROR] 08-Jun-2023 17:26:39.155 INFO [http-nio-41927-exec-623] org.apache.myfaces.view.facelets.ViewPoolProcessor.initialize org.apache.myfaces.CACHE_EL_EXPRESSIONS web config parameter is set to "noCache". To enable view pooling this param must be set to "alwaysRecompile". View Pooling disabled.
Jun 08, 2023 5:26:33 PM org.apache.openejb.arquillian.common.TomEEContainer undeploy
WARNING: 5bdc97df93627625fe7545c1dfe78be71e8702e.war was not deployed
Jun 08, 2023 5:26:33 PM org.jboss.cdi.tck.shrinkwrap.ArchiveBuilder build
INFO: Test archive built [info: org.jboss.cdi.tck.tests.lookup.dynamic.builtin.BuiltinInstanceTest, time: 41 ms]
Jun 08, 2023 5:26:36 PM org.apache.openejb.client.EventLogger log
INFO: RemoteInitialContextCreated{providerUri=http://localhost:41927/tomee/ejb}
Jun 08, 2023 5:26:39 PM org.jboss.cdi.tck.impl.testng.ProgressLoggingTestListener beforeInvocation
INFO: Invoke BuiltinInstanceTest.testInstanceIsPassivationCapable: 1,272/1,569 Failed tests: 0 (514)
Jun 08, 2023 5:26:40 PM org.jboss.cdi.tck.impl.testng.ProgressLoggingTestListener beforeInvocation
INFO: Invoke BuiltinInstanceTest.testInstanceProvidedForEveryLegalBeanType: 1,273/1,569 Failed tests: 0 (514)
Jun 08, 2023 5:26:40 PM org.jboss.cdi.tck.impl.testng.ProgressLoggingTestListener beforeInvocation
INFO: Invoke BuiltinInstanceTest.testNameOfBuiltinInstance: 1,274/1,569 Failed tests: 0 (514)
Jun 08, 2023 5:26:40 PM org.jboss.cdi.tck.impl.testng.ProgressLoggingTestListener beforeInvocation
INFO: Invoke BuiltinInstanceTest.testScopeOfBuiltinInstance: 1,275/1,569 Failed tests: 0 (514)
[ERROR] 08-Jun-2023 17:26:40.841 INFO [http-nio-41927-exec-623] org.apache.openejb.assembler.classic.Assembler.destroyApplication Undeploying app: /home/jenkins/jenkins-agent/712657a4/workspace/Tomee/tomee-8.x-build-full-java8/tck/cdi-tomee/target/workdir/207/429c50e58c9751403f8160c0bb6a479bd593d645
[ERROR] 08-Jun-2023 17:26:40.843 INFO [http-nio-41927-exec-623] org.apache.catalina.core.StandardWrapper.unload Waiting for [1] instance(s) to be deallocated for Servlet [ArquillianServletRunner]
[ERROR] 08-Jun-2023 17:26:40.944 WARNING [http-nio-41927-exec-623] org.apache.webbeans.web.context.WebContextsService.lazyStartSessionContext Could NOT lazily initialize session context because NO active request context
[ERROR] 08-Jun-2023 17:26:40.944 WARNING [http-nio-41927-exec-623] org.apache.webbeans.web.context.WebContextsService.lazyStartSessionContext Could NOT lazily initialize session context because NO active request context
[ERROR] 08-Jun-2023 17:26:40.944 WARNING [http-nio-41927-exec-623] org.apache.webbeans.web.context.WebContextsService.lazyStartSessionContext Could NOT lazily initialize session context because NO active request context
[ERROR] 08-Jun-2023 17:26:40.944 WARNING [http-nio-41927-exec-623] org.apache.webbeans.web.context.WebContextsService.lazyStartSessionContext Could NOT lazily initialize session context because NO active request context
[ERROR] 08-Jun-2023 17:26:40.944 WARNING [http-nio-41927-exec-623] org.apache.webbeans.web.context.WebContextsService.lazyStartSessionContext Could NOT lazily initialize session context because NO active request context
[ERROR] 08-Jun-2023 17:26:40.944 WARNING [http-nio-41927-exec-623] org.apache.webbeans.web.context.WebContextsService.lazyStartSessionContext Could NOT lazily initialize session context because NO active request context
[ERROR] 08-Jun-2023 17:26:40.944 WARNING [http-nio-41927-exec-623] org.apache.webbeans.web.context.WebContextsService.lazyStartSessionContext Could NOT lazily initialize session context because NO active request context
[ERROR] 08-Jun-2023 17:26:40.944 WARNING [http-nio-41927-exec-623] org.apache.webbeans.web.context.WebContextsService.lazyStartSessionContext Could NOT lazily initialize session context because NO active request context
[ERROR] 08-Jun-2023 17:26:40.944 WARNING [http-nio-41927-exec-623] org.apache.webbeans.web.context.WebContextsService.lazyStartSessionContext Could NOT lazily initialize session context because NO active request context
[ERROR] 08-Jun-2023 17:26:40.944 WARNING [http-nio-41927-exec-623] org.apache.webbeans.web.context.WebContextsService.lazyStartSessionContext Could NOT lazily initialize session context because NO active request context
[ERROR] 08-Jun-2023 17:26:40.944 WARNING [http-nio-41927-exec-623] org.apache.webbeans.web.context.WebContextsService.lazyStartSessionContext Could NOT lazily initialize session context because NO active request context
[ERROR] 08-Jun-2023 17:26:40.944 WARNING [http-nio-41927-exec-623] org.apache.webbeans.web.context.WebContextsService.lazyStartSessionContext Could NOT lazily initialize session context because NO active request context
[ERROR] 08-Jun-2023 17:26:40.944 WARNING [http-nio-41927-exec-623] org.apache.webbeans.web.context.WebContextsService.lazyStartSessionContext Could NOT lazily initialize session context because NO active request context
[ERROR] 08-Jun-2023 17:26:40.944 WARNING [http-nio-41927-exec-623] org.apache.webbeans.web.context.WebContextsService.lazyStartSessionContext Could NOT lazily initialize session context because NO active request context
[ERROR] 08-Jun-2023 17:26:40.944 WARNING [http-nio-41927-exec-623] org.apache.webbeans.web.context.WebContextsService.lazyStartSessionContext Could NOT lazily initialize session context because NO active request context
[ERROR] 08-Jun-2023 17:26:40.944 WARNING [http-nio-41927-exec-623] org.apache.webbeans.web.context.WebContextsService.lazyStartSessionContext Could NOT lazily initialize session context because NO active request context
[ERROR] 08-Jun-2023 17:26:40.944 WARNING [http-nio-41927-exec-623] org.apache.webbeans.web.context.WebContextsService.lazyStartSessionContext Could NOT lazily initialize session context because NO active request context
[ERROR] 08-Jun-2023 17:26:40.944 WARNING [http-nio-41927-exec-623] org.apache.webbeans.web.context.WebContextsService.lazyStartSessionContext Could NOT lazily initialize session context because NO active request context
[ERROR] 08-Jun-2023 17:26:40.944 WARNING [http-nio-41927-exec-623] org.apache.webbeans.web.context.WebContextsService.lazyStartSessionContext Could NOT lazily initialize session context because NO active request context
[ERROR] 08-Jun-2023 17:27:00.406 INFO [http-nio-41927-exec-629] org.apache.openejb.util.JarExtractor.extract Extracting jar: /home/jenkins/jenkins-agent/712657a4/workspace/Tomee/tomee-8.x-build-full-java8/tck/cdi-tomee/target/workdir/207/1d9c41f19331db638ef6408123fcdab3b0cda6.war
[ERROR] 08-Jun-2023 17:27:00.470 INFO [http-nio-41927-exec-629] org.apache.openejb.util.JarExtractor.extract Extracted path: /home/jenkins/jenkins-agent/712657a4/workspace/Tomee/tomee-8.x-build-full-java8/tck/cdi-tomee/target/workdir/207/1d9c41f19331db638ef6408123fcdab3b0cda6
[ERROR] 08-Jun-2023 17:27:00.496 INFO [http-nio-41927-exec-629] org.apache.tomee.catalina.TomcatWebAppBuilder.deployWebApps using default host: localhost
[ERROR] 08-Jun-2023 17:27:00.497 INFO [http-nio-41927-exec-629] org.apache.tomee.catalina.TomcatWebAppBuilder.init ------------------------- localhost -> /1d9c41f19331db638ef6408123fcdab3b0cda6
[ERROR] 08-Jun-2023 17:27:00.498 INFO [http-nio-41927-exec-629] org.apache.openejb.util.OptionsLog.info Using 'openejb.session.manager=org.apache.tomee.catalina.session.QuickSessionManager'
[ERROR] 08-Jun-2023 17:27:00.971 INFO [http-nio-41927-exec-629] org.apache.openejb.config.ConfigurationFactory.configureApplication Configuring enterprise application: /home/jenkins/jenkins-agent/712657a4/workspace/Tomee/tomee-8.x-build-full-java8/tck/cdi-tomee/target/workdir/207/1d9c41f19331db638ef6408123fcdab3b0cda6
[ERROR] 08-Jun-2023 17:27:01.031 INFO [http-nio-41927-exec-629] org.apache.openejb.util.OptionsLog.info Using 'openejb.strict.interface.declaration=true'
[ERROR] 08-Jun-2023 17:27:01.059 INFO [http-nio-41927-exec-629] org.apache.openejb.util.OptionsLog.info Using 'openejb.strict.interface.declaration=true'
[ERROR] 08-Jun-2023 17:27:01.112 INFO [http-nio-41927-exec-629] org.apache.openejb.config.AppInfoBuilder.build Enterprise application "/home/jenkins/jenkins-agent/712657a4/workspace/Tomee/tomee-8.x-build-full-java8/tck/cdi-tomee/target/workdir/207/1d9c41f19331db638ef6408123fcdab3b0cda6" loaded.
[ERROR] 08-Jun-2023 17:27:01.130 INFO [http-nio-41927-exec-629] org.apache.openejb.assembler.classic.Assembler.createApplication Assembling app: /home/jenkins/jenkins-agent/712657a4/workspace/Tomee/tomee-8.x-build-full-java8/tck/cdi-tomee/target/workdir/207/1d9c41f19331db638ef6408123fcdab3b0cda6
[ERROR] 08-Jun-2023 17:27:01.180 INFO [http-nio-41927-exec-629] org.apache.openejb.cdi.CdiBuilder.initSingleton Existing thread singleton service in SystemInstance(): org.apache.openejb.cdi.ThreadSingletonServiceImpl@130161f7
[ERROR] 08-Jun-2023 17:27:01.202 INFO [http-nio-41927-exec-629] org.apache.openejb.cdi.OpenEJBLifecycle.startApplication OpenWebBeans Container is starting...
[ERROR] 08-Jun-2023 17:27:01.625 INFO [http-nio-41927-exec-629] org.apache.openejb.cdi.OpenEJBLifecycle.startApplication OpenWebBeans Container has started, it took 420 ms.
[ERROR] 08-Jun-2023 17:27:01.648 WARNING [http-nio-41927-exec-629] org.apache.batchee.container.services.ServicesManager.init You didn't specify org.apache.batchee.jmx.application and JMX is already registered, skipping
[ERROR] 08-Jun-2023 17:27:01.659 INFO [http-nio-41927-exec-629] org.apache.openejb.assembler.classic.Assembler.createApplication Deployed Application(path=/home/jenkins/jenkins-agent/712657a4/workspace/Tomee/tomee-8.x-build-full-java8/tck/cdi-tomee/target/workdir/207/1d9c41f19331db638ef6408123fcdab3b0cda6)
[ERROR] 08-Jun-2023 17:27:01.938 INFO [http-nio-41927-exec-629] org.apache.jasper.servlet.TldScanner.scanJars At least one JAR was scanned for TLDs yet contained no TLDs. Enable debug logging for this logger for a complete list of JARs that were scanned but no TLDs were found in them. Skipping unneeded JARs during scanning can improve startup time and JSP compilation time.
[ERROR] 08-Jun-2023 17:27:01.954 INFO [http-nio-41927-exec-629] org.apache.tomee.myfaces.TomEEMyFacesContainerInitializer.addListener Installing <listener>org.apache.myfaces.webapp.StartupServletContextListener</listener>
[ERROR] 08-Jun-2023 17:27:02.493 INFO [http-nio-41927-exec-629] org.apache.myfaces.view.facelets.ViewPoolProcessor.initialize org.apache.myfaces.CACHE_EL_EXPRESSIONS web config parameter is set to "noCache". To enable view pooling this param must be set to "alwaysRecompile". View Pooling disabled.
Jun 08, 2023 5:26:40 PM org.apache.openejb.client.EventLogger log
INFO: RemoteInitialContextCreated{providerUri=http://localhost:41927/tomee/ejb}
Jun 08, 2023 5:26:56 PM org.apache.openejb.arquillian.common.TomEEContainer undeploy
INFO: cleaning /home/jenkins/jenkins-agent/712657a4/workspace/Tomee/tomee-8.x-build-full-java8/tck/cdi-tomee/target/workdir/207/429c50e58c9751403f8160c0bb6a479bd593d645.war
Jun 08, 2023 5:26:56 PM org.apache.openejb.arquillian.common.TomEEContainer undeploy
INFO: cleaning /home/jenkins/jenkins-agent/712657a4/workspace/Tomee/tomee-8.x-build-full-java8/tck/cdi-tomee/target/workdir/207/429c50e58c9751403f8160c0bb6a479bd593d645
Jun 08, 2023 5:26:57 PM org.jboss.cdi.tck.shrinkwrap.ArchiveBuilder build
INFO: Test archive built [info: org.jboss.cdi.tck.tests.lookup.dynamic.destroy.dependent.DestroyingDependentInstanceTest, time: 15 ms]
Jun 08, 2023 5:27:00 PM org.apache.openejb.client.EventLogger log
INFO: RemoteInitialContextCreated{providerUri=http://localhost:41927/tomee/ejb}
Jun 08, 2023 5:27:02 PM org.jboss.cdi.tck.impl.testng.ProgressLoggingTestListener beforeInvocation
INFO: Invoke DestroyingDependentInstanceTest.testDestroyingDependentInstances: 1,276/1,569 Failed tests: 0 (515)
Jun 08, 2023 5:27:03 PM org.jboss.cdi.tck.impl.testng.ProgressLoggingTestListener beforeInvocation
INFO: Invoke DestroyingDependentInstanceTest.testDestroyingInterceptedDependentBean: 1,277/1,569 Failed tests: 0 (515)
[ERROR] 08-Jun-2023 17:27:03.511 INFO [http-nio-41927-exec-628] org.apache.openejb.assembler.classic.Assembler.destroyApplication Undeploying app: /home/jenkins/jenkins-agent/712657a4/workspace/Tomee/tomee-8.x-build-full-java8/tck/cdi-tomee/target/workdir/207/1d9c41f19331db638ef6408123fcdab3b0cda6
[ERROR] 08-Jun-2023 17:27:03.513 INFO [http-nio-41927-exec-628] org.apache.catalina.core.StandardWrapper.unload Waiting for [1] instance(s) to be deallocated for Servlet [ArquillianServletRunner]
[ERROR] 08-Jun-2023 17:27:03.615 WARNING [http-nio-41927-exec-628] org.apache.webbeans.web.context.WebContextsService.lazyStartSessionContext Could NOT lazily initialize session context because NO active request context
[ERROR] 08-Jun-2023 17:27:03.615 WARNING [http-nio-41927-exec-628] org.apache.webbeans.web.context.WebContextsService.lazyStartSessionContext Could NOT lazily initialize session context because NO active request context
[ERROR] 08-Jun-2023 17:27:03.615 WARNING [http-nio-41927-exec-628] org.apache.webbeans.web.context.WebContextsService.lazyStartSessionContext Could NOT lazily initialize session context because NO active request context
[ERROR] 08-Jun-2023 17:27:03.615 WARNING [http-nio-41927-exec-628] org.apache.webbeans.web.context.WebContextsService.lazyStartSessionContext Could NOT lazily initialize session context because NO active request context
[ERROR] 08-Jun-2023 17:27:03.615 WARNING [http-nio-41927-exec-628] org.apache.webbeans.web.context.WebContextsService.lazyStartSessionContext Could NOT lazily initialize session context because NO active request context
[ERROR] 08-Jun-2023 17:27:03.615 WARNING [http-nio-41927-exec-628] org.apache.webbeans.web.context.WebContextsService.lazyStartSessionContext Could NOT lazily initialize session context because NO active request context
[ERROR] 08-Jun-2023 17:27:03.615 WARNING [http-nio-41927-exec-628] org.apache.webbeans.web.context.WebContextsService.lazyStartSessionContext Could NOT lazily initialize session context because NO active request context
[ERROR] 08-Jun-2023 17:27:03.615 WARNING [http-nio-41927-exec-628] org.apache.webbeans.web.context.WebContextsService.lazyStartSessionContext Could NOT lazily initialize session context because NO active request context
[ERROR] 08-Jun-2023 17:27:03.615 WARNING [http-nio-41927-exec-628] org.apache.webbeans.web.context.WebContextsService.lazyStartSessionContext Could NOT lazily initialize session context because NO active request context
[ERROR] 08-Jun-2023 17:27:03.615 WARNING [http-nio-41927-exec-628] org.apache.webbeans.web.context.WebContextsService.lazyStartSessionContext Could NOT lazily initialize session context because NO active request context
[ERROR] 08-Jun-2023 17:27:03.615 WARNING [http-nio-41927-exec-628] org.apache.webbeans.web.context.WebContextsService.lazyStartSessionContext Could NOT lazily initialize session context because NO active request context
[ERROR] 08-Jun-2023 17:27:03.616 WARNING [http-nio-41927-exec-628] org.apache.webbeans.web.context.WebContextsService.lazyStartSessionContext Could NOT lazily initialize session context because NO active request context
FATAL: command execution failed
java.io.EOFException
	at java.base/java.io.ObjectInputStream$PeekInputStream.readFully(ObjectInputStream.java:2911)
	at java.base/java.io.ObjectInputStream$BlockDataInputStream.readShort(ObjectInputStream.java:3406)
	at java.base/java.io.ObjectInputStream.readStreamHeader(ObjectInputStream.java:932)
	at java.base/java.io.ObjectInputStream.<init>(ObjectInputStream.java:375)
	at hudson.remoting.ObjectInputStreamEx.<init>(ObjectInputStreamEx.java:49)
	at hudson.remoting.Command.readFrom(Command.java:142)
	at hudson.remoting.Command.readFrom(Command.java:128)
	at hudson.remoting.AbstractSynchronousByteArrayCommandTransport.read(AbstractSynchronousByteArrayCommandTransport.java:35)
	at hudson.remoting.SynchronousCommandTransport$ReaderThread.run(SynchronousCommandTransport.java:61)
Caused: java.io.IOException: Unexpected termination of the channel
	at hudson.remoting.SynchronousCommandTransport$ReaderThread.run(SynchronousCommandTransport.java:75)
Caused: hudson.remoting.ChannelClosedException: Channel "hudson.remoting.Channel@1d79a526:jenkins-shared-ubuntu-1": Remote call on jenkins-shared-ubuntu-1 failed. The channel is closing down or has closed down
	at hudson.remoting.Channel.call(Channel.java:993)
	at hudson.remoting.RemoteInvocationHandler.invoke(RemoteInvocationHandler.java:285)
	at com.sun.proxy.$Proxy136.isAlive(Unknown Source)
	at hudson.Launcher$RemoteLauncher$ProcImpl.isAlive(Launcher.java:1215)
	at hudson.Launcher$RemoteLauncher$ProcImpl.join(Launcher.java:1207)
	at hudson.Launcher$ProcStarter.join(Launcher.java:524)
	at hudson.tasks.Maven.perform(Maven.java:369)
	at hudson.tasks.BuildStepMonitor$1.perform(BuildStepMonitor.java:20)
	at hudson.model.AbstractBuild$AbstractBuildExecution.perform(AbstractBuild.java:818)
	at hudson.model.Build$BuildExecution.build(Build.java:199)
	at hudson.model.Build$BuildExecution.doRun(Build.java:164)
	at hudson.model.AbstractBuild$AbstractBuildExecution.run(AbstractBuild.java:526)
	at hudson.model.Run.execute(Run.java:1900)
	at hudson.model.FreeStyleBuild.run(FreeStyleBuild.java:44)
	at hudson.model.ResourceController.execute(ResourceController.java:101)
	at hudson.model.Executor.run(Executor.java:442)
Build step 'Invoke top-level Maven targets' marked build as failure
ERROR: Step ‘Publish xUnit test result report’ failed: no workspace for Tomee/tomee-8.x-build-full-java8 #87
ERROR: jenkins-shared-ubuntu-1 is offline; cannot locate jdk_1.8_latest

Jenkins build is back to normal : TomEE » tomee-8.x-build-full-java8 #91

Posted by Apache Jenkins Server <je...@builds.apache.org>.
See <https://ci-builds.apache.org/job/Tomee/job/tomee-8.x-build-full-java8/91/display/redirect?page=changes>


Build failed in Jenkins: TomEE » tomee-8.x-build-full-java8 #90

Posted by Apache Jenkins Server <je...@builds.apache.org>.
See <https://ci-builds.apache.org/job/Tomee/job/tomee-8.x-build-full-java8/90/display/redirect>

Changes:


------------------------------------------
[...truncated 18.46 MB...]
[INFO] TomEE :: Web Examples :: Java Modules (Simple REST resource) 8.0.16-SNAPSHOT SKIPPED
[INFO] TomEE :: Examples :: JAXRS Filter 8.0.16-SNAPSHOT .. SUCCESS [  0.442 s]
[INFO] TomEE :: Examples :: JAXRS JSON Provider with Jettison 8.0.16-SNAPSHOT SKIPPED
[INFO] TomEE :: Examples :: JPA with EclipseLink 8.0.16-SNAPSHOT SUCCESS [  4.240 s]
[INFO] TomEE :: Utils :: Core Hibernate 8.0.16-SNAPSHOT ... SUCCESS [  0.585 s]
[INFO] TomEE :: Examples :: JPA with Hibernate 8.0.16-SNAPSHOT SUCCESS [  4.890 s]
[INFO] TomEE :: Examples :: JPA with Hibernate and arquillian 8.0.16-SNAPSHOT SKIPPED
[INFO] TomEE :: Examples :: JPA @Enumerated 8.0.16-SNAPSHOT SUCCESS [  4.609 s]
[INFO] TomEE :: Web Examples :: JSF - ManangedBean and EJB 8.0.16-SNAPSHOT SKIPPED
[INFO] TomEE :: Web Examples :: JSF - CDI and EJB 8.0.16-SNAPSHOT SUCCESS [  0.284 s]
[INFO] TomEE :: Examples :: JUnit 5 :: Application Composer 8.0.16-SNAPSHOT SUCCESS [  5.014 s]
[INFO] TomEE :: Examples :: JUnit 5 :: Multiple TomEE with Arquillian 8.0.16-SNAPSHOT SKIPPED
[INFO] TomEE :: Examples :: JUnit 5 :: Simple Websockets with Arquillian 8.0.16-SNAPSHOT SKIPPED
[INFO] TomEE :: Examples :: @EJB Lookup 8.0.16-SNAPSHOT ... SUCCESS [  2.219 s]
[INFO] TomEE :: Examples :: EJB Lookup with descriptor 8.0.16-SNAPSHOT SUCCESS [  2.306 s]
[INFO] TomEE :: Examples :: Movies Complete (Meta) 8.0.16-SNAPSHOT SUCCESS [  4.801 s]
[INFO] TomEE :: Examples :: Movies Complete 8.0.16-SNAPSHOT SUCCESS [  4.728 s]
[INFO] MicroProfile :: Examples :: Config 8.0.16-SNAPSHOT . SKIPPED
[INFO] MicroProfile :: Examples :: Config Source Database 8.0.16-SNAPSHOT SKIPPED
[INFO] TomEE :: Examples :: Microprofile Fault Tolerance :: Fallback 8.0.16-SNAPSHOT SKIPPED
[INFO] TomEE :: Examples :: Microprofile Fault Tolerance :: Retry 8.0.16-SNAPSHOT SKIPPED
[INFO] TomEE :: Examples :: Microprofile JSONB Configuration 8.0.16-SNAPSHOT SKIPPED
[INFO] Apache TomEE + MicroProfile JWT Bean Validation 8.0.16-SNAPSHOT SKIPPED
[INFO] Apache TomEE + MicroProfile JWT Bean Validation, Strongly-typed Annotations 8.0.16-SNAPSHOT SKIPPED
[INFO] TomEE :: Examples :: Microprofile Metrics Counted 8.0.16-SNAPSHOT SKIPPED
[INFO] TomEE :: Examples :: Microprofile Metrics Histogram 8.0.16-SNAPSHOT SKIPPED
[INFO] TomEE :: Examples :: Microprofile Metrics Timed 8.0.16-SNAPSHOT SKIPPED
[INFO] mp-metrics-gauge 8.0.16-SNAPSHOT ................... SKIPPED
[INFO] mp-metrics-metered 8.0.16-SNAPSHOT ................. SKIPPED
[INFO] mp-opentracing.traced 8.0.16-SNAPSHOT .............. SKIPPED
[INFO] TomEE :: Examples :: MP REST JWT 8.0.16-SNAPSHOT ... SKIPPED
[INFO] TomEE :: Examples :: MP REST JWT JWK 8.0.16-SNAPSHOT SKIPPED
[INFO] TomEE :: Examples :: MP REST JWT PRINCIPAL 8.0.16-SNAPSHOT SKIPPED
[INFO] TomEE :: Examples :: MP REST JWT Public Key 8.0.16-SNAPSHOT SKIPPED
[INFO] TomEE :: Utils :: Mockito 8.0.16-SNAPSHOT .......... SUCCESS [  6.747 s]
[INFO] TomEE :: Examples :: MTOM 8.0.16-SNAPSHOT .......... SKIPPED
[INFO] TomEE :: Examples :: Multiple JPA providers 8.0.16-SNAPSHOT SUCCESS [ 10.995 s]
[INFO] TomEE :: Examples :: Multiple Arquillian Adapters 8.0.16-SNAPSHOT SKIPPED
[INFO] TomEE :: Examples :: Multiple TomEE with Arquillian 8.0.16-SNAPSHOT SKIPPED
[INFO] TomEE :: Examples :: JSF2/CDI/BV/JPA/CODI 8.0.16-SNAPSHOT SKIPPED
[INFO] TomEE :: Examples :: Persistence Fragment 8.0.16-SNAPSHOT SUCCESS [  2.941 s]
[INFO] TomEE :: Web Examples :: Pojo WS 8.0.16-SNAPSHOT ... SKIPPED
[INFO] TomEE :: Examples :: Polling 8.0.16-SNAPSHOT ....... SUCCESS [  0.048 s]
[INFO] TomEE :: Examples :: Polling :: Domain 8.0.16-SNAPSHOT SUCCESS [  0.912 s]
[INFO] TomEE :: Examples :: Polling :: Core 8.0.16-SNAPSHOT SKIPPED
[INFO] TomEE :: Examples :: Polling :: Web 8.0.16-SNAPSHOT  SKIPPED
[INFO] TomEE :: Examples :: Polling :: Client 8.0.16-SNAPSHOT SKIPPED
[INFO] TomEE :: Examples :: DeltaSpike ProjectStage 8.0.16-SNAPSHOT SKIPPED
[INFO] TomEE :: Examples :: Quartz 8.0.16-SNAPSHOT ........ SUCCESS [  0.005 s]
[INFO] TomEE :: Examples :: Quartz :: Quartz Resource Adapter 8.0.16-SNAPSHOT SKIPPED
[INFO] TomEE :: Examples :: Quartz :: Quartz Beans 8.0.16-SNAPSHOT SKIPPED
[INFO] TomEE :: Examples :: DataSource Realm 8.0.16-SNAPSHOT SKIPPED
[INFO] TomEE :: Examples :: Reloadable Persistence Unit Properties 8.0.16-SNAPSHOT SUCCESS [  4.917 s]
[INFO] TomEE :: Web Examples :: Resource Declared In A Webapp 8.0.16-SNAPSHOT SUCCESS [  0.621 s]
[INFO] TomEE :: Examples :: REST, Mockito and Application Composer 8.0.16-SNAPSHOT SUCCESS [  3.859 s]
[INFO] TomEE :: Examples :: REST and Application Composer 8.0.16-SNAPSHOT SUCCESS [  3.120 s]
[INFO] TomEE :: Examples :: REST CDI 8.0.16-SNAPSHOT ...... SUCCESS [  4.713 s]
[INFO] TomEE :: Examples :: JAXRS and JAAS 8.0.16-SNAPSHOT  SKIPPED
[INFO] TomEE :: Examples :: REST and EJB 8.0.16-SNAPSHOT .. SUCCESS [  6.655 s]
[INFO] TomEE :: Web Examples :: REST Example 8.0.16-SNAPSHOT SKIPPED
[INFO] TomEE :: Web Examples :: REST Example With Application 8.0.16-SNAPSHOT SUCCESS [  0.490 s]
[INFO] TomEE :: Web Examples :: REST SSE Example 8.0.16-SNAPSHOT SKIPPED
[INFO] TomEE :: Examples :: REST XML JSON 8.0.16-SNAPSHOT . SUCCESS [  4.249 s]
[INFO] TomEE :: Examples :: Basic Scala 8.0.16-SNAPSHOT ... SUCCESS [ 10.401 s]
[INFO] TomEE :: Examples :: ScheduleExpression 8.0.16-SNAPSHOT SUCCESS [  7.315 s]
[INFO] TomEE :: Examples :: @Schedule Events 8.0.16-SNAPSHOT SUCCESS [ 15.143 s]
[INFO] TomEE :: Examples :: @Schedule Methods (Meta) 8.0.16-SNAPSHOT SUCCESS [  7.304 s]
[INFO] TomEE :: Examples :: @Schedule Methods 8.0.16-SNAPSHOT SUCCESS [  7.209 s]
[INFO] TomEE :: Examples :: Server Events 8.0.16-SNAPSHOT . SUCCESS [  3.043 s]
[INFO] TomEE :: Examples :: Serverless Apache TomEE WebProfile 8.0.16-SNAPSHOT SKIPPED
[INFO] TomEE :: Examples :: Serverless Apache TomEE WebProfile 8.0.16-SNAPSHOT SKIPPED
[INFO] TomEE :: Examples :: Serverless Apache TomEE MicroProfile 8.0.16-SNAPSHOT SKIPPED
[INFO] TomEE :: Examples :: Serverless Apache TomEE Plume 8.0.16-SNAPSHOT SKIPPED
[INFO] TomEE :: Examples :: Serverless Apache TomEE Plus 8.0.16-SNAPSHOT SKIPPED
[INFO] TomEE :: Examples ::  Singleton startup ordering 8.0.16-SNAPSHOT SKIPPED
[INFO] TomEE :: Examples :: Simple CDI Interceptor 8.0.16-SNAPSHOT SUCCESS [  2.455 s]
[INFO] TomEE :: Examples :: Simple EAR 8.0.16-SNAPSHOT .... SUCCESS [  0.004 s]
[INFO] TomEE :: Examples :: Simple EAR :: Business Model 8.0.16-SNAPSHOT SUCCESS [  0.052 s]
[INFO] TomEE :: Examples :: Simple EAR :: Business Logic 8.0.16-SNAPSHOT SUCCESS [  4.366 s]
[INFO] TomEE :: Examples :: Simple EAR :: Webapp 8.0.16-SNAPSHOT SUCCESS [  0.108 s]
[INFO] TomEE :: Examples :: Simple EAR :: EAR Packaging 8.0.16-SNAPSHOT SUCCESS [  0.046 s]
[INFO] TomEE :: Examples :: Simple EAR :: Functional Tests 8.0.16-SNAPSHOT SKIPPED
[INFO] TomEE :: Examples :: Simple CMP2 Entity 8.0.16-SNAPSHOT SUCCESS [  4.698 s]
[INFO] TomEE :: Examples :: Simple JMS 8.0.16-SNAPSHOT .... SKIPPED
[INFO] TomEE :: Examples :: Simple JMS Context 8.0.16-SNAPSHOT SKIPPED
[INFO] TomEE :: Examples :: Simple MDB With a CDI Injection 8.0.16-SNAPSHOT SKIPPED
[INFO] TomEE :: Examples :: Simple MDB Example 8.0.16-SNAPSHOT SKIPPED
[INFO] TomEE :: Examples :: Simple MDB Using Deployment Descriptor Example 8.0.16-SNAPSHOT SKIPPED
[INFO] TomEE :: Examples :: Simple Remote tomcat-users.xml 8.0.16-SNAPSHOT SKIPPED
[INFO] TomEE :: Examples :: Simple REST 8.0.16-SNAPSHOT ... SUCCESS [  3.313 s]
[INFO] TomEE :: Examples :: Simple Singleton 8.0.16-SNAPSHOT SUCCESS [  2.325 s]
[INFO] TomEE :: Examples :: Simple Stateful Pojo 8.0.16-SNAPSHOT SUCCESS [  2.175 s]
[INFO] TomEE :: Examples :: Simple Stateful Pojo Callbacks 8.0.16-SNAPSHOT SUCCESS [  6.300 s]
[INFO] TomEE :: Examples :: Simple Stateless Pojo 8.0.16-SNAPSHOT SUCCESS [  2.182 s]
[INFO] TomEE :: Examples :: Simple Stateless Pojo Callbacks 8.0.16-SNAPSHOT SUCCESS [  2.226 s]
[INFO] TomEE :: Examples :: Simple Stateless With Deployment Descriptor 8.0.16-SNAPSHOT SUCCESS [  1.817 s]
[INFO] TomEE :: Examples :: Simple Webservice 8.0.16-SNAPSHOT SKIPPED
[INFO] TomEE :: Examples :: Simple Webservice Without Interface 8.0.16-SNAPSHOT SKIPPED
[INFO] OpenEJB :: Examples :: Async Servlet 8.0.16-SNAPSHOT SKIPPED
[INFO] TomEE :: Examples :: Spring Data 8.0.16-SNAPSHOT ... SUCCESS [  5.257 s]
[INFO] TomEE :: Examples :: Spring Data Meta 8.0.16-SNAPSHOT SUCCESS [  5.212 s]
[INFO] TomEE :: Web Examples :: Struts 8.0.16-SNAPSHOT .... SUCCESS [  0.231 s]
[INFO] TomEE :: Examples :: Telephone Stateful Pojo 8.0.16-SNAPSHOT SUCCESS [  3.308 s]
[INFO] TomEE :: Examples :: TestCase Injection 8.0.16-SNAPSHOT SUCCESS [  4.706 s]
[INFO] TomEE :: Examples :: Testing Security (Meta) 8.0.16-SNAPSHOT SUCCESS [  4.849 s]
[INFO] TomEE :: Examples :: Testing Security 8.0.16-SNAPSHOT SUCCESS [  5.695 s]
[INFO] TomEE :: Examples :: Testing Security 8.0.16-SNAPSHOT SUCCESS [  5.623 s]
[INFO] TomEE :: Examples :: Testing Security Service Provider 8.0.16-SNAPSHOT SUCCESS [  5.868 s]
[INFO] TomEE :: Examples :: Testing Security Script Service Provider 8.0.16-SNAPSHOT SUCCESS [  6.711 s]
[INFO] TomEE :: Examples :: Testing Transactions 8.0.16-SNAPSHOT SUCCESS [  4.749 s]
[INFO] TomEE :: Examples :: Testing Transactions BMT 8.0.16-SNAPSHOT SUCCESS [  4.645 s]
[INFO] TomEE :: Examples :: TomEE, Jersey, Eclipselink 8.0.16-SNAPSHOT SKIPPED
[INFO] TomEE :: TomEE :: IBM MQ AMQ Portability Examples :: MDB Example 1.0 SUCCESS [  0.193 s]
[INFO] TomEE :: Examples :: Transaction Rollback 8.0.16-SNAPSHOT SUCCESS [  6.360 s]
[INFO] TomEE :: Examples :: Troubleshooting 8.0.16-SNAPSHOT SUCCESS [  4.744 s]
[INFO] TomEE :: Examples :: Webservice Attachments 8.0.16-SNAPSHOT SUCCESS [  4.870 s]
[INFO] TomEE :: Examples :: Webservice Inheritance 8.0.16-SNAPSHOT SKIPPED
[INFO] TomEE :: Web Examples :: EJB WebService with Security 8.0.16-SNAPSHOT SKIPPED
[INFO] TomEE :: Web Examples :: EJB WebService with SSL Client Certificate 8.0.16-SNAPSHOT SKIPPED
[INFO] TomEE :: Web Examples :: EJB WebService with WS-Security 8.0.16-SNAPSHOT SKIPPED
[INFO] TomEE :: Web Examples :: EJB WebService WS Security with resources.xml 8.0.16-SNAPSHOT SKIPPED
[INFO] TomEE :: Examples :: Web Service Handlers 8.0.16-SNAPSHOT SKIPPED
[INFO] TomEE :: Examples :: @WebService Holder 8.0.16-SNAPSHOT SKIPPED
[INFO] TomEE :: Web Examples :: Moviefun 8.0.16-SNAPSHOT .. SKIPPED
[INFO] TomEE :: Web Examples :: Moviefun Rest 8.0.16-SNAPSHOT SKIPPED
[INFO] TomEE :: Utils :: Provisionning 8.0.16-SNAPSHOT .... SUCCESS [  2.997 s]
[INFO] TomEE :: Examples :: Resources/JMX Example 8.0.16-SNAPSHOT SUCCESS [  0.051 s]
[INFO] TomEE :: Examples :: Resources/JMX Example :: EJB Module 8.0.16-SNAPSHOT SKIPPED
[INFO] TomEE :: Examples :: Resources/JMX Example :: EAR Module 8.0.16-SNAPSHOT SKIPPED
[INFO] TomEE :: Examples :: WebSocket with tls and basic auth Example 8.0.16-SNAPSHOT SKIPPED
[INFO] TomEE :: Examples :: Concurrency utilities example 8.0.16-SNAPSHOT SKIPPED
[INFO] TomEE :: Examples :: MVC (CXF-based) 8.0.16-SNAPSHOT SKIPPED
[INFO] TomEE :: Examples :: MVC (CXF-based) with Hibernate 8.0.16-SNAPSHOT SKIPPED
[INFO] TomEE :: Examples :: Microprofile REST Client 8.0.16-SNAPSHOT SKIPPED
[INFO] TomEE :: Examples :: MVC (RestEasy-based) 8.0.16-SNAPSHOT SKIPPED
[INFO] TomEE :: Examples :: Custom HealthCheck 8.0.16-SNAPSHOT SKIPPED
[INFO] TomEE :: Examples :: Microprofile JSONB Configuration 8.0.16-SNAPSHOT SKIPPED
[INFO] TomEE :: Examples :: Microprofile JSONB Custom Serializer/Deserializer 8.0.16-SNAPSHOT SKIPPED
[INFO] TomEE :: Examples :: Vaadin LTS V08 8.0.16-SNAPSHOT  SKIPPED
[INFO] TomEE :: Examples :: Vaadin LTS V10 8.0.16-SNAPSHOT  SKIPPED
[INFO] TomEE :: Examples :: Vaadin LATEST 8.0.16-SNAPSHOT . SKIPPED
[INFO] TomEE :: Examples :: Azure deployment example 8.0.16-SNAPSHOT SKIPPED
[INFO] TomEE :: Examples :: Microprofile Fault Tolerance :: Timeout 8.0.16-SNAPSHOT SKIPPED
[INFO] TomEE :: Examples :: XA Datasource configuration and usage 8.0.16-SNAPSHOT SKIPPED
[INFO] TomEE :: Examples :: Websocket JMS 8.0.16-SNAPSHOT . SKIPPED
[INFO] TomEE :: Examples :: Properties Provider 8.0.16-SNAPSHOT SUCCESS [  0.005 s]
[INFO] TomEE :: Examples :: Properties Provider :: Implementation 8.0.16-SNAPSHOT SUCCESS [  0.101 s]
[INFO] TomEE :: Examples :: Properties Provider :: Sample Webapp 8.0.16-SNAPSHOT SKIPPED
[INFO] TomEE :: Examples :: Jakarta Security tomcat-user.xml Identity Store 8.0.16-SNAPSHOT SKIPPED
[INFO] TomEE :: Examples :: Jakarta Security custom Identity Store 8.0.16-SNAPSHOT SKIPPED
[INFO] TomEE :: Examples 8.0.16-SNAPSHOT .................. SUCCESS [  0.603 s]
[INFO] TomEE :: Assembly :: All In One EJB Lite jar 8.0.16-SNAPSHOT SUCCESS [ 25.362 s]
[INFO] TomEE :: Utils :: TomEE Webapps-based Deployer EJB 8.0.16-SNAPSHOT SUCCESS [  0.776 s]
[INFO] TomEE :: TCK 8.0.16-SNAPSHOT ....................... SUCCESS [  0.018 s]
[INFO] TomEE :: TCK :: Common 8.0.16-SNAPSHOT ............. SUCCESS [  1.037 s]
[INFO] TomEE :: TCK :: CDI Embedded 8.0.16-SNAPSHOT ....... SUCCESS [04:25 min]
[INFO] TomEE :: TCK :: CDI TomEE 8.0.16-SNAPSHOT .......... SKIPPED
[INFO] TomEE :: TCK :: CDI TCK Signature Tests 8.0.16-SNAPSHOT SUCCESS [  1.936 s]
[INFO] TomEE :: TCK :: Bean Validation Embedded 8.0.16-SNAPSHOT SUCCESS [01:09 min]
[INFO] TomEE :: TCK :: Bean Validation TomEE 8.0.16-SNAPSHOT SKIPPED
[INFO] TomEE :: TCK :: Bean Validation TCK Signature tests 8.0.16-SNAPSHOT SUCCESS [  1.765 s]
[INFO] TomEE :: TCK :: MicroProfile 8.0.16-SNAPSHOT ....... SUCCESS [  0.025 s]
[INFO] TomEE :: TCK :: MicroProfile Config TCK 8.0.16-SNAPSHOT SKIPPED
[INFO] TomEE :: TCK :: MicroProfile JWT TCK 8.0.16-SNAPSHOT SKIPPED
[INFO] TomEE :: TCK :: MicroProfile Fault Tolerance TCK 8.0.16-SNAPSHOT SKIPPED
[INFO] TomEE :: TCK :: MicroProfile Health TCK 8.0.16-SNAPSHOT SKIPPED
[INFO] TomEE :: TCK :: MicroProfile Metrics TCK 8.0.16-SNAPSHOT SKIPPED
[INFO] TomEE :: TCK :: MicroProfile Rest Client TCK 8.0.16-SNAPSHOT SKIPPED
[INFO] TomEE :: TCK :: MicroProfile Open API TCK 8.0.16-SNAPSHOT SKIPPED
[INFO] TomEE :: TCK :: MicroProfile Open Tracing TCK 8.0.16-SNAPSHOT SKIPPED
[INFO] TomEE :: Arquillian Adaptors Parent :: Webapp Remote 8.0.16-SNAPSHOT SUCCESS [ 56.128 s]
[INFO] TomEE :: Arquillian Adaptors Parent :: Tests 8.0.16-SNAPSHOT SKIPPED
[INFO] TomEE :: Arquillian Adaptors Parent :: Tests :: Web Profile 8.0.16-SNAPSHOT SKIPPED
[INFO] TomEE :: Arquillian Adaptors Parent :: Tests :: JAXRS 8.0.16-SNAPSHOT SKIPPED
[INFO] TomEE :: Arquillian Adaptors Parent :: Tests :: JAXWS 8.0.16-SNAPSHOT SKIPPED
[INFO] TomEE :: Arquillian Adaptors Parent :: Tests :: JMS 8.0.16-SNAPSHOT SKIPPED
[INFO] TomEE :: Arquillian Adaptors Parent :: Tests :: CODI 8.0.16-SNAPSHOT SKIPPED
[INFO] TomEE :: Arquillian Adaptors Parent :: Tests :: Configuration Tests 8.0.16-SNAPSHOT SKIPPED
[INFO] TomEE :: Arquillian Adaptors Parent :: Sample :: Moviefun 8.0.16-SNAPSHOT SUCCESS [ 34.964 s]
[INFO] TomEE :: Arquillian Adaptors Parent :: Arquillian TCK 8.0.16-SNAPSHOT SKIPPED
[INFO] TomEE :: Utils :: Log4j2 8.0.16-SNAPSHOT ........... SUCCESS [  0.926 s]
[INFO] TomEE :: TomEE :: webaccess 8.0.16-SNAPSHOT ........ SKIPPED
[INFO] TomEE :: TomEE :: Overlay Runner 8.0.16-SNAPSHOT ... SUCCESS [  0.643 s]
[INFO] ------------------------------------------------------------------------
[INFO] BUILD FAILURE
[INFO] ------------------------------------------------------------------------
[INFO] Total time:  01:05 h
[INFO] Finished at: 2023-06-10T15:43:15Z
[INFO] ------------------------------------------------------------------------
[ERROR] Failed to execute goal org.apache.maven.plugins:maven-surefire-plugin:3.0.0-M5:test (default-test) on project tomee-security: There are test failures.
[ERROR] 
[ERROR] Please refer to <https://ci-builds.apache.org/job/Tomee/job/tomee-8.x-build-full-java8/ws/tomee/tomee-security/target/surefire-reports> for the individual test results.
[ERROR] Please refer to dump files (if any exist) [date].dump, [date]-jvmRun[N].dump and [date].dumpstream.
[ERROR] -> [Help 1]
[ERROR] 
[ERROR] To see the full stack trace of the errors, re-run Maven with the -e switch.
[ERROR] Re-run Maven using the -X switch to enable full debug logging.
[ERROR] 
[ERROR] For more information about the errors and possible solutions, please read the following articles:
[ERROR] [Help 1] http://cwiki.apache.org/confluence/display/MAVEN/MojoFailureException
[ERROR] 
[ERROR] After correcting the problems, you can resume the build with the command
[ERROR]   mvn <args> -rf :tomee-security
Build step 'Invoke top-level Maven targets' marked build as failure
INFO: Processing JUnit
INFO: [JUnit] - 880 test report file(s) were found with the pattern '**/target/surefire-reports/TEST-*.xml' relative to '<https://ci-builds.apache.org/job/Tomee/job/tomee-8.x-build-full-java8/ws/'> for the testing framework 'JUnit'.
WARNING: The file '<https://ci-builds.apache.org/job/Tomee/job/tomee-8.x-build-full-java8/ws/examples/scala-basic/target/surefire-reports/TEST-org.scalatest.tools.DiscoverySuite-c346c3e8-2f2e-4acd-9288-cd1ec0f2ba2e.xml'> is an invalid file.
WARNING: At line 8 of <https://ci-builds.apache.org/job/Tomee/job/tomee-8.x-build-full-java8/ws/examples/scala-basic/target/surefire-reports/TEST-org.scalatest.tools.DiscoverySuite-c346c3e8-2f2e-4acd-9288-cd1ec0f2ba2e.xml>:cvc-complex-type.2.1: Element 'property' must have no character or element information item [children], because the type's content type is empty.
WARNING: At line 13 of <https://ci-builds.apache.org/job/Tomee/job/tomee-8.x-build-full-java8/ws/examples/scala-basic/target/surefire-reports/TEST-org.scalatest.tools.DiscoverySuite-c346c3e8-2f2e-4acd-9288-cd1ec0f2ba2e.xml>:cvc-complex-type.2.1: Element 'property' must have no character or element information item [children], because the type's content type is empty.
WARNING: At line 24 of <https://ci-builds.apache.org/job/Tomee/job/tomee-8.x-build-full-java8/ws/examples/scala-basic/target/surefire-reports/TEST-org.scalatest.tools.DiscoverySuite-c346c3e8-2f2e-4acd-9288-cd1ec0f2ba2e.xml>:cvc-complex-type.2.1: Element 'property' must have no character or element information item [children], because the type's content type is empty.
WARNING: At line 27 of <https://ci-builds.apache.org/job/Tomee/job/tomee-8.x-build-full-java8/ws/examples/scala-basic/target/surefire-reports/TEST-org.scalatest.tools.DiscoverySuite-c346c3e8-2f2e-4acd-9288-cd1ec0f2ba2e.xml>:cvc-complex-type.2.1: Element 'property' must have no character or element information item [children], because the type's content type is empty.
WARNING: At line 31 of <https://ci-builds.apache.org/job/Tomee/job/tomee-8.x-build-full-java8/ws/examples/scala-basic/target/surefire-reports/TEST-org.scalatest.tools.DiscoverySuite-c346c3e8-2f2e-4acd-9288-cd1ec0f2ba2e.xml>:cvc-complex-type.2.1: Element 'property' must have no character or element information item [children], because the type's content type is empty.
WARNING: At line 34 of <https://ci-builds.apache.org/job/Tomee/job/tomee-8.x-build-full-java8/ws/examples/scala-basic/target/surefire-reports/TEST-org.scalatest.tools.DiscoverySuite-c346c3e8-2f2e-4acd-9288-cd1ec0f2ba2e.xml>:cvc-complex-type.2.1: Element 'property' must have no character or element information item [children], because the type's content type is empty.
WARNING: At line 42 of <https://ci-builds.apache.org/job/Tomee/job/tomee-8.x-build-full-java8/ws/examples/scala-basic/target/surefire-reports/TEST-org.scalatest.tools.DiscoverySuite-c346c3e8-2f2e-4acd-9288-cd1ec0f2ba2e.xml>:cvc-complex-type.2.1: Element 'property' must have no character or element information item [children], because the type's content type is empty.
WARNING: At line 46 of <https://ci-builds.apache.org/job/Tomee/job/tomee-8.x-build-full-java8/ws/examples/scala-basic/target/surefire-reports/TEST-org.scalatest.tools.DiscoverySuite-c346c3e8-2f2e-4acd-9288-cd1ec0f2ba2e.xml>:cvc-complex-type.2.1: Element 'property' must have no character or element information item [children], because the type's content type is empty.
WARNING: At line 49 of <https://ci-builds.apache.org/job/Tomee/job/tomee-8.x-build-full-java8/ws/examples/scala-basic/target/surefire-reports/TEST-org.scalatest.tools.DiscoverySuite-c346c3e8-2f2e-4acd-9288-cd1ec0f2ba2e.xml>:cvc-complex-type.2.1: Element 'property' must have no character or element information item [children], because the type's content type is empty.
WARNING: At line 52 of <https://ci-builds.apache.org/job/Tomee/job/tomee-8.x-build-full-java8/ws/examples/scala-basic/target/surefire-reports/TEST-org.scalatest.tools.DiscoverySuite-c346c3e8-2f2e-4acd-9288-cd1ec0f2ba2e.xml>:cvc-complex-type.2.1: Element 'property' must have no character or element information item [children], because the type's content type is empty.
WARNING: At line 56 of <https://ci-builds.apache.org/job/Tomee/job/tomee-8.x-build-full-java8/ws/examples/scala-basic/target/surefire-reports/TEST-org.scalatest.tools.DiscoverySuite-c346c3e8-2f2e-4acd-9288-cd1ec0f2ba2e.xml>:cvc-complex-type.2.1: Element 'property' must have no character or element information item [children], because the type's content type is empty.
WARNING: At line 60 of <https://ci-builds.apache.org/job/Tomee/job/tomee-8.x-build-full-java8/ws/examples/scala-basic/target/surefire-reports/TEST-org.scalatest.tools.DiscoverySuite-c346c3e8-2f2e-4acd-9288-cd1ec0f2ba2e.xml>:cvc-complex-type.2.1: Element 'property' must have no character or element information item [children], because the type's content type is empty.
WARNING: At line 69 of <https://ci-builds.apache.org/job/Tomee/job/tomee-8.x-build-full-java8/ws/examples/scala-basic/target/surefire-reports/TEST-org.scalatest.tools.DiscoverySuite-c346c3e8-2f2e-4acd-9288-cd1ec0f2ba2e.xml>:cvc-complex-type.2.1: Element 'property' must have no character or element information item [children], because the type's content type is empty.
WARNING: At line 74 of <https://ci-builds.apache.org/job/Tomee/job/tomee-8.x-build-full-java8/ws/examples/scala-basic/target/surefire-reports/TEST-org.scalatest.tools.DiscoverySuite-c346c3e8-2f2e-4acd-9288-cd1ec0f2ba2e.xml>:cvc-complex-type.2.1: Element 'property' must have no character or element information item [children], because the type's content type is empty.
WARNING: At line 77 of <https://ci-builds.apache.org/job/Tomee/job/tomee-8.x-build-full-java8/ws/examples/scala-basic/target/surefire-reports/TEST-org.scalatest.tools.DiscoverySuite-c346c3e8-2f2e-4acd-9288-cd1ec0f2ba2e.xml>:cvc-complex-type.2.1: Element 'property' must have no character or element information item [children], because the type's content type is empty.
WARNING: At line 85 of <https://ci-builds.apache.org/job/Tomee/job/tomee-8.x-build-full-java8/ws/examples/scala-basic/target/surefire-reports/TEST-org.scalatest.tools.DiscoverySuite-c346c3e8-2f2e-4acd-9288-cd1ec0f2ba2e.xml>:cvc-complex-type.2.1: Element 'property' must have no character or element information item [children], because the type's content type is empty.
WARNING: At line 89 of <https://ci-builds.apache.org/job/Tomee/job/tomee-8.x-build-full-java8/ws/examples/scala-basic/target/surefire-reports/TEST-org.scalatest.tools.DiscoverySuite-c346c3e8-2f2e-4acd-9288-cd1ec0f2ba2e.xml>:cvc-complex-type.2.1: Element 'property' must have no character or element information item [children], because the type's content type is empty.
WARNING: At line 94 of <https://ci-builds.apache.org/job/Tomee/job/tomee-8.x-build-full-java8/ws/examples/scala-basic/target/surefire-reports/TEST-org.scalatest.tools.DiscoverySuite-c346c3e8-2f2e-4acd-9288-cd1ec0f2ba2e.xml>:cvc-complex-type.2.1: Element 'property' must have no character or element information item [children], because the type's content type is empty.
WARNING: At line 98 of <https://ci-builds.apache.org/job/Tomee/job/tomee-8.x-build-full-java8/ws/examples/scala-basic/target/surefire-reports/TEST-org.scalatest.tools.DiscoverySuite-c346c3e8-2f2e-4acd-9288-cd1ec0f2ba2e.xml>:cvc-complex-type.2.1: Element 'property' must have no character or element information item [children], because the type's content type is empty.
WARNING: The result file '<https://ci-builds.apache.org/job/Tomee/job/tomee-8.x-build-full-java8/ws/examples/scala-basic/target/surefire-reports/TEST-org.scalatest.tools.DiscoverySuite-c346c3e8-2f2e-4acd-9288-cd1ec0f2ba2e.xml'> for the metric 'JUnit' is not valid. The result file has been skipped.
WARNING: The file '<https://ci-builds.apache.org/job/Tomee/job/tomee-8.x-build-full-java8/ws/examples/scala-basic/target/surefire-reports/TEST-org.superbiz.GreetingServiceTest.xml'> is an invalid file.
WARNING: At line 8 of <https://ci-builds.apache.org/job/Tomee/job/tomee-8.x-build-full-java8/ws/examples/scala-basic/target/surefire-reports/TEST-org.superbiz.GreetingServiceTest.xml>:cvc-complex-type.2.1: Element 'property' must have no character or element information item [children], because the type's content type is empty.
WARNING: At line 13 of <https://ci-builds.apache.org/job/Tomee/job/tomee-8.x-build-full-java8/ws/examples/scala-basic/target/surefire-reports/TEST-org.superbiz.GreetingServiceTest.xml>:cvc-complex-type.2.1: Element 'property' must have no character or element information item [children], because the type's content type is empty.
WARNING: At line 24 of <https://ci-builds.apache.org/job/Tomee/job/tomee-8.x-build-full-java8/ws/examples/scala-basic/target/surefire-reports/TEST-org.superbiz.GreetingServiceTest.xml>:cvc-complex-type.2.1: Element 'property' must have no character or element information item [children], because the type's content type is empty.
WARNING: At line 27 of <https://ci-builds.apache.org/job/Tomee/job/tomee-8.x-build-full-java8/ws/examples/scala-basic/target/surefire-reports/TEST-org.superbiz.GreetingServiceTest.xml>:cvc-complex-type.2.1: Element 'property' must have no character or element information item [children], because the type's content type is empty.
WARNING: At line 31 of <https://ci-builds.apache.org/job/Tomee/job/tomee-8.x-build-full-java8/ws/examples/scala-basic/target/surefire-reports/TEST-org.superbiz.GreetingServiceTest.xml>:cvc-complex-type.2.1: Element 'property' must have no character or element information item [children], because the type's content type is empty.
WARNING: At line 34 of <https://ci-builds.apache.org/job/Tomee/job/tomee-8.x-build-full-java8/ws/examples/scala-basic/target/surefire-reports/TEST-org.superbiz.GreetingServiceTest.xml>:cvc-complex-type.2.1: Element 'property' must have no character or element information item [children], because the type's content type is empty.
WARNING: At line 42 of <https://ci-builds.apache.org/job/Tomee/job/tomee-8.x-build-full-java8/ws/examples/scala-basic/target/surefire-reports/TEST-org.superbiz.GreetingServiceTest.xml>:cvc-complex-type.2.1: Element 'property' must have no character or element information item [children], because the type's content type is empty.
WARNING: At line 46 of <https://ci-builds.apache.org/job/Tomee/job/tomee-8.x-build-full-java8/ws/examples/scala-basic/target/surefire-reports/TEST-org.superbiz.GreetingServiceTest.xml>:cvc-complex-type.2.1: Element 'property' must have no character or element information item [children], because the type's content type is empty.
WARNING: At line 49 of <https://ci-builds.apache.org/job/Tomee/job/tomee-8.x-build-full-java8/ws/examples/scala-basic/target/surefire-reports/TEST-org.superbiz.GreetingServiceTest.xml>:cvc-complex-type.2.1: Element 'property' must have no character or element information item [children], because the type's content type is empty.
WARNING: At line 52 of <https://ci-builds.apache.org/job/Tomee/job/tomee-8.x-build-full-java8/ws/examples/scala-basic/target/surefire-reports/TEST-org.superbiz.GreetingServiceTest.xml>:cvc-complex-type.2.1: Element 'property' must have no character or element information item [children], because the type's content type is empty.
WARNING: At line 56 of <https://ci-builds.apache.org/job/Tomee/job/tomee-8.x-build-full-java8/ws/examples/scala-basic/target/surefire-reports/TEST-org.superbiz.GreetingServiceTest.xml>:cvc-complex-type.2.1: Element 'property' must have no character or element information item [children], because the type's content type is empty.
WARNING: At line 60 of <https://ci-builds.apache.org/job/Tomee/job/tomee-8.x-build-full-java8/ws/examples/scala-basic/target/surefire-reports/TEST-org.superbiz.GreetingServiceTest.xml>:cvc-complex-type.2.1: Element 'property' must have no character or element information item [children], because the type's content type is empty.
WARNING: At line 69 of <https://ci-builds.apache.org/job/Tomee/job/tomee-8.x-build-full-java8/ws/examples/scala-basic/target/surefire-reports/TEST-org.superbiz.GreetingServiceTest.xml>:cvc-complex-type.2.1: Element 'property' must have no character or element information item [children], because the type's content type is empty.
WARNING: At line 74 of <https://ci-builds.apache.org/job/Tomee/job/tomee-8.x-build-full-java8/ws/examples/scala-basic/target/surefire-reports/TEST-org.superbiz.GreetingServiceTest.xml>:cvc-complex-type.2.1: Element 'property' must have no character or element information item [children], because the type's content type is empty.
WARNING: At line 77 of <https://ci-builds.apache.org/job/Tomee/job/tomee-8.x-build-full-java8/ws/examples/scala-basic/target/surefire-reports/TEST-org.superbiz.GreetingServiceTest.xml>:cvc-complex-type.2.1: Element 'property' must have no character or element information item [children], because the type's content type is empty.
WARNING: At line 85 of <https://ci-builds.apache.org/job/Tomee/job/tomee-8.x-build-full-java8/ws/examples/scala-basic/target/surefire-reports/TEST-org.superbiz.GreetingServiceTest.xml>:cvc-complex-type.2.1: Element 'property' must have no character or element information item [children], because the type's content type is empty.
WARNING: At line 89 of <https://ci-builds.apache.org/job/Tomee/job/tomee-8.x-build-full-java8/ws/examples/scala-basic/target/surefire-reports/TEST-org.superbiz.GreetingServiceTest.xml>:cvc-complex-type.2.1: Element 'property' must have no character or element information item [children], because the type's content type is empty.
WARNING: At line 94 of <https://ci-builds.apache.org/job/Tomee/job/tomee-8.x-build-full-java8/ws/examples/scala-basic/target/surefire-reports/TEST-org.superbiz.GreetingServiceTest.xml>:cvc-complex-type.2.1: Element 'property' must have no character or element information item [children], because the type's content type is empty.
WARNING: At line 98 of <https://ci-builds.apache.org/job/Tomee/job/tomee-8.x-build-full-java8/ws/examples/scala-basic/target/surefire-reports/TEST-org.superbiz.GreetingServiceTest.xml>:cvc-complex-type.2.1: Element 'property' must have no character or element information item [children], because the type's content type is empty.
WARNING: The result file '<https://ci-builds.apache.org/job/Tomee/job/tomee-8.x-build-full-java8/ws/examples/scala-basic/target/surefire-reports/TEST-org.superbiz.GreetingServiceTest.xml'> for the metric 'JUnit' is not valid. The result file has been skipped.
INFO: Setting the build status to org.jenkinsci.plugins.xunit.XUnitProcessorResult@780625a3

Build failed in Jenkins: TomEE » tomee-8.x-build-full-java8 #89

Posted by Apache Jenkins Server <je...@builds.apache.org>.
See <https://ci-builds.apache.org/job/Tomee/job/tomee-8.x-build-full-java8/89/display/redirect?page=changes>

Changes:

[exabrial] Close Tomee-4031 - attempt to use parameter names from reflection, which should fall back to arg0 syntax if information was not compiled in


------------------------------------------
[...truncated 18.49 MB...]
[INFO] TomEE :: Web Examples :: Java Modules (Simple REST resource) 8.0.16-SNAPSHOT SKIPPED
[INFO] TomEE :: Examples :: JAXRS Filter 8.0.16-SNAPSHOT .. SUCCESS [  0.870 s]
[INFO] TomEE :: Examples :: JAXRS JSON Provider with Jettison 8.0.16-SNAPSHOT SKIPPED
[INFO] TomEE :: Examples :: JPA with EclipseLink 8.0.16-SNAPSHOT SUCCESS [  4.470 s]
[INFO] TomEE :: Utils :: Core Hibernate 8.0.16-SNAPSHOT ... SUCCESS [  0.965 s]
[INFO] TomEE :: Examples :: JPA with Hibernate 8.0.16-SNAPSHOT SUCCESS [  5.527 s]
[INFO] TomEE :: Examples :: JPA with Hibernate and arquillian 8.0.16-SNAPSHOT SKIPPED
[INFO] TomEE :: Examples :: JPA @Enumerated 8.0.16-SNAPSHOT SUCCESS [  4.674 s]
[INFO] TomEE :: Web Examples :: JSF - ManangedBean and EJB 8.0.16-SNAPSHOT SKIPPED
[INFO] TomEE :: Web Examples :: JSF - CDI and EJB 8.0.16-SNAPSHOT SUCCESS [  0.475 s]
[INFO] TomEE :: Examples :: JUnit 5 :: Application Composer 8.0.16-SNAPSHOT SUCCESS [  5.514 s]
[INFO] TomEE :: Examples :: JUnit 5 :: Multiple TomEE with Arquillian 8.0.16-SNAPSHOT SKIPPED
[INFO] TomEE :: Examples :: JUnit 5 :: Simple Websockets with Arquillian 8.0.16-SNAPSHOT SKIPPED
[INFO] TomEE :: Examples :: @EJB Lookup 8.0.16-SNAPSHOT ... SUCCESS [  2.121 s]
[INFO] TomEE :: Examples :: EJB Lookup with descriptor 8.0.16-SNAPSHOT SUCCESS [  2.213 s]
[INFO] TomEE :: Examples :: Movies Complete (Meta) 8.0.16-SNAPSHOT SUCCESS [  5.040 s]
[INFO] TomEE :: Examples :: Movies Complete 8.0.16-SNAPSHOT SUCCESS [  4.806 s]
[INFO] MicroProfile :: Examples :: Config 8.0.16-SNAPSHOT . SKIPPED
[INFO] MicroProfile :: Examples :: Config Source Database 8.0.16-SNAPSHOT SKIPPED
[INFO] TomEE :: Examples :: Microprofile Fault Tolerance :: Fallback 8.0.16-SNAPSHOT SKIPPED
[INFO] TomEE :: Examples :: Microprofile Fault Tolerance :: Retry 8.0.16-SNAPSHOT SKIPPED
[INFO] TomEE :: Examples :: Microprofile JSONB Configuration 8.0.16-SNAPSHOT SKIPPED
[INFO] Apache TomEE + MicroProfile JWT Bean Validation 8.0.16-SNAPSHOT SKIPPED
[INFO] Apache TomEE + MicroProfile JWT Bean Validation, Strongly-typed Annotations 8.0.16-SNAPSHOT SKIPPED
[INFO] TomEE :: Examples :: Microprofile Metrics Counted 8.0.16-SNAPSHOT SKIPPED
[INFO] TomEE :: Examples :: Microprofile Metrics Histogram 8.0.16-SNAPSHOT SKIPPED
[INFO] TomEE :: Examples :: Microprofile Metrics Timed 8.0.16-SNAPSHOT SKIPPED
[INFO] mp-metrics-gauge 8.0.16-SNAPSHOT ................... SKIPPED
[INFO] mp-metrics-metered 8.0.16-SNAPSHOT ................. SKIPPED
[INFO] mp-opentracing.traced 8.0.16-SNAPSHOT .............. SKIPPED
[INFO] TomEE :: Examples :: MP REST JWT 8.0.16-SNAPSHOT ... SKIPPED
[INFO] TomEE :: Examples :: MP REST JWT JWK 8.0.16-SNAPSHOT SKIPPED
[INFO] TomEE :: Examples :: MP REST JWT PRINCIPAL 8.0.16-SNAPSHOT SKIPPED
[INFO] TomEE :: Examples :: MP REST JWT Public Key 8.0.16-SNAPSHOT SKIPPED
[INFO] TomEE :: Utils :: Mockito 8.0.16-SNAPSHOT .......... SUCCESS [  6.979 s]
[INFO] TomEE :: Examples :: MTOM 8.0.16-SNAPSHOT .......... SKIPPED
[INFO] TomEE :: Examples :: Multiple JPA providers 8.0.16-SNAPSHOT SUCCESS [ 11.273 s]
[INFO] TomEE :: Examples :: Multiple Arquillian Adapters 8.0.16-SNAPSHOT SKIPPED
[INFO] TomEE :: Examples :: Multiple TomEE with Arquillian 8.0.16-SNAPSHOT SKIPPED
[INFO] TomEE :: Examples :: JSF2/CDI/BV/JPA/CODI 8.0.16-SNAPSHOT SKIPPED
[INFO] TomEE :: Examples :: Persistence Fragment 8.0.16-SNAPSHOT SUCCESS [  2.917 s]
[INFO] TomEE :: Web Examples :: Pojo WS 8.0.16-SNAPSHOT ... SKIPPED
[INFO] TomEE :: Examples :: Polling 8.0.16-SNAPSHOT ....... SUCCESS [  0.079 s]
[INFO] TomEE :: Examples :: Polling :: Domain 8.0.16-SNAPSHOT SUCCESS [  1.213 s]
[INFO] TomEE :: Examples :: Polling :: Core 8.0.16-SNAPSHOT SKIPPED
[INFO] TomEE :: Examples :: Polling :: Web 8.0.16-SNAPSHOT  SKIPPED
[INFO] TomEE :: Examples :: Polling :: Client 8.0.16-SNAPSHOT SKIPPED
[INFO] TomEE :: Examples :: DeltaSpike ProjectStage 8.0.16-SNAPSHOT SKIPPED
[INFO] TomEE :: Examples :: Quartz 8.0.16-SNAPSHOT ........ SUCCESS [  0.023 s]
[INFO] TomEE :: Examples :: Quartz :: Quartz Resource Adapter 8.0.16-SNAPSHOT SKIPPED
[INFO] TomEE :: Examples :: Quartz :: Quartz Beans 8.0.16-SNAPSHOT SKIPPED
[INFO] TomEE :: Examples :: DataSource Realm 8.0.16-SNAPSHOT SKIPPED
[INFO] TomEE :: Examples :: Reloadable Persistence Unit Properties 8.0.16-SNAPSHOT SUCCESS [  5.012 s]
[INFO] TomEE :: Web Examples :: Resource Declared In A Webapp 8.0.16-SNAPSHOT SUCCESS [  0.594 s]
[INFO] TomEE :: Examples :: REST, Mockito and Application Composer 8.0.16-SNAPSHOT SUCCESS [  4.062 s]
[INFO] TomEE :: Examples :: REST and Application Composer 8.0.16-SNAPSHOT SUCCESS [  3.118 s]
[INFO] TomEE :: Examples :: REST CDI 8.0.16-SNAPSHOT ...... SUCCESS [  4.803 s]
[INFO] TomEE :: Examples :: JAXRS and JAAS 8.0.16-SNAPSHOT  SKIPPED
[INFO] TomEE :: Examples :: REST and EJB 8.0.16-SNAPSHOT .. SUCCESS [  6.653 s]
[INFO] TomEE :: Web Examples :: REST Example 8.0.16-SNAPSHOT SKIPPED
[INFO] TomEE :: Web Examples :: REST Example With Application 8.0.16-SNAPSHOT SUCCESS [  0.921 s]
[INFO] TomEE :: Web Examples :: REST SSE Example 8.0.16-SNAPSHOT SKIPPED
[INFO] TomEE :: Examples :: REST XML JSON 8.0.16-SNAPSHOT . SUCCESS [  4.203 s]
[INFO] TomEE :: Examples :: Basic Scala 8.0.16-SNAPSHOT ... SUCCESS [ 11.671 s]
[INFO] TomEE :: Examples :: ScheduleExpression 8.0.16-SNAPSHOT SUCCESS [  7.293 s]
[INFO] TomEE :: Examples :: @Schedule Events 8.0.16-SNAPSHOT SUCCESS [ 14.880 s]
[INFO] TomEE :: Examples :: @Schedule Methods (Meta) 8.0.16-SNAPSHOT SUCCESS [  7.317 s]
[INFO] TomEE :: Examples :: @Schedule Methods 8.0.16-SNAPSHOT SUCCESS [  7.367 s]
[INFO] TomEE :: Examples :: Server Events 8.0.16-SNAPSHOT . SUCCESS [  3.085 s]
[INFO] TomEE :: Examples :: Serverless Apache TomEE WebProfile 8.0.16-SNAPSHOT SKIPPED
[INFO] TomEE :: Examples :: Serverless Apache TomEE WebProfile 8.0.16-SNAPSHOT SKIPPED
[INFO] TomEE :: Examples :: Serverless Apache TomEE MicroProfile 8.0.16-SNAPSHOT SKIPPED
[INFO] TomEE :: Examples :: Serverless Apache TomEE Plume 8.0.16-SNAPSHOT SKIPPED
[INFO] TomEE :: Examples :: Serverless Apache TomEE Plus 8.0.16-SNAPSHOT SKIPPED
[INFO] TomEE :: Examples ::  Singleton startup ordering 8.0.16-SNAPSHOT SKIPPED
[INFO] TomEE :: Examples :: Simple CDI Interceptor 8.0.16-SNAPSHOT SUCCESS [  2.522 s]
[INFO] TomEE :: Examples :: Simple EAR 8.0.16-SNAPSHOT .... SUCCESS [  0.024 s]
[INFO] TomEE :: Examples :: Simple EAR :: Business Model 8.0.16-SNAPSHOT SUCCESS [  0.118 s]
[INFO] TomEE :: Examples :: Simple EAR :: Business Logic 8.0.16-SNAPSHOT SUCCESS [  4.416 s]
[INFO] TomEE :: Examples :: Simple EAR :: Webapp 8.0.16-SNAPSHOT SUCCESS [  0.258 s]
[INFO] TomEE :: Examples :: Simple EAR :: EAR Packaging 8.0.16-SNAPSHOT SUCCESS [  0.059 s]
[INFO] TomEE :: Examples :: Simple EAR :: Functional Tests 8.0.16-SNAPSHOT SKIPPED
[INFO] TomEE :: Examples :: Simple CMP2 Entity 8.0.16-SNAPSHOT SUCCESS [  4.583 s]
[INFO] TomEE :: Examples :: Simple JMS 8.0.16-SNAPSHOT .... SKIPPED
[INFO] TomEE :: Examples :: Simple JMS Context 8.0.16-SNAPSHOT SKIPPED
[INFO] TomEE :: Examples :: Simple MDB With a CDI Injection 8.0.16-SNAPSHOT SKIPPED
[INFO] TomEE :: Examples :: Simple MDB Example 8.0.16-SNAPSHOT SKIPPED
[INFO] TomEE :: Examples :: Simple MDB Using Deployment Descriptor Example 8.0.16-SNAPSHOT SKIPPED
[INFO] TomEE :: Examples :: Simple Remote tomcat-users.xml 8.0.16-SNAPSHOT SKIPPED
[INFO] TomEE :: Examples :: Simple REST 8.0.16-SNAPSHOT ... SUCCESS [  3.385 s]
[INFO] TomEE :: Examples :: Simple Singleton 8.0.16-SNAPSHOT SUCCESS [  2.308 s]
[INFO] TomEE :: Examples :: Simple Stateful Pojo 8.0.16-SNAPSHOT SUCCESS [  2.223 s]
[INFO] TomEE :: Examples :: Simple Stateful Pojo Callbacks 8.0.16-SNAPSHOT SUCCESS [  6.262 s]
[INFO] TomEE :: Examples :: Simple Stateless Pojo 8.0.16-SNAPSHOT SUCCESS [  2.174 s]
[INFO] TomEE :: Examples :: Simple Stateless Pojo Callbacks 8.0.16-SNAPSHOT SUCCESS [  2.198 s]
[INFO] TomEE :: Examples :: Simple Stateless With Deployment Descriptor 8.0.16-SNAPSHOT SUCCESS [  1.839 s]
[INFO] TomEE :: Examples :: Simple Webservice 8.0.16-SNAPSHOT SKIPPED
[INFO] TomEE :: Examples :: Simple Webservice Without Interface 8.0.16-SNAPSHOT SKIPPED
[INFO] OpenEJB :: Examples :: Async Servlet 8.0.16-SNAPSHOT SKIPPED
[INFO] TomEE :: Examples :: Spring Data 8.0.16-SNAPSHOT ... SUCCESS [  5.713 s]
[INFO] TomEE :: Examples :: Spring Data Meta 8.0.16-SNAPSHOT SUCCESS [  5.462 s]
[INFO] TomEE :: Web Examples :: Struts 8.0.16-SNAPSHOT .... SUCCESS [  0.447 s]
[INFO] TomEE :: Examples :: Telephone Stateful Pojo 8.0.16-SNAPSHOT SUCCESS [  3.260 s]
[INFO] TomEE :: Examples :: TestCase Injection 8.0.16-SNAPSHOT SUCCESS [  4.563 s]
[INFO] TomEE :: Examples :: Testing Security (Meta) 8.0.16-SNAPSHOT SUCCESS [  4.821 s]
[INFO] TomEE :: Examples :: Testing Security 8.0.16-SNAPSHOT SUCCESS [  5.702 s]
[INFO] TomEE :: Examples :: Testing Security 8.0.16-SNAPSHOT SUCCESS [  5.564 s]
[INFO] TomEE :: Examples :: Testing Security Service Provider 8.0.16-SNAPSHOT SUCCESS [  5.794 s]
[INFO] TomEE :: Examples :: Testing Security Script Service Provider 8.0.16-SNAPSHOT SUCCESS [  6.511 s]
[INFO] TomEE :: Examples :: Testing Transactions 8.0.16-SNAPSHOT SUCCESS [  4.687 s]
[INFO] TomEE :: Examples :: Testing Transactions BMT 8.0.16-SNAPSHOT SUCCESS [  4.665 s]
[INFO] TomEE :: Examples :: TomEE, Jersey, Eclipselink 8.0.16-SNAPSHOT SKIPPED
[INFO] TomEE :: TomEE :: IBM MQ AMQ Portability Examples :: MDB Example 1.0 SUCCESS [  0.348 s]
[INFO] TomEE :: Examples :: Transaction Rollback 8.0.16-SNAPSHOT SUCCESS [  6.292 s]
[INFO] TomEE :: Examples :: Troubleshooting 8.0.16-SNAPSHOT SUCCESS [  4.857 s]
[INFO] TomEE :: Examples :: Webservice Attachments 8.0.16-SNAPSHOT SUCCESS [  5.251 s]
[INFO] TomEE :: Examples :: Webservice Inheritance 8.0.16-SNAPSHOT SKIPPED
[INFO] TomEE :: Web Examples :: EJB WebService with Security 8.0.16-SNAPSHOT SKIPPED
[INFO] TomEE :: Web Examples :: EJB WebService with SSL Client Certificate 8.0.16-SNAPSHOT SKIPPED
[INFO] TomEE :: Web Examples :: EJB WebService with WS-Security 8.0.16-SNAPSHOT SKIPPED
[INFO] TomEE :: Web Examples :: EJB WebService WS Security with resources.xml 8.0.16-SNAPSHOT SKIPPED
[INFO] TomEE :: Examples :: Web Service Handlers 8.0.16-SNAPSHOT SKIPPED
[INFO] TomEE :: Examples :: @WebService Holder 8.0.16-SNAPSHOT SKIPPED
[INFO] TomEE :: Web Examples :: Moviefun 8.0.16-SNAPSHOT .. SKIPPED
[INFO] TomEE :: Web Examples :: Moviefun Rest 8.0.16-SNAPSHOT SKIPPED
[INFO] TomEE :: Utils :: Provisionning 8.0.16-SNAPSHOT .... SUCCESS [  3.130 s]
[INFO] TomEE :: Examples :: Resources/JMX Example 8.0.16-SNAPSHOT SUCCESS [  0.110 s]
[INFO] TomEE :: Examples :: Resources/JMX Example :: EJB Module 8.0.16-SNAPSHOT SKIPPED
[INFO] TomEE :: Examples :: Resources/JMX Example :: EAR Module 8.0.16-SNAPSHOT SKIPPED
[INFO] TomEE :: Examples :: WebSocket with tls and basic auth Example 8.0.16-SNAPSHOT SKIPPED
[INFO] TomEE :: Examples :: Concurrency utilities example 8.0.16-SNAPSHOT SKIPPED
[INFO] TomEE :: Examples :: MVC (CXF-based) 8.0.16-SNAPSHOT SKIPPED
[INFO] TomEE :: Examples :: MVC (CXF-based) with Hibernate 8.0.16-SNAPSHOT SKIPPED
[INFO] TomEE :: Examples :: Microprofile REST Client 8.0.16-SNAPSHOT SKIPPED
[INFO] TomEE :: Examples :: MVC (RestEasy-based) 8.0.16-SNAPSHOT SKIPPED
[INFO] TomEE :: Examples :: Custom HealthCheck 8.0.16-SNAPSHOT SKIPPED
[INFO] TomEE :: Examples :: Microprofile JSONB Configuration 8.0.16-SNAPSHOT SKIPPED
[INFO] TomEE :: Examples :: Microprofile JSONB Custom Serializer/Deserializer 8.0.16-SNAPSHOT SKIPPED
[INFO] TomEE :: Examples :: Vaadin LTS V08 8.0.16-SNAPSHOT  SKIPPED
[INFO] TomEE :: Examples :: Vaadin LTS V10 8.0.16-SNAPSHOT  SKIPPED
[INFO] TomEE :: Examples :: Vaadin LATEST 8.0.16-SNAPSHOT . SKIPPED
[INFO] TomEE :: Examples :: Azure deployment example 8.0.16-SNAPSHOT SKIPPED
[INFO] TomEE :: Examples :: Microprofile Fault Tolerance :: Timeout 8.0.16-SNAPSHOT SKIPPED
[INFO] TomEE :: Examples :: XA Datasource configuration and usage 8.0.16-SNAPSHOT SKIPPED
[INFO] TomEE :: Examples :: Websocket JMS 8.0.16-SNAPSHOT . SKIPPED
[INFO] TomEE :: Examples :: Properties Provider 8.0.16-SNAPSHOT SUCCESS [  0.029 s]
[INFO] TomEE :: Examples :: Properties Provider :: Implementation 8.0.16-SNAPSHOT SUCCESS [  0.113 s]
[INFO] TomEE :: Examples :: Properties Provider :: Sample Webapp 8.0.16-SNAPSHOT SKIPPED
[INFO] TomEE :: Examples :: Jakarta Security tomcat-user.xml Identity Store 8.0.16-SNAPSHOT SKIPPED
[INFO] TomEE :: Examples :: Jakarta Security custom Identity Store 8.0.16-SNAPSHOT SKIPPED
[INFO] TomEE :: Examples 8.0.16-SNAPSHOT .................. SUCCESS [  0.639 s]
[INFO] TomEE :: Assembly :: All In One EJB Lite jar 8.0.16-SNAPSHOT SUCCESS [ 27.649 s]
[INFO] TomEE :: Utils :: TomEE Webapps-based Deployer EJB 8.0.16-SNAPSHOT SUCCESS [  0.846 s]
[INFO] TomEE :: TCK 8.0.16-SNAPSHOT ....................... SUCCESS [  0.023 s]
[INFO] TomEE :: TCK :: Common 8.0.16-SNAPSHOT ............. SUCCESS [  1.318 s]
[INFO] TomEE :: TCK :: CDI Embedded 8.0.16-SNAPSHOT ....... SUCCESS [04:27 min]
[INFO] TomEE :: TCK :: CDI TomEE 8.0.16-SNAPSHOT .......... SKIPPED
[INFO] TomEE :: TCK :: CDI TCK Signature Tests 8.0.16-SNAPSHOT SUCCESS [  2.355 s]
[INFO] TomEE :: TCK :: Bean Validation Embedded 8.0.16-SNAPSHOT SUCCESS [01:17 min]
[INFO] TomEE :: TCK :: Bean Validation TomEE 8.0.16-SNAPSHOT SKIPPED
[INFO] TomEE :: TCK :: Bean Validation TCK Signature tests 8.0.16-SNAPSHOT SUCCESS [  1.877 s]
[INFO] TomEE :: TCK :: MicroProfile 8.0.16-SNAPSHOT ....... SUCCESS [  0.058 s]
[INFO] TomEE :: TCK :: MicroProfile Config TCK 8.0.16-SNAPSHOT SKIPPED
[INFO] TomEE :: TCK :: MicroProfile JWT TCK 8.0.16-SNAPSHOT SKIPPED
[INFO] TomEE :: TCK :: MicroProfile Fault Tolerance TCK 8.0.16-SNAPSHOT SKIPPED
[INFO] TomEE :: TCK :: MicroProfile Health TCK 8.0.16-SNAPSHOT SKIPPED
[INFO] TomEE :: TCK :: MicroProfile Metrics TCK 8.0.16-SNAPSHOT SKIPPED
[INFO] TomEE :: TCK :: MicroProfile Rest Client TCK 8.0.16-SNAPSHOT SKIPPED
[INFO] TomEE :: TCK :: MicroProfile Open API TCK 8.0.16-SNAPSHOT SKIPPED
[INFO] TomEE :: TCK :: MicroProfile Open Tracing TCK 8.0.16-SNAPSHOT SKIPPED
[INFO] TomEE :: Arquillian Adaptors Parent :: Webapp Remote 8.0.16-SNAPSHOT SUCCESS [ 56.756 s]
[INFO] TomEE :: Arquillian Adaptors Parent :: Tests 8.0.16-SNAPSHOT SKIPPED
[INFO] TomEE :: Arquillian Adaptors Parent :: Tests :: Web Profile 8.0.16-SNAPSHOT SKIPPED
[INFO] TomEE :: Arquillian Adaptors Parent :: Tests :: JAXRS 8.0.16-SNAPSHOT SKIPPED
[INFO] TomEE :: Arquillian Adaptors Parent :: Tests :: JAXWS 8.0.16-SNAPSHOT SKIPPED
[INFO] TomEE :: Arquillian Adaptors Parent :: Tests :: JMS 8.0.16-SNAPSHOT SKIPPED
[INFO] TomEE :: Arquillian Adaptors Parent :: Tests :: CODI 8.0.16-SNAPSHOT SKIPPED
[INFO] TomEE :: Arquillian Adaptors Parent :: Tests :: Configuration Tests 8.0.16-SNAPSHOT SKIPPED
[INFO] TomEE :: Arquillian Adaptors Parent :: Sample :: Moviefun 8.0.16-SNAPSHOT SUCCESS [ 35.336 s]
[INFO] TomEE :: Arquillian Adaptors Parent :: Arquillian TCK 8.0.16-SNAPSHOT SKIPPED
[INFO] TomEE :: Utils :: Log4j2 8.0.16-SNAPSHOT ........... SUCCESS [  0.958 s]
[INFO] TomEE :: TomEE :: webaccess 8.0.16-SNAPSHOT ........ SKIPPED
[INFO] TomEE :: TomEE :: Overlay Runner 8.0.16-SNAPSHOT ... SUCCESS [  0.598 s]
[INFO] ------------------------------------------------------------------------
[INFO] BUILD FAILURE
[INFO] ------------------------------------------------------------------------
[INFO] Total time:  01:05 h
[INFO] Finished at: 2023-06-10T08:23:01Z
[INFO] ------------------------------------------------------------------------
[ERROR] Failed to execute goal org.apache.maven.plugins:maven-surefire-plugin:3.0.0-M5:test (default-test) on project tomee-security: There are test failures.
[ERROR] 
[ERROR] Please refer to <https://ci-builds.apache.org/job/Tomee/job/tomee-8.x-build-full-java8/ws/tomee/tomee-security/target/surefire-reports> for the individual test results.
[ERROR] Please refer to dump files (if any exist) [date].dump, [date]-jvmRun[N].dump and [date].dumpstream.
[ERROR] -> [Help 1]
[ERROR] 
[ERROR] To see the full stack trace of the errors, re-run Maven with the -e switch.
[ERROR] Re-run Maven using the -X switch to enable full debug logging.
[ERROR] 
[ERROR] For more information about the errors and possible solutions, please read the following articles:
[ERROR] [Help 1] http://cwiki.apache.org/confluence/display/MAVEN/MojoFailureException
[ERROR] 
[ERROR] After correcting the problems, you can resume the build with the command
[ERROR]   mvn <args> -rf :tomee-security
Build step 'Invoke top-level Maven targets' marked build as failure
INFO: Processing JUnit
INFO: [JUnit] - 880 test report file(s) were found with the pattern '**/target/surefire-reports/TEST-*.xml' relative to '<https://ci-builds.apache.org/job/Tomee/job/tomee-8.x-build-full-java8/ws/'> for the testing framework 'JUnit'.
WARNING: The file '<https://ci-builds.apache.org/job/Tomee/job/tomee-8.x-build-full-java8/ws/examples/scala-basic/target/surefire-reports/TEST-org.scalatest.tools.DiscoverySuite-769c7ac3-08ea-41b4-9679-d0a109f0dd2e.xml'> is an invalid file.
WARNING: At line 8 of <https://ci-builds.apache.org/job/Tomee/job/tomee-8.x-build-full-java8/ws/examples/scala-basic/target/surefire-reports/TEST-org.scalatest.tools.DiscoverySuite-769c7ac3-08ea-41b4-9679-d0a109f0dd2e.xml>:cvc-complex-type.2.1: Element 'property' must have no character or element information item [children], because the type's content type is empty.
WARNING: At line 13 of <https://ci-builds.apache.org/job/Tomee/job/tomee-8.x-build-full-java8/ws/examples/scala-basic/target/surefire-reports/TEST-org.scalatest.tools.DiscoverySuite-769c7ac3-08ea-41b4-9679-d0a109f0dd2e.xml>:cvc-complex-type.2.1: Element 'property' must have no character or element information item [children], because the type's content type is empty.
WARNING: At line 24 of <https://ci-builds.apache.org/job/Tomee/job/tomee-8.x-build-full-java8/ws/examples/scala-basic/target/surefire-reports/TEST-org.scalatest.tools.DiscoverySuite-769c7ac3-08ea-41b4-9679-d0a109f0dd2e.xml>:cvc-complex-type.2.1: Element 'property' must have no character or element information item [children], because the type's content type is empty.
WARNING: At line 27 of <https://ci-builds.apache.org/job/Tomee/job/tomee-8.x-build-full-java8/ws/examples/scala-basic/target/surefire-reports/TEST-org.scalatest.tools.DiscoverySuite-769c7ac3-08ea-41b4-9679-d0a109f0dd2e.xml>:cvc-complex-type.2.1: Element 'property' must have no character or element information item [children], because the type's content type is empty.
WARNING: At line 31 of <https://ci-builds.apache.org/job/Tomee/job/tomee-8.x-build-full-java8/ws/examples/scala-basic/target/surefire-reports/TEST-org.scalatest.tools.DiscoverySuite-769c7ac3-08ea-41b4-9679-d0a109f0dd2e.xml>:cvc-complex-type.2.1: Element 'property' must have no character or element information item [children], because the type's content type is empty.
WARNING: At line 34 of <https://ci-builds.apache.org/job/Tomee/job/tomee-8.x-build-full-java8/ws/examples/scala-basic/target/surefire-reports/TEST-org.scalatest.tools.DiscoverySuite-769c7ac3-08ea-41b4-9679-d0a109f0dd2e.xml>:cvc-complex-type.2.1: Element 'property' must have no character or element information item [children], because the type's content type is empty.
WARNING: At line 42 of <https://ci-builds.apache.org/job/Tomee/job/tomee-8.x-build-full-java8/ws/examples/scala-basic/target/surefire-reports/TEST-org.scalatest.tools.DiscoverySuite-769c7ac3-08ea-41b4-9679-d0a109f0dd2e.xml>:cvc-complex-type.2.1: Element 'property' must have no character or element information item [children], because the type's content type is empty.
WARNING: At line 46 of <https://ci-builds.apache.org/job/Tomee/job/tomee-8.x-build-full-java8/ws/examples/scala-basic/target/surefire-reports/TEST-org.scalatest.tools.DiscoverySuite-769c7ac3-08ea-41b4-9679-d0a109f0dd2e.xml>:cvc-complex-type.2.1: Element 'property' must have no character or element information item [children], because the type's content type is empty.
WARNING: At line 49 of <https://ci-builds.apache.org/job/Tomee/job/tomee-8.x-build-full-java8/ws/examples/scala-basic/target/surefire-reports/TEST-org.scalatest.tools.DiscoverySuite-769c7ac3-08ea-41b4-9679-d0a109f0dd2e.xml>:cvc-complex-type.2.1: Element 'property' must have no character or element information item [children], because the type's content type is empty.
WARNING: At line 52 of <https://ci-builds.apache.org/job/Tomee/job/tomee-8.x-build-full-java8/ws/examples/scala-basic/target/surefire-reports/TEST-org.scalatest.tools.DiscoverySuite-769c7ac3-08ea-41b4-9679-d0a109f0dd2e.xml>:cvc-complex-type.2.1: Element 'property' must have no character or element information item [children], because the type's content type is empty.
WARNING: At line 56 of <https://ci-builds.apache.org/job/Tomee/job/tomee-8.x-build-full-java8/ws/examples/scala-basic/target/surefire-reports/TEST-org.scalatest.tools.DiscoverySuite-769c7ac3-08ea-41b4-9679-d0a109f0dd2e.xml>:cvc-complex-type.2.1: Element 'property' must have no character or element information item [children], because the type's content type is empty.
WARNING: At line 60 of <https://ci-builds.apache.org/job/Tomee/job/tomee-8.x-build-full-java8/ws/examples/scala-basic/target/surefire-reports/TEST-org.scalatest.tools.DiscoverySuite-769c7ac3-08ea-41b4-9679-d0a109f0dd2e.xml>:cvc-complex-type.2.1: Element 'property' must have no character or element information item [children], because the type's content type is empty.
WARNING: At line 69 of <https://ci-builds.apache.org/job/Tomee/job/tomee-8.x-build-full-java8/ws/examples/scala-basic/target/surefire-reports/TEST-org.scalatest.tools.DiscoverySuite-769c7ac3-08ea-41b4-9679-d0a109f0dd2e.xml>:cvc-complex-type.2.1: Element 'property' must have no character or element information item [children], because the type's content type is empty.
WARNING: At line 74 of <https://ci-builds.apache.org/job/Tomee/job/tomee-8.x-build-full-java8/ws/examples/scala-basic/target/surefire-reports/TEST-org.scalatest.tools.DiscoverySuite-769c7ac3-08ea-41b4-9679-d0a109f0dd2e.xml>:cvc-complex-type.2.1: Element 'property' must have no character or element information item [children], because the type's content type is empty.
WARNING: At line 77 of <https://ci-builds.apache.org/job/Tomee/job/tomee-8.x-build-full-java8/ws/examples/scala-basic/target/surefire-reports/TEST-org.scalatest.tools.DiscoverySuite-769c7ac3-08ea-41b4-9679-d0a109f0dd2e.xml>:cvc-complex-type.2.1: Element 'property' must have no character or element information item [children], because the type's content type is empty.
WARNING: At line 85 of <https://ci-builds.apache.org/job/Tomee/job/tomee-8.x-build-full-java8/ws/examples/scala-basic/target/surefire-reports/TEST-org.scalatest.tools.DiscoverySuite-769c7ac3-08ea-41b4-9679-d0a109f0dd2e.xml>:cvc-complex-type.2.1: Element 'property' must have no character or element information item [children], because the type's content type is empty.
WARNING: At line 89 of <https://ci-builds.apache.org/job/Tomee/job/tomee-8.x-build-full-java8/ws/examples/scala-basic/target/surefire-reports/TEST-org.scalatest.tools.DiscoverySuite-769c7ac3-08ea-41b4-9679-d0a109f0dd2e.xml>:cvc-complex-type.2.1: Element 'property' must have no character or element information item [children], because the type's content type is empty.
WARNING: At line 94 of <https://ci-builds.apache.org/job/Tomee/job/tomee-8.x-build-full-java8/ws/examples/scala-basic/target/surefire-reports/TEST-org.scalatest.tools.DiscoverySuite-769c7ac3-08ea-41b4-9679-d0a109f0dd2e.xml>:cvc-complex-type.2.1: Element 'property' must have no character or element information item [children], because the type's content type is empty.
WARNING: At line 98 of <https://ci-builds.apache.org/job/Tomee/job/tomee-8.x-build-full-java8/ws/examples/scala-basic/target/surefire-reports/TEST-org.scalatest.tools.DiscoverySuite-769c7ac3-08ea-41b4-9679-d0a109f0dd2e.xml>:cvc-complex-type.2.1: Element 'property' must have no character or element information item [children], because the type's content type is empty.
WARNING: The result file '<https://ci-builds.apache.org/job/Tomee/job/tomee-8.x-build-full-java8/ws/examples/scala-basic/target/surefire-reports/TEST-org.scalatest.tools.DiscoverySuite-769c7ac3-08ea-41b4-9679-d0a109f0dd2e.xml'> for the metric 'JUnit' is not valid. The result file has been skipped.
WARNING: The file '<https://ci-builds.apache.org/job/Tomee/job/tomee-8.x-build-full-java8/ws/examples/scala-basic/target/surefire-reports/TEST-org.superbiz.GreetingServiceTest.xml'> is an invalid file.
WARNING: At line 8 of <https://ci-builds.apache.org/job/Tomee/job/tomee-8.x-build-full-java8/ws/examples/scala-basic/target/surefire-reports/TEST-org.superbiz.GreetingServiceTest.xml>:cvc-complex-type.2.1: Element 'property' must have no character or element information item [children], because the type's content type is empty.
WARNING: At line 13 of <https://ci-builds.apache.org/job/Tomee/job/tomee-8.x-build-full-java8/ws/examples/scala-basic/target/surefire-reports/TEST-org.superbiz.GreetingServiceTest.xml>:cvc-complex-type.2.1: Element 'property' must have no character or element information item [children], because the type's content type is empty.
WARNING: At line 24 of <https://ci-builds.apache.org/job/Tomee/job/tomee-8.x-build-full-java8/ws/examples/scala-basic/target/surefire-reports/TEST-org.superbiz.GreetingServiceTest.xml>:cvc-complex-type.2.1: Element 'property' must have no character or element information item [children], because the type's content type is empty.
WARNING: At line 27 of <https://ci-builds.apache.org/job/Tomee/job/tomee-8.x-build-full-java8/ws/examples/scala-basic/target/surefire-reports/TEST-org.superbiz.GreetingServiceTest.xml>:cvc-complex-type.2.1: Element 'property' must have no character or element information item [children], because the type's content type is empty.
WARNING: At line 31 of <https://ci-builds.apache.org/job/Tomee/job/tomee-8.x-build-full-java8/ws/examples/scala-basic/target/surefire-reports/TEST-org.superbiz.GreetingServiceTest.xml>:cvc-complex-type.2.1: Element 'property' must have no character or element information item [children], because the type's content type is empty.
WARNING: At line 34 of <https://ci-builds.apache.org/job/Tomee/job/tomee-8.x-build-full-java8/ws/examples/scala-basic/target/surefire-reports/TEST-org.superbiz.GreetingServiceTest.xml>:cvc-complex-type.2.1: Element 'property' must have no character or element information item [children], because the type's content type is empty.
WARNING: At line 42 of <https://ci-builds.apache.org/job/Tomee/job/tomee-8.x-build-full-java8/ws/examples/scala-basic/target/surefire-reports/TEST-org.superbiz.GreetingServiceTest.xml>:cvc-complex-type.2.1: Element 'property' must have no character or element information item [children], because the type's content type is empty.
WARNING: At line 46 of <https://ci-builds.apache.org/job/Tomee/job/tomee-8.x-build-full-java8/ws/examples/scala-basic/target/surefire-reports/TEST-org.superbiz.GreetingServiceTest.xml>:cvc-complex-type.2.1: Element 'property' must have no character or element information item [children], because the type's content type is empty.
WARNING: At line 49 of <https://ci-builds.apache.org/job/Tomee/job/tomee-8.x-build-full-java8/ws/examples/scala-basic/target/surefire-reports/TEST-org.superbiz.GreetingServiceTest.xml>:cvc-complex-type.2.1: Element 'property' must have no character or element information item [children], because the type's content type is empty.
WARNING: At line 52 of <https://ci-builds.apache.org/job/Tomee/job/tomee-8.x-build-full-java8/ws/examples/scala-basic/target/surefire-reports/TEST-org.superbiz.GreetingServiceTest.xml>:cvc-complex-type.2.1: Element 'property' must have no character or element information item [children], because the type's content type is empty.
WARNING: At line 56 of <https://ci-builds.apache.org/job/Tomee/job/tomee-8.x-build-full-java8/ws/examples/scala-basic/target/surefire-reports/TEST-org.superbiz.GreetingServiceTest.xml>:cvc-complex-type.2.1: Element 'property' must have no character or element information item [children], because the type's content type is empty.
WARNING: At line 60 of <https://ci-builds.apache.org/job/Tomee/job/tomee-8.x-build-full-java8/ws/examples/scala-basic/target/surefire-reports/TEST-org.superbiz.GreetingServiceTest.xml>:cvc-complex-type.2.1: Element 'property' must have no character or element information item [children], because the type's content type is empty.
WARNING: At line 69 of <https://ci-builds.apache.org/job/Tomee/job/tomee-8.x-build-full-java8/ws/examples/scala-basic/target/surefire-reports/TEST-org.superbiz.GreetingServiceTest.xml>:cvc-complex-type.2.1: Element 'property' must have no character or element information item [children], because the type's content type is empty.
WARNING: At line 74 of <https://ci-builds.apache.org/job/Tomee/job/tomee-8.x-build-full-java8/ws/examples/scala-basic/target/surefire-reports/TEST-org.superbiz.GreetingServiceTest.xml>:cvc-complex-type.2.1: Element 'property' must have no character or element information item [children], because the type's content type is empty.
WARNING: At line 77 of <https://ci-builds.apache.org/job/Tomee/job/tomee-8.x-build-full-java8/ws/examples/scala-basic/target/surefire-reports/TEST-org.superbiz.GreetingServiceTest.xml>:cvc-complex-type.2.1: Element 'property' must have no character or element information item [children], because the type's content type is empty.
WARNING: At line 85 of <https://ci-builds.apache.org/job/Tomee/job/tomee-8.x-build-full-java8/ws/examples/scala-basic/target/surefire-reports/TEST-org.superbiz.GreetingServiceTest.xml>:cvc-complex-type.2.1: Element 'property' must have no character or element information item [children], because the type's content type is empty.
WARNING: At line 89 of <https://ci-builds.apache.org/job/Tomee/job/tomee-8.x-build-full-java8/ws/examples/scala-basic/target/surefire-reports/TEST-org.superbiz.GreetingServiceTest.xml>:cvc-complex-type.2.1: Element 'property' must have no character or element information item [children], because the type's content type is empty.
WARNING: At line 94 of <https://ci-builds.apache.org/job/Tomee/job/tomee-8.x-build-full-java8/ws/examples/scala-basic/target/surefire-reports/TEST-org.superbiz.GreetingServiceTest.xml>:cvc-complex-type.2.1: Element 'property' must have no character or element information item [children], because the type's content type is empty.
WARNING: At line 98 of <https://ci-builds.apache.org/job/Tomee/job/tomee-8.x-build-full-java8/ws/examples/scala-basic/target/surefire-reports/TEST-org.superbiz.GreetingServiceTest.xml>:cvc-complex-type.2.1: Element 'property' must have no character or element information item [children], because the type's content type is empty.
WARNING: The result file '<https://ci-builds.apache.org/job/Tomee/job/tomee-8.x-build-full-java8/ws/examples/scala-basic/target/surefire-reports/TEST-org.superbiz.GreetingServiceTest.xml'> for the metric 'JUnit' is not valid. The result file has been skipped.
INFO: Setting the build status to org.jenkinsci.plugins.xunit.XUnitProcessorResult@2819f174

Build failed in Jenkins: TomEE » tomee-8.x-build-full-java8 #88

Posted by Apache Jenkins Server <je...@builds.apache.org>.
See <https://ci-builds.apache.org/job/Tomee/job/tomee-8.x-build-full-java8/88/display/redirect?page=changes>

Changes:

[exabrial] Fix TOMEE-4222 - LoginToContinue causes IllegalArgumentException: setAttribute: Non-serializable attribute

[exabrial] Add SavedAuthenticationTest and SavedRequestTest to ensure referenced objects implement Serializable

[exabrial] RAT police nailed me. Add license headers to SavedAuthenticationTest and SavedRequestTest, apologies everyone for commit log spam


------------------------------------------
[...truncated 6.23 MB...]
[INFO] TomEE :: Connector Examples :: Connector in EAR :: API 8.0.16-SNAPSHOT SUCCESS [  1.914 s]
[INFO] TomEE :: Connector Examples :: Connector in EAR :: Connector Impl 8.0.16-SNAPSHOT SUCCESS [  0.202 s]
[INFO] TomEE :: Connector Examples :: Connector in EAR :: RAR Packaging 8.0.16-SNAPSHOT SUCCESS [  0.271 s]
[INFO] TomEE :: Connector Examples :: Connector in EAR :: Sample WAR 8.0.16-SNAPSHOT SUCCESS [  1.036 s]
[INFO] TomEE :: Connector Examples :: Connector in EAR :: EAR Packaging 8.0.16-SNAPSHOT SUCCESS [  0.932 s]
[INFO] TomEE :: Connector Examples :: Connector in EAR :: Functional Tests 8.0.16-SNAPSHOT SKIPPED
[INFO] TomEE :: Connector Examples :: Connector in WAR 8.0.16-SNAPSHOT SKIPPED
[INFO] TomEE :: Examples :: Cucumber JVM 8.0.16-SNAPSHOT .. SKIPPED
[INFO] TomEE :: Examples :: Expanded support for Env Entries 8.0.16-SNAPSHOT SKIPPED
[INFO] TomEE :: Examples :: Datasource Ciphered Password 8.0.16-SNAPSHOT SKIPPED
[INFO] TomEE :: Examples :: Datasource Definition 8.0.16-SNAPSHOT SKIPPED
[INFO] TomEE :: Examples :: Datasource Versioning 8.0.16-SNAPSHOT SKIPPED
[INFO] TomEE :: Examples :: Decorators 8.0.16-SNAPSHOT .... SKIPPED
[INFO] TomEE :: Arquillian Adaptors Parent :: OpenEJB Container 8.0.16-SNAPSHOT SKIPPED
[INFO] TomEE :: Examples :: DeltaSpike @ConfigProperty 8.0.16-SNAPSHOT SKIPPED
[INFO] TomEE :: Examples :: DeltaSpike Exception Handling 8.0.16-SNAPSHOT SKIPPED
[INFO] TomEE :: Examples :: JSF2/CDI/BV/JPA/DeltaSpike 8.0.16-SNAPSHOT SKIPPED
[INFO] TomEE :: Examples :: DeltaSpike I18n 8.0.16-SNAPSHOT SKIPPED
[INFO] TomEE :: Examples :: Dynamic DAO Implementation 8.0.16-SNAPSHOT SKIPPED
[INFO] TomEE :: Examples :: Dynamic Datasource Routing 8.0.16-SNAPSHOT SKIPPED
[INFO] TomEE :: Examples :: Dynamic Implementation 8.0.16-SNAPSHOT SKIPPED
[INFO] TomEE :: Examples :: Dynamic MBean Proxy 8.0.16-SNAPSHOT SKIPPED
[INFO] TomEE :: Examples :: Ear Testing 8.0.16-SNAPSHOT ... SUCCESS [  0.022 s]
[INFO] TomEE :: Examples :: Ear Testing :: Business Model 8.0.16-SNAPSHOT SUCCESS [  0.626 s]
[INFO] TomEE :: Examples :: Ear Testing :: Business Logic 8.0.16-SNAPSHOT SKIPPED
[INFO] TomEE :: Web Examples :: EJB Examples War 8.0.16-SNAPSHOT SKIPPED
[INFO] TomEE :: Web Examples :: EJB Remote Call 8.0.16-SNAPSHOT SKIPPED
[INFO] TomEE :: Web Examples :: EJB Remote Call 8.0.16-SNAPSHOT SKIPPED
[INFO] TomEE :: Web Examples :: EJB WebService 8.0.16-SNAPSHOT SUCCESS [  0.441 s]
[INFO] TomEE :: Examples :: Filter with CDI 8.0.16-SNAPSHOT SKIPPED
[INFO] TomEE :: Examples :: Groovy CDI 8.0.16-SNAPSHOT .... SKIPPED
[INFO] TomEE :: Examples :: Groovy JPA 8.0.16-SNAPSHOT .... SKIPPED
[INFO] TomEE :: Examples :: Groovy Spock 8.0.16-SNAPSHOT .. SKIPPED
[INFO] TomEE :: Examples :: Hello World - Weblogic 8.0.16-SNAPSHOT SKIPPED
[INFO] TomEE :: Examples :: @Resource javax.jms.ConnectionFactory 8.0.16-SNAPSHOT SKIPPED
[INFO] TomEE :: Examples :: @Resource DataSource Injection 8.0.16-SNAPSHOT SKIPPED
[INFO] TomEE :: Examples :: @EJB Injection 8.0.16-SNAPSHOT  SKIPPED
[INFO] TomEE :: Examples :: @PersistenceContext EntityManager Injection 8.0.16-SNAPSHOT SKIPPED
[INFO] TomEE :: Examples :: @Resource env-entry Injection 8.0.16-SNAPSHOT SKIPPED
[INFO] TomEE :: Examples :: Interceptors 8.0.16-SNAPSHOT .. SKIPPED
[INFO] TomEE :: Examples :: JavaMail API 8.0.16-SNAPSHOT .. SKIPPED
[INFO] TomEE :: Examples :: JavaMail API with Velocity 8.0.16-SNAPSHOT SKIPPED
[INFO] TomEE :: Web Examples :: Java Modules (Simple REST resource) 8.0.16-SNAPSHOT SKIPPED
[INFO] TomEE :: Examples :: JAXRS Filter 8.0.16-SNAPSHOT .. SUCCESS [  1.226 s]
[INFO] TomEE :: Examples :: JAXRS JSON Provider with Jettison 8.0.16-SNAPSHOT SKIPPED
[INFO] TomEE :: Examples :: JPA with EclipseLink 8.0.16-SNAPSHOT SKIPPED
[INFO] TomEE :: Utils :: Core Hibernate 8.0.16-SNAPSHOT ... SKIPPED
[INFO] TomEE :: Examples :: JPA with Hibernate 8.0.16-SNAPSHOT SKIPPED
[INFO] TomEE :: Examples :: JPA with Hibernate and arquillian 8.0.16-SNAPSHOT SKIPPED
[INFO] TomEE :: Examples :: JPA @Enumerated 8.0.16-SNAPSHOT SKIPPED
[INFO] TomEE :: Web Examples :: JSF - ManangedBean and EJB 8.0.16-SNAPSHOT SKIPPED
[INFO] TomEE :: Web Examples :: JSF - CDI and EJB 8.0.16-SNAPSHOT SUCCESS [  0.597 s]
[INFO] TomEE :: Examples :: JUnit 5 :: Application Composer 8.0.16-SNAPSHOT SKIPPED
[INFO] TomEE :: Examples :: JUnit 5 :: Multiple TomEE with Arquillian 8.0.16-SNAPSHOT SKIPPED
[INFO] TomEE :: Examples :: JUnit 5 :: Simple Websockets with Arquillian 8.0.16-SNAPSHOT SKIPPED
[INFO] TomEE :: Examples :: @EJB Lookup 8.0.16-SNAPSHOT ... SKIPPED
[INFO] TomEE :: Examples :: EJB Lookup with descriptor 8.0.16-SNAPSHOT SKIPPED
[INFO] TomEE :: Examples :: Movies Complete (Meta) 8.0.16-SNAPSHOT SKIPPED
[INFO] TomEE :: Examples :: Movies Complete 8.0.16-SNAPSHOT SKIPPED
[INFO] MicroProfile :: Examples :: Config 8.0.16-SNAPSHOT . SKIPPED
[INFO] MicroProfile :: Examples :: Config Source Database 8.0.16-SNAPSHOT SKIPPED
[INFO] TomEE :: Examples :: Microprofile Fault Tolerance :: Fallback 8.0.16-SNAPSHOT SKIPPED
[INFO] TomEE :: Examples :: Microprofile Fault Tolerance :: Retry 8.0.16-SNAPSHOT SKIPPED
[INFO] TomEE :: Examples :: Microprofile JSONB Configuration 8.0.16-SNAPSHOT SKIPPED
[INFO] Apache TomEE + MicroProfile JWT Bean Validation 8.0.16-SNAPSHOT SKIPPED
[INFO] Apache TomEE + MicroProfile JWT Bean Validation, Strongly-typed Annotations 8.0.16-SNAPSHOT SKIPPED
[INFO] TomEE :: Examples :: Microprofile Metrics Counted 8.0.16-SNAPSHOT SKIPPED
[INFO] TomEE :: Examples :: Microprofile Metrics Histogram 8.0.16-SNAPSHOT SKIPPED
[INFO] TomEE :: Examples :: Microprofile Metrics Timed 8.0.16-SNAPSHOT SKIPPED
[INFO] mp-metrics-gauge 8.0.16-SNAPSHOT ................... SKIPPED
[INFO] mp-metrics-metered 8.0.16-SNAPSHOT ................. SKIPPED
[INFO] mp-opentracing.traced 8.0.16-SNAPSHOT .............. SKIPPED
[INFO] TomEE :: Examples :: MP REST JWT 8.0.16-SNAPSHOT ... SKIPPED
[INFO] TomEE :: Examples :: MP REST JWT JWK 8.0.16-SNAPSHOT SKIPPED
[INFO] TomEE :: Examples :: MP REST JWT PRINCIPAL 8.0.16-SNAPSHOT SKIPPED
[INFO] TomEE :: Examples :: MP REST JWT Public Key 8.0.16-SNAPSHOT SKIPPED
[INFO] TomEE :: Utils :: Mockito 8.0.16-SNAPSHOT .......... SKIPPED
[INFO] TomEE :: Examples :: MTOM 8.0.16-SNAPSHOT .......... SKIPPED
[INFO] TomEE :: Examples :: Multiple JPA providers 8.0.16-SNAPSHOT SKIPPED
[INFO] TomEE :: Examples :: Multiple Arquillian Adapters 8.0.16-SNAPSHOT SKIPPED
[INFO] TomEE :: Examples :: Multiple TomEE with Arquillian 8.0.16-SNAPSHOT SKIPPED
[INFO] TomEE :: Examples :: JSF2/CDI/BV/JPA/CODI 8.0.16-SNAPSHOT SKIPPED
[INFO] TomEE :: Examples :: Persistence Fragment 8.0.16-SNAPSHOT SKIPPED
[INFO] TomEE :: Web Examples :: Pojo WS 8.0.16-SNAPSHOT ... SKIPPED
[INFO] TomEE :: Examples :: Polling 8.0.16-SNAPSHOT ....... SUCCESS [  0.071 s]
[INFO] TomEE :: Examples :: Polling :: Domain 8.0.16-SNAPSHOT SUCCESS [  1.441 s]
[INFO] TomEE :: Examples :: Polling :: Core 8.0.16-SNAPSHOT SKIPPED
[INFO] TomEE :: Examples :: Polling :: Web 8.0.16-SNAPSHOT  SKIPPED
[INFO] TomEE :: Examples :: Polling :: Client 8.0.16-SNAPSHOT SKIPPED
[INFO] TomEE :: Examples :: DeltaSpike ProjectStage 8.0.16-SNAPSHOT SKIPPED
[INFO] TomEE :: Examples :: Quartz 8.0.16-SNAPSHOT ........ SUCCESS [  0.009 s]
[INFO] TomEE :: Examples :: Quartz :: Quartz Resource Adapter 8.0.16-SNAPSHOT SKIPPED
[INFO] TomEE :: Examples :: Quartz :: Quartz Beans 8.0.16-SNAPSHOT SKIPPED
[INFO] TomEE :: Examples :: DataSource Realm 8.0.16-SNAPSHOT SKIPPED
[INFO] TomEE :: Examples :: Reloadable Persistence Unit Properties 8.0.16-SNAPSHOT SKIPPED
[INFO] TomEE :: Web Examples :: Resource Declared In A Webapp 8.0.16-SNAPSHOT SUCCESS [  0.447 s]
[INFO] TomEE :: Examples :: REST, Mockito and Application Composer 8.0.16-SNAPSHOT SKIPPED
[INFO] TomEE :: Examples :: REST and Application Composer 8.0.16-SNAPSHOT SKIPPED
[INFO] TomEE :: Examples :: REST CDI 8.0.16-SNAPSHOT ...... SKIPPED
[INFO] TomEE :: Examples :: JAXRS and JAAS 8.0.16-SNAPSHOT  SKIPPED
[INFO] TomEE :: Examples :: REST and EJB 8.0.16-SNAPSHOT .. SKIPPED
[INFO] TomEE :: Web Examples :: REST Example 8.0.16-SNAPSHOT SKIPPED
[INFO] TomEE :: Web Examples :: REST Example With Application 8.0.16-SNAPSHOT SUCCESS [  0.909 s]
[INFO] TomEE :: Web Examples :: REST SSE Example 8.0.16-SNAPSHOT SKIPPED
[INFO] TomEE :: Examples :: REST XML JSON 8.0.16-SNAPSHOT . SKIPPED
[INFO] TomEE :: Examples :: Basic Scala 8.0.16-SNAPSHOT ... SKIPPED
[INFO] TomEE :: Examples :: ScheduleExpression 8.0.16-SNAPSHOT SKIPPED
[INFO] TomEE :: Examples :: @Schedule Events 8.0.16-SNAPSHOT SKIPPED
[INFO] TomEE :: Examples :: @Schedule Methods (Meta) 8.0.16-SNAPSHOT SKIPPED
[INFO] TomEE :: Examples :: @Schedule Methods 8.0.16-SNAPSHOT SKIPPED
[INFO] TomEE :: Examples :: Server Events 8.0.16-SNAPSHOT . SKIPPED
[INFO] TomEE :: Examples :: Serverless Apache TomEE WebProfile 8.0.16-SNAPSHOT SKIPPED
[INFO] TomEE :: Examples :: Serverless Apache TomEE WebProfile 8.0.16-SNAPSHOT SKIPPED
[INFO] TomEE :: Examples :: Serverless Apache TomEE MicroProfile 8.0.16-SNAPSHOT SKIPPED
[INFO] TomEE :: Examples :: Serverless Apache TomEE Plume 8.0.16-SNAPSHOT SKIPPED
[INFO] TomEE :: Examples :: Serverless Apache TomEE Plus 8.0.16-SNAPSHOT SKIPPED
[INFO] TomEE :: Examples ::  Singleton startup ordering 8.0.16-SNAPSHOT SKIPPED
[INFO] TomEE :: Examples :: Simple CDI Interceptor 8.0.16-SNAPSHOT SKIPPED
[INFO] TomEE :: Examples :: Simple EAR 8.0.16-SNAPSHOT .... SUCCESS [  0.008 s]
[INFO] TomEE :: Examples :: Simple EAR :: Business Model 8.0.16-SNAPSHOT SUCCESS [  0.070 s]
[INFO] TomEE :: Examples :: Simple EAR :: Business Logic 8.0.16-SNAPSHOT SKIPPED
[INFO] TomEE :: Examples :: Simple EAR :: Webapp 8.0.16-SNAPSHOT SKIPPED
[INFO] TomEE :: Examples :: Simple EAR :: EAR Packaging 8.0.16-SNAPSHOT SKIPPED
[INFO] TomEE :: Examples :: Simple EAR :: Functional Tests 8.0.16-SNAPSHOT SKIPPED
[INFO] TomEE :: Examples :: Simple CMP2 Entity 8.0.16-SNAPSHOT SKIPPED
[INFO] TomEE :: Examples :: Simple JMS 8.0.16-SNAPSHOT .... SKIPPED
[INFO] TomEE :: Examples :: Simple JMS Context 8.0.16-SNAPSHOT SKIPPED
[INFO] TomEE :: Examples :: Simple MDB With a CDI Injection 8.0.16-SNAPSHOT SKIPPED
[INFO] TomEE :: Examples :: Simple MDB Example 8.0.16-SNAPSHOT SKIPPED
[INFO] TomEE :: Examples :: Simple MDB Using Deployment Descriptor Example 8.0.16-SNAPSHOT SKIPPED
[INFO] TomEE :: Examples :: Simple Remote tomcat-users.xml 8.0.16-SNAPSHOT SKIPPED
[INFO] TomEE :: Examples :: Simple REST 8.0.16-SNAPSHOT ... SKIPPED
[INFO] TomEE :: Examples :: Simple Singleton 8.0.16-SNAPSHOT SKIPPED
[INFO] TomEE :: Examples :: Simple Stateful Pojo 8.0.16-SNAPSHOT SKIPPED
[INFO] TomEE :: Examples :: Simple Stateful Pojo Callbacks 8.0.16-SNAPSHOT SKIPPED
[INFO] TomEE :: Examples :: Simple Stateless Pojo 8.0.16-SNAPSHOT SKIPPED
[INFO] TomEE :: Examples :: Simple Stateless Pojo Callbacks 8.0.16-SNAPSHOT SKIPPED
[INFO] TomEE :: Examples :: Simple Stateless With Deployment Descriptor 8.0.16-SNAPSHOT SKIPPED
[INFO] TomEE :: Examples :: Simple Webservice 8.0.16-SNAPSHOT SKIPPED
[INFO] TomEE :: Examples :: Simple Webservice Without Interface 8.0.16-SNAPSHOT SKIPPED
[INFO] OpenEJB :: Examples :: Async Servlet 8.0.16-SNAPSHOT SKIPPED
[INFO] TomEE :: Examples :: Spring Data 8.0.16-SNAPSHOT ... SKIPPED
[INFO] TomEE :: Examples :: Spring Data Meta 8.0.16-SNAPSHOT SKIPPED
[INFO] TomEE :: Web Examples :: Struts 8.0.16-SNAPSHOT .... SUCCESS [  0.506 s]
[INFO] TomEE :: Examples :: Telephone Stateful Pojo 8.0.16-SNAPSHOT SKIPPED
[INFO] TomEE :: Examples :: TestCase Injection 8.0.16-SNAPSHOT SKIPPED
[INFO] TomEE :: Examples :: Testing Security (Meta) 8.0.16-SNAPSHOT SKIPPED
[INFO] TomEE :: Examples :: Testing Security 8.0.16-SNAPSHOT SKIPPED
[INFO] TomEE :: Examples :: Testing Security 8.0.16-SNAPSHOT SKIPPED
[INFO] TomEE :: Examples :: Testing Security Service Provider 8.0.16-SNAPSHOT SKIPPED
[INFO] TomEE :: Examples :: Testing Security Script Service Provider 8.0.16-SNAPSHOT SKIPPED
[INFO] TomEE :: Examples :: Testing Transactions 8.0.16-SNAPSHOT SKIPPED
[INFO] TomEE :: Examples :: Testing Transactions BMT 8.0.16-SNAPSHOT SKIPPED
[INFO] TomEE :: Examples :: TomEE, Jersey, Eclipselink 8.0.16-SNAPSHOT SKIPPED
[INFO] TomEE :: TomEE :: IBM MQ AMQ Portability Examples :: MDB Example 1.0 SUCCESS [  0.250 s]
[INFO] TomEE :: Examples :: Transaction Rollback 8.0.16-SNAPSHOT SKIPPED
[INFO] TomEE :: Examples :: Troubleshooting 8.0.16-SNAPSHOT SKIPPED
[INFO] TomEE :: Examples :: Webservice Attachments 8.0.16-SNAPSHOT SKIPPED
[INFO] TomEE :: Examples :: Webservice Inheritance 8.0.16-SNAPSHOT SKIPPED
[INFO] TomEE :: Web Examples :: EJB WebService with Security 8.0.16-SNAPSHOT SKIPPED
[INFO] TomEE :: Web Examples :: EJB WebService with SSL Client Certificate 8.0.16-SNAPSHOT SKIPPED
[INFO] TomEE :: Web Examples :: EJB WebService with WS-Security 8.0.16-SNAPSHOT SKIPPED
[INFO] TomEE :: Web Examples :: EJB WebService WS Security with resources.xml 8.0.16-SNAPSHOT SKIPPED
[INFO] TomEE :: Examples :: Web Service Handlers 8.0.16-SNAPSHOT SKIPPED
[INFO] TomEE :: Examples :: @WebService Holder 8.0.16-SNAPSHOT SKIPPED
[INFO] TomEE :: Web Examples :: Moviefun 8.0.16-SNAPSHOT .. SKIPPED
[INFO] TomEE :: Web Examples :: Moviefun Rest 8.0.16-SNAPSHOT SKIPPED
[INFO] TomEE :: Utils :: Provisionning 8.0.16-SNAPSHOT .... SKIPPED
[INFO] TomEE :: Examples :: Resources/JMX Example 8.0.16-SNAPSHOT SUCCESS [  0.054 s]
[INFO] TomEE :: Examples :: Resources/JMX Example :: EJB Module 8.0.16-SNAPSHOT SKIPPED
[INFO] TomEE :: Examples :: Resources/JMX Example :: EAR Module 8.0.16-SNAPSHOT SKIPPED
[INFO] TomEE :: Examples :: WebSocket with tls and basic auth Example 8.0.16-SNAPSHOT SKIPPED
[INFO] TomEE :: Examples :: Concurrency utilities example 8.0.16-SNAPSHOT SKIPPED
[INFO] TomEE :: Examples :: MVC (CXF-based) 8.0.16-SNAPSHOT SKIPPED
[INFO] TomEE :: Examples :: MVC (CXF-based) with Hibernate 8.0.16-SNAPSHOT SKIPPED
[INFO] TomEE :: Examples :: Microprofile REST Client 8.0.16-SNAPSHOT SKIPPED
[INFO] TomEE :: Examples :: MVC (RestEasy-based) 8.0.16-SNAPSHOT SKIPPED
[INFO] TomEE :: Examples :: Custom HealthCheck 8.0.16-SNAPSHOT SKIPPED
[INFO] TomEE :: Examples :: Microprofile JSONB Configuration 8.0.16-SNAPSHOT SKIPPED
[INFO] TomEE :: Examples :: Microprofile JSONB Custom Serializer/Deserializer 8.0.16-SNAPSHOT SKIPPED
[INFO] TomEE :: Examples :: Vaadin LTS V08 8.0.16-SNAPSHOT  SKIPPED
[INFO] TomEE :: Examples :: Vaadin LTS V10 8.0.16-SNAPSHOT  SKIPPED
[INFO] TomEE :: Examples :: Vaadin LATEST 8.0.16-SNAPSHOT . SKIPPED
[INFO] TomEE :: Examples :: Azure deployment example 8.0.16-SNAPSHOT SKIPPED
[INFO] TomEE :: Examples :: Microprofile Fault Tolerance :: Timeout 8.0.16-SNAPSHOT SKIPPED
[INFO] TomEE :: Examples :: XA Datasource configuration and usage 8.0.16-SNAPSHOT SKIPPED
[INFO] TomEE :: Examples :: Websocket JMS 8.0.16-SNAPSHOT . SKIPPED
[INFO] TomEE :: Examples :: Properties Provider 8.0.16-SNAPSHOT SUCCESS [  0.010 s]
[INFO] TomEE :: Examples :: Properties Provider :: Implementation 8.0.16-SNAPSHOT SKIPPED
[INFO] TomEE :: Examples :: Properties Provider :: Sample Webapp 8.0.16-SNAPSHOT SKIPPED
[INFO] TomEE :: Examples :: Jakarta Security tomcat-user.xml Identity Store 8.0.16-SNAPSHOT SKIPPED
[INFO] TomEE :: Examples :: Jakarta Security custom Identity Store 8.0.16-SNAPSHOT SKIPPED
[INFO] TomEE :: Examples 8.0.16-SNAPSHOT .................. SUCCESS [  0.697 s]
[INFO] TomEE :: Assembly :: All In One EJB Lite jar 8.0.16-SNAPSHOT SKIPPED
[INFO] TomEE :: Utils :: TomEE Webapps-based Deployer EJB 8.0.16-SNAPSHOT SKIPPED
[INFO] TomEE :: TCK 8.0.16-SNAPSHOT ....................... SUCCESS [  0.051 s]
[INFO] TomEE :: TCK :: Common 8.0.16-SNAPSHOT ............. SKIPPED
[INFO] TomEE :: TCK :: CDI Embedded 8.0.16-SNAPSHOT ....... SKIPPED
[INFO] TomEE :: TCK :: CDI TomEE 8.0.16-SNAPSHOT .......... SKIPPED
[INFO] TomEE :: TCK :: CDI TCK Signature Tests 8.0.16-SNAPSHOT SUCCESS [  4.593 s]
[INFO] TomEE :: TCK :: Bean Validation Embedded 8.0.16-SNAPSHOT SKIPPED
[INFO] TomEE :: TCK :: Bean Validation TomEE 8.0.16-SNAPSHOT SKIPPED
[INFO] TomEE :: TCK :: Bean Validation TCK Signature tests 8.0.16-SNAPSHOT SKIPPED
[INFO] TomEE :: TCK :: MicroProfile 8.0.16-SNAPSHOT ....... SUCCESS [  0.064 s]
[INFO] TomEE :: TCK :: MicroProfile Config TCK 8.0.16-SNAPSHOT SKIPPED
[INFO] TomEE :: TCK :: MicroProfile JWT TCK 8.0.16-SNAPSHOT SKIPPED
[INFO] TomEE :: TCK :: MicroProfile Fault Tolerance TCK 8.0.16-SNAPSHOT SKIPPED
[INFO] TomEE :: TCK :: MicroProfile Health TCK 8.0.16-SNAPSHOT SKIPPED
[INFO] TomEE :: TCK :: MicroProfile Metrics TCK 8.0.16-SNAPSHOT SKIPPED
[INFO] TomEE :: TCK :: MicroProfile Rest Client TCK 8.0.16-SNAPSHOT SKIPPED
[INFO] TomEE :: TCK :: MicroProfile Open API TCK 8.0.16-SNAPSHOT SKIPPED
[INFO] TomEE :: TCK :: MicroProfile Open Tracing TCK 8.0.16-SNAPSHOT SKIPPED
[INFO] TomEE :: Arquillian Adaptors Parent :: Webapp Remote 8.0.16-SNAPSHOT SKIPPED
[INFO] TomEE :: Arquillian Adaptors Parent :: Tests 8.0.16-SNAPSHOT SKIPPED
[INFO] TomEE :: Arquillian Adaptors Parent :: Tests :: Web Profile 8.0.16-SNAPSHOT SKIPPED
[INFO] TomEE :: Arquillian Adaptors Parent :: Tests :: JAXRS 8.0.16-SNAPSHOT SKIPPED
[INFO] TomEE :: Arquillian Adaptors Parent :: Tests :: JAXWS 8.0.16-SNAPSHOT SKIPPED
[INFO] TomEE :: Arquillian Adaptors Parent :: Tests :: JMS 8.0.16-SNAPSHOT SKIPPED
[INFO] TomEE :: Arquillian Adaptors Parent :: Tests :: CODI 8.0.16-SNAPSHOT SKIPPED
[INFO] TomEE :: Arquillian Adaptors Parent :: Tests :: Configuration Tests 8.0.16-SNAPSHOT SKIPPED
[INFO] TomEE :: Arquillian Adaptors Parent :: Sample :: Moviefun 8.0.16-SNAPSHOT SKIPPED
[INFO] TomEE :: Arquillian Adaptors Parent :: Arquillian TCK 8.0.16-SNAPSHOT SKIPPED
[INFO] TomEE :: Utils :: Log4j2 8.0.16-SNAPSHOT ........... SKIPPED
[INFO] TomEE :: TomEE :: webaccess 8.0.16-SNAPSHOT ........ SKIPPED
[INFO] TomEE :: TomEE :: Overlay Runner 8.0.16-SNAPSHOT ... SKIPPED
[INFO] ------------------------------------------------------------------------
[INFO] BUILD FAILURE
[INFO] ------------------------------------------------------------------------
[INFO] Total time:  33:29 min
[INFO] Finished at: 2023-06-09T15:10:53Z
[INFO] ------------------------------------------------------------------------
[ERROR] Failed to execute goal org.apache.maven.plugins:maven-surefire-plugin:3.0.0-M5:test (default-test) on project openejb-core: There are test failures.
[ERROR] 
[ERROR] Please refer to <https://ci-builds.apache.org/job/Tomee/job/tomee-8.x-build-full-java8/ws/container/openejb-core/target/surefire-reports> for the individual test results.
[ERROR] Please refer to dump files (if any exist) [date].dump, [date]-jvmRun[N].dump and [date].dumpstream.
[ERROR] -> [Help 1]
[ERROR] 
[ERROR] To see the full stack trace of the errors, re-run Maven with the -e switch.
[ERROR] Re-run Maven using the -X switch to enable full debug logging.
[ERROR] 
[ERROR] For more information about the errors and possible solutions, please read the following articles:
[ERROR] [Help 1] http://cwiki.apache.org/confluence/display/MAVEN/MojoFailureException
[ERROR] 
[ERROR] After correcting the problems, you can resume the build with the command
[ERROR]   mvn <args> -rf :openejb-core
Build step 'Invoke top-level Maven targets' marked build as failure
INFO: Processing JUnit
INFO: [JUnit] - 494 test report file(s) were found with the pattern '**/target/surefire-reports/TEST-*.xml' relative to '<https://ci-builds.apache.org/job/Tomee/job/tomee-8.x-build-full-java8/ws/'> for the testing framework 'JUnit'.
INFO: Setting the build status to org.jenkinsci.plugins.xunit.XUnitProcessorResult@19db27ce