You are viewing a plain text version of this content. The canonical link for it is here.
Posted to dev@cloudstack.apache.org by je...@cloudstack.org on 2014/10/15 07:41:28 UTC
Build failed in Jenkins: build-4.5 #21
See <http://jenkins.buildacloud.org/job/build-4.5/21/changes>
Changes:
[talluri] CLOUDSTACK-7693: Fixing pep8 issues
[talluri] CLOUDSTACK-7690: Added missing unittest import to test_escalations_volumes.py
------------------------------------------
[...truncated 1689 lines...]
[INFO]
[INFO] --- maven-remote-resources-plugin:1.3:process (default) @ cloud-usage ---
[INFO]
[INFO] --- maven-resources-plugin:2.5:resources (default-resources) @ cloud-engine-network ---
[debug] execute contextualize
[INFO] Using 'UTF-8' encoding to copy filtered resources.
[INFO] skip non existing resourceDirectory <http://jenkins.buildacloud.org/job/build-4.5/ws/engine/network/resources>
[INFO] Copying 3 resources
[INFO]
[INFO] --- maven-compiler-plugin:2.5.1:compile (default-compile) @ cloud-engine-network ---
[INFO] Compiling 1 source file to <http://jenkins.buildacloud.org/job/build-4.5/ws/engine/network/target/classes>
[INFO] Starting audit...
Audit done.
[INFO]
[INFO] --- maven-remote-resources-plugin:1.3:process (default) @ cloud-engine-orchestration ---
[INFO]
[INFO] --- maven-antrun-plugin:1.7:run (generate-resource) @ cloud-usage ---
[INFO] Executing tasks
main:
[copy] Copying 2 files to <http://jenkins.buildacloud.org/job/build-4.5/ws/usage/target/transformed>
[INFO] Executed tasks
[INFO]
[INFO] --- maven-resources-plugin:2.5:resources (default-resources) @ cloud-usage ---
[debug] execute contextualize
[INFO] Using 'UTF-8' encoding to copy filtered resources.
[INFO] Copying 1 resource
[INFO] Copying 3 resources
[INFO]
[INFO] --- maven-compiler-plugin:2.5.1:compile (default-compile) @ cloud-usage ---
[INFO] Compiling 19 source files to <http://jenkins.buildacloud.org/job/build-4.5/ws/usage/target/classes>
[INFO]
[INFO] --- maven-resources-plugin:2.5:resources (default-resources) @ cloud-engine-orchestration ---
[debug] execute contextualize
[INFO] Using 'UTF-8' encoding to copy filtered resources.
[INFO] Copying 1 resource
[INFO] Copying 3 resources
[INFO]
[INFO] --- maven-compiler-plugin:2.5.1:compile (default-compile) @ cloud-engine-orchestration ---
[INFO] Compiling 68 source files to <http://jenkins.buildacloud.org/job/build-4.5/ws/engine/orchestration/target/classes>
[INFO]
[INFO] --- maven-resources-plugin:2.5:testResources (default-testResources) @ cloud-engine-network ---
[debug] execute contextualize
[INFO] Using 'UTF-8' encoding to copy filtered resources.
[INFO] skip non existing resourceDirectory <http://jenkins.buildacloud.org/job/build-4.5/ws/engine/network/test/resources>
[INFO] Copying 3 resources
[INFO]
[INFO] --- maven-compiler-plugin:2.5.1:testCompile (default-testCompile) @ cloud-engine-network ---
[INFO] No sources to compile
[INFO]
[INFO] --- maven-surefire-plugin:2.12:test (default-test) @ cloud-engine-network ---
[INFO] Surefire report directory: <http://jenkins.buildacloud.org/job/build-4.5/ws/engine/network/target/surefire-reports>
-------------------------------------------------------
T E S T S
-------------------------------------------------------
Results :
Tests run: 0, Failures: 0, Errors: 0, Skipped: 0
[INFO] Starting audit...
Audit done.
[INFO]
[INFO] --- maven-remote-resources-plugin:1.3:process (default) @ cloud-server ---
[INFO]
[INFO] --- maven-resources-plugin:2.5:testResources (default-testResources) @ cloud-usage ---
[debug] execute contextualize
[INFO] Using 'UTF-8' encoding to copy filtered resources.
[INFO] Copying 8 resources
[INFO] Copying 3 resources
[INFO]
[INFO] --- maven-compiler-plugin:2.5.1:testCompile (default-testCompile) @ cloud-usage ---
[INFO] Compiling 4 source files to <http://jenkins.buildacloud.org/job/build-4.5/ws/usage/target/test-classes>
[INFO]
[INFO] --- maven-antrun-plugin:1.7:run (generate-resource) @ cloud-server ---
[INFO] Executing tasks
main:
[copy] Copying 3 files to <http://jenkins.buildacloud.org/job/build-4.5/ws/server/target/conf>
[copy] Copying 1 file to <http://jenkins.buildacloud.org/job/build-4.5/ws/server/target/conf>
[INFO] Executed tasks
[INFO]
[INFO] --- maven-resources-plugin:2.5:resources (default-resources) @ cloud-server ---
[debug] execute contextualize
[INFO] Using 'UTF-8' encoding to copy filtered resources.
[INFO] Copying 30 resources
[INFO] Copying 3 resources
[INFO]
[INFO] --- maven-compiler-plugin:2.5.1:compile (default-compile) @ cloud-server ---
[INFO] Compiling 367 source files to <http://jenkins.buildacloud.org/job/build-4.5/ws/server/target/classes>
[INFO]
[INFO] --- maven-surefire-plugin:2.12:test (default-test) @ cloud-usage ---
[INFO] Surefire report directory: <http://jenkins.buildacloud.org/job/build-4.5/ws/usage/target/surefire-reports>
-------------------------------------------------------
T E S T S
-------------------------------------------------------
[INFO]
[INFO] --- maven-resources-plugin:2.5:testResources (default-testResources) @ cloud-engine-orchestration ---
[debug] execute contextualize
[INFO] Using 'UTF-8' encoding to copy filtered resources.
[INFO] skip non existing resourceDirectory <http://jenkins.buildacloud.org/job/build-4.5/ws/engine/orchestration/test/resources>
[INFO] Copying 3 resources
[INFO]
[INFO] --- maven-compiler-plugin:2.5.1:testCompile (default-testCompile) @ cloud-engine-orchestration ---
[INFO] Compiling 5 source files to <http://jenkins.buildacloud.org/job/build-4.5/ws/engine/orchestration/target/test-classes>
Running com.cloud.usage.UsageSanityCheckerTest
Tests run: 1, Failures: 0, Errors: 0, Skipped: 0, Time elapsed: 4.407 sec
Results :
Tests run: 1, Failures: 0, Errors: 0, Skipped: 0
[INFO]
[INFO] --- maven-surefire-plugin:2.12:test (default-test) @ cloud-engine-orchestration ---
[INFO] Tests are skipped.
[INFO] -------------------------------------------------------------
[ERROR] COMPILATION ERROR :
[INFO] -------------------------------------------------------------
[ERROR] <http://jenkins.buildacloud.org/job/build-4.5/ws/server/src/com/cloud/resource/ResourceManagerImpl.java>:[1649,34] error: variable ssCmd is already defined in method createHostVO(StartupCommand[],ServerResource,Map<String,String>,List<String>,Event)
[ERROR] <http://jenkins.buildacloud.org/job/build-4.5/ws/server/src/com/cloud/resource/ResourceManagerImpl.java>:[1650,25] error: variable implicitHostTags is already defined in method createHostVO(StartupCommand[],ServerResource,Map<String,String>,List<String>,Event)
[INFO] 2 errors
[INFO] -------------------------------------------------------------
[INFO] ------------------------------------------------------------------------
[INFO] Reactor Summary:
[INFO]
[INFO] Apache CloudStack Developer Tools - Checkstyle Configuration SUCCESS [2.374s]
[INFO] Apache CloudStack ................................. SUCCESS [3.086s]
[INFO] Apache CloudStack Maven Conventions Parent ........ SUCCESS [6.432s]
[INFO] Apache CloudStack Framework - Managed Context ..... SUCCESS [13.554s]
[INFO] Apache CloudStack Utils ........................... SUCCESS [40.107s]
[INFO] Apache CloudStack Framework ....................... SUCCESS [0.747s]
[INFO] Apache CloudStack Framework - Event Notification .. SUCCESS [44.970s]
[INFO] Apache CloudStack Framework - Configuration ....... SUCCESS [19.201s]
[INFO] Apache CloudStack API ............................. SUCCESS [1:10.474s]
[INFO] Apache CloudStack Framework - REST ................ SUCCESS [26.250s]
[INFO] Apache CloudStack Framework - IPC ................. SUCCESS [27.989s]
[INFO] Apache CloudStack Cloud Engine .................... SUCCESS [0.769s]
[INFO] Apache CloudStack Cloud Engine API ................ SUCCESS [20.623s]
[INFO] Apache CloudStack Framework - Security ............ SUCCESS [13.287s]
[INFO] Apache CloudStack Core ............................ SUCCESS [1:01.028s]
[INFO] Apache CloudStack Agents .......................... SUCCESS [32.940s]
[INFO] Apache CloudStack Framework - Clustering .......... SUCCESS [15.042s]
[INFO] Apache CloudStack Framework - Event Notification .. SUCCESS [13.904s]
[INFO] Apache CloudStack Cloud Engine Schema Component ... SUCCESS [1:29.421s]
[INFO] Apache CloudStack Framework - Jobs ................ SUCCESS [19.828s]
[INFO] Apache CloudStack Cloud Engine Internal Components API SUCCESS [11.716s]
[INFO] Apache CloudStack Server .......................... FAILURE [1:20.413s]
[INFO] Apache CloudStack Usage Server .................... SUCCESS [44.736s]
[INFO] Apache CloudStack Cloud Engine Orchestration Component SUCCESS [51.632s]
[INFO] Apache CloudStack Cloud Services .................. SUCCESS [0.763s]
[INFO] Apache CloudStack Secondary Storage ............... SUCCESS [24.369s]
[INFO] Apache CloudStack Secondary Storage Service ....... SKIPPED
[INFO] Apache CloudStack Engine Storage Component ........ SKIPPED
[INFO] Apache CloudStack Engine Storage Volume Component . SKIPPED
[INFO] Apache CloudStack Engine Storage Image Component .. SKIPPED
[INFO] Apache CloudStack Engine Storage Data Motion Component SKIPPED
[INFO] Apache CloudStack Engine Storage Cache Component .. SKIPPED
[INFO] Apache CloudStack Engine Storage Snapshot Component SKIPPED
[INFO] Apache CloudStack Cloud Engine API ................ SUCCESS [14.269s]
[INFO] Apache CloudStack Cloud Engine Service ............ SKIPPED
[INFO] Apache CloudStack Plugin POM ...................... SKIPPED
[INFO] Apache CloudStack Plugin - API Rate Limit ......... SKIPPED
[INFO] Apache CloudStack Plugin - Storage Volume default provider SKIPPED
[INFO] Apache CloudStack Plugin - Storage Volume SolidFire Provider SKIPPED
[INFO] Apache CloudStack Plugin - API SolidFire .......... SKIPPED
[INFO] Apache CloudStack Plugin - API Discovery .......... SKIPPED
[INFO] Apache CloudStack Plugin - ACL Static Role Based .. SKIPPED
[INFO] Apache CloudStack Plugin - Host Anti-Affinity Processor SKIPPED
[INFO] Apache CloudStack Plugin - Explicit Dedication Processor SKIPPED
[INFO] Apache CloudStack Plugin - User Concentrated Pod Deployment Planner SKIPPED
[INFO] Apache CloudStack Plugin - User Dispersing Deployment Planner SKIPPED
[INFO] Apache CloudStack Plugin - Implicit Dedication Planner SKIPPED
[INFO] Apache CloudStack Plugin - Skip Heurestics Planner SKIPPED
[INFO] Apache CloudStack Plugin - Host Allocator Random .. SKIPPED
[INFO] Apache CloudStack Plugin - Dedicated Resources .... SKIPPED
[INFO] Apache CloudStack Plugin - Hypervisor OracleVM .... SKIPPED
[INFO] Apache CloudStack Plugin - Open vSwitch ........... SKIPPED
[INFO] Apache CloudStack Plugin - Hypervisor XenServer ... SKIPPED
[INFO] Apache CloudStack Plugin - Hypervisor KVM ......... SKIPPED
[INFO] Apache CloudStack Plugin - RabbitMQ Event Bus ..... SKIPPED
[INFO] Apache CloudStack Plugin - In Memory Event Bus .... SKIPPED
[INFO] Apache CloudStack Plugin - Hypervisor Baremetal ... SKIPPED
[INFO] Apache CloudStack Plugin - Hypervisor UCS ......... SKIPPED
[INFO] Apache CloudStack Plugin - Hypervisor Hyper-V ..... SKIPPED
[INFO] Apache CloudStack Plugin - Network Elastic Load Balancer SKIPPED
[INFO] Apache CloudStack Plugin - Network Internal Load Balancer SKIPPED
[INFO] Apache CloudStack Framework - Spring Life Cycle ... SUCCESS [10.570s]
[INFO] Apache CloudStack Plugin - Network Juniper Contrail SKIPPED
[INFO] Apache CloudStack Plugin - Palo Alto .............. SKIPPED
[INFO] Apache CloudStack Plugin - Network Netscaler ...... SKIPPED
[INFO] Apache CloudStack Plugin - Network Nicira NVP ..... SKIPPED
[INFO] Apache CloudStack Plugin - BigSwitch Virtual Network Segment SKIPPED
[INFO] Apache CloudStack Plugin - Network Brocade VCS .... SKIPPED
[INFO] Apache CloudStack Plugin - Midokura Midonet ....... SKIPPED
[INFO] Apache CloudStack Plugin - Stratosphere SSP ....... SKIPPED
[INFO] Apache CloudStack Plugin - Network Opendaylight ... SKIPPED
[INFO] Apache CloudStack Plugin - Storage Allocator Random SKIPPED
[INFO] Apache CloudStack Plugin - User Authenticator LDAP SKIPPED
[INFO] Apache CloudStack Plugin - User Authenticator MD5 . SKIPPED
[INFO] Apache CloudStack Plugin - User Authenticator Plain Text SKIPPED
[INFO] Apache CloudStack Plugin - User Authenticator SAML2 SKIPPED
[INFO] Apache CloudStack Plugin - User Authenticator SHA256 Salted SKIPPED
[INFO] Apache CloudStack Plugin - Dns Notifier Example ... SKIPPED
[INFO] Apache CloudStack Plugin - Storage Image S3 ....... SKIPPED
[INFO] Apache CloudStack Plugin - Storage Image Swift provider SKIPPED
[INFO] Apache CloudStack Plugin - Storage Image default provider SKIPPED
[INFO] Apache CloudStack Plugin - Storage Image sample provider SKIPPED
[INFO] Apache CloudStack Plugin - Storage Volume Nexenta Provider SKIPPED
[INFO] Apache CloudStack Plugin - Storage Volume CloudByte Provider SKIPPED
[INFO] Apache CloudStack Plugin - Storage Volume sample provider SKIPPED
[INFO] Apache CloudStack Plugin - SNMP Alerts ............ SKIPPED
[INFO] Apache CloudStack Plugin - Syslog Alerts .......... SKIPPED
[INFO] Apache CloudStack Plugin - Network VXLAN .......... SKIPPED
[INFO] Apache CloudStack Plugin - GloboDNS ............... SKIPPED
[INFO] Apache CloudStack Framework - Spring Module ....... SUCCESS [44.648s]
[INFO] Apache CloudStack Secondary Storage Controller .... SKIPPED
[INFO] Apache CloudStack Console Proxy - RDP Client ...... SUCCESS [57.519s]
[INFO] Apache CloudStack Console Proxy ................... SUCCESS [18.628s]
[INFO] Apache CloudStack Console Proxy - Server .......... SUCCESS [35.256s]
[INFO] Apache CloudStack System VM ....................... SKIPPED
[INFO] Apache CloudStack Client UI ....................... SKIPPED
[INFO] Apache CloudStack Framework - QuickCloud .......... SUCCESS [2.803s]
[INFO] Apache CloudStack AWS API Bridge .................. SKIPPED
[INFO] ------------------------------------------------------------------------
[INFO] BUILD FAILURE
[INFO] ------------------------------------------------------------------------
[INFO] Total time: 7:56.533s (Wall Clock)
[INFO] Finished at: Wed Oct 15 01:40:59 EDT 2014
[INFO] Final Memory: 50M/256M
[INFO] ------------------------------------------------------------------------
[ERROR] Failed to execute goal org.apache.maven.plugins:maven-compiler-plugin:2.5.1:compile (default-compile) on project cloud-server: Compilation failure: Compilation failure:
[ERROR] <http://jenkins.buildacloud.org/job/build-4.5/ws/server/src/com/cloud/resource/ResourceManagerImpl.java>:[1649,34] error: variable ssCmd is already defined in method createHostVO(StartupCommand[],ServerResource,Map<String,String>,List<String>,Event)
[ERROR] <http://jenkins.buildacloud.org/job/build-4.5/ws/server/src/com/cloud/resource/ResourceManagerImpl.java>:[1650,25] error: variable implicitHostTags is already defined in method createHostVO(StartupCommand[],ServerResource,Map<String,String>,List<String>,Event)
[ERROR] -> [Help 1]
[ERROR]
[ERROR] To see the full stack trace of the errors, re-run Maven with the -e switch.
[ERROR] Re-run Maven using the -X switch to enable full debug logging.
[ERROR]
[ERROR] For more information about the errors and possible solutions, please read the following articles:
[ERROR] [Help 1] http://cwiki.apache.org/confluence/display/MAVEN/MojoFailureException
[ERROR]
[ERROR] After correcting the problems, you can resume the build with the command
[ERROR] mvn <goals> -rf :cloud-server
Build step 'Invoke top-level Maven targets' marked build as failure
Recording test results
Jenkins build is back to normal : build-4.5 #25
Posted by je...@cloudstack.org.
See <http://jenkins.buildacloud.org/job/build-4.5/25/changes>
Build failed in Jenkins: build-4.5 #24
Posted by je...@cloudstack.org.
See <http://jenkins.buildacloud.org/job/build-4.5/24/changes>
Changes:
[jayapal] CLOUDSTACK-7728: Removed duplicate import
------------------------------------------
[...truncated 1689 lines...]
[INFO]
[INFO] --- maven-remote-resources-plugin:1.3:process (default) @ cloud-usage ---
[INFO]
[INFO] --- maven-resources-plugin:2.5:resources (default-resources) @ cloud-engine-network ---
[debug] execute contextualize
[INFO] Using 'UTF-8' encoding to copy filtered resources.
[INFO] skip non existing resourceDirectory <http://jenkins.buildacloud.org/job/build-4.5/ws/engine/network/resources>
[INFO] Copying 3 resources
[INFO]
[INFO] --- maven-compiler-plugin:2.5.1:compile (default-compile) @ cloud-engine-network ---
[INFO] Compiling 1 source file to <http://jenkins.buildacloud.org/job/build-4.5/ws/engine/network/target/classes>
[INFO] Starting audit...
Audit done.
[INFO]
[INFO] --- maven-remote-resources-plugin:1.3:process (default) @ cloud-engine-orchestration ---
[INFO]
[INFO] --- maven-antrun-plugin:1.7:run (generate-resource) @ cloud-usage ---
[INFO]
[INFO] --- maven-resources-plugin:2.5:resources (default-resources) @ cloud-engine-orchestration ---
[debug] execute contextualize
[INFO] Using 'UTF-8' encoding to copy filtered resources.
[INFO] Copying 1 resource
[INFO] Copying 3 resources
[INFO]
[INFO] --- maven-compiler-plugin:2.5.1:compile (default-compile) @ cloud-engine-orchestration ---
[INFO] Compiling 68 source files to <http://jenkins.buildacloud.org/job/build-4.5/ws/engine/orchestration/target/classes>
[INFO] Executing tasks
main:
[copy] Copying 2 files to <http://jenkins.buildacloud.org/job/build-4.5/ws/usage/target/transformed>
[INFO] Executed tasks
[INFO]
[INFO] --- maven-resources-plugin:2.5:resources (default-resources) @ cloud-usage ---
[debug] execute contextualize
[INFO] Using 'UTF-8' encoding to copy filtered resources.
[INFO] Copying 1 resource
[INFO] Copying 3 resources
[INFO]
[INFO] --- maven-compiler-plugin:2.5.1:compile (default-compile) @ cloud-usage ---
[INFO] Compiling 19 source files to <http://jenkins.buildacloud.org/job/build-4.5/ws/usage/target/classes>
[INFO]
[INFO] --- maven-resources-plugin:2.5:testResources (default-testResources) @ cloud-engine-network ---
[debug] execute contextualize
[INFO] Using 'UTF-8' encoding to copy filtered resources.
[INFO] skip non existing resourceDirectory <http://jenkins.buildacloud.org/job/build-4.5/ws/engine/network/test/resources>
[INFO] Copying 3 resources
[INFO]
[INFO] --- maven-compiler-plugin:2.5.1:testCompile (default-testCompile) @ cloud-engine-network ---
[INFO] No sources to compile
[INFO]
[INFO] --- maven-surefire-plugin:2.12:test (default-test) @ cloud-engine-network ---
[INFO] Surefire report directory: <http://jenkins.buildacloud.org/job/build-4.5/ws/engine/network/target/surefire-reports>
-------------------------------------------------------
T E S T S
-------------------------------------------------------
Results :
Tests run: 0, Failures: 0, Errors: 0, Skipped: 0
[INFO] Starting audit...
Audit done.
[INFO]
[INFO] --- maven-remote-resources-plugin:1.3:process (default) @ cloud-server ---
[INFO]
[INFO] --- maven-resources-plugin:2.5:testResources (default-testResources) @ cloud-usage ---
[debug] execute contextualize
[INFO] Using 'UTF-8' encoding to copy filtered resources.
[INFO] Copying 8 resources
[INFO] Copying 3 resources
[INFO]
[INFO] --- maven-compiler-plugin:2.5.1:testCompile (default-testCompile) @ cloud-usage ---
[INFO] Compiling 4 source files to <http://jenkins.buildacloud.org/job/build-4.5/ws/usage/target/test-classes>
[INFO]
[INFO] --- maven-antrun-plugin:1.7:run (generate-resource) @ cloud-server ---
[INFO] Executing tasks
main:
[copy] Copying 3 files to <http://jenkins.buildacloud.org/job/build-4.5/ws/server/target/conf>
[copy] Copying 1 file to <http://jenkins.buildacloud.org/job/build-4.5/ws/server/target/conf>
[INFO] Executed tasks
[INFO]
[INFO] --- maven-resources-plugin:2.5:resources (default-resources) @ cloud-server ---
[debug] execute contextualize
[INFO] Using 'UTF-8' encoding to copy filtered resources.
[INFO] Copying 30 resources
[INFO] Copying 3 resources
[INFO]
[INFO] --- maven-compiler-plugin:2.5.1:compile (default-compile) @ cloud-server ---
[INFO] Compiling 367 source files to <http://jenkins.buildacloud.org/job/build-4.5/ws/server/target/classes>
[INFO]
[INFO] --- maven-surefire-plugin:2.12:test (default-test) @ cloud-usage ---
[INFO] Surefire report directory: <http://jenkins.buildacloud.org/job/build-4.5/ws/usage/target/surefire-reports>
-------------------------------------------------------
T E S T S
-------------------------------------------------------
Running com.cloud.usage.UsageSanityCheckerTest
[INFO]
[INFO] --- maven-resources-plugin:2.5:testResources (default-testResources) @ cloud-engine-orchestration ---
[debug] execute contextualize
[INFO] Using 'UTF-8' encoding to copy filtered resources.
[INFO] skip non existing resourceDirectory <http://jenkins.buildacloud.org/job/build-4.5/ws/engine/orchestration/test/resources>
[INFO] Copying 3 resources
[INFO]
[INFO] --- maven-compiler-plugin:2.5.1:testCompile (default-testCompile) @ cloud-engine-orchestration ---
[INFO] Compiling 5 source files to <http://jenkins.buildacloud.org/job/build-4.5/ws/engine/orchestration/target/test-classes>
Tests run: 1, Failures: 0, Errors: 0, Skipped: 0, Time elapsed: 5.104 sec
Results :
Tests run: 1, Failures: 0, Errors: 0, Skipped: 0
[INFO]
[INFO] --- maven-surefire-plugin:2.12:test (default-test) @ cloud-engine-orchestration ---
[INFO] Tests are skipped.
[INFO] -------------------------------------------------------------
[ERROR] COMPILATION ERROR :
[INFO] -------------------------------------------------------------
[ERROR] <http://jenkins.buildacloud.org/job/build-4.5/ws/server/src/com/cloud/resource/ResourceManagerImpl.java>:[1649,34] error: variable ssCmd is already defined in method createHostVO(StartupCommand[],ServerResource,Map<String,String>,List<String>,Event)
[ERROR] <http://jenkins.buildacloud.org/job/build-4.5/ws/server/src/com/cloud/resource/ResourceManagerImpl.java>:[1650,25] error: variable implicitHostTags is already defined in method createHostVO(StartupCommand[],ServerResource,Map<String,String>,List<String>,Event)
[INFO] 2 errors
[INFO] -------------------------------------------------------------
[INFO] ------------------------------------------------------------------------
[INFO] Reactor Summary:
[INFO]
[INFO] Apache CloudStack Developer Tools - Checkstyle Configuration SUCCESS [3.387s]
[INFO] Apache CloudStack ................................. SUCCESS [3.961s]
[INFO] Apache CloudStack Maven Conventions Parent ........ SUCCESS [8.588s]
[INFO] Apache CloudStack Framework - Managed Context ..... SUCCESS [17.264s]
[INFO] Apache CloudStack Utils ........................... SUCCESS [53.089s]
[INFO] Apache CloudStack Framework ....................... SUCCESS [0.930s]
[INFO] Apache CloudStack Framework - Event Notification .. SUCCESS [48.340s]
[INFO] Apache CloudStack Framework - Configuration ....... SUCCESS [18.080s]
[INFO] Apache CloudStack API ............................. SUCCESS [1:06.411s]
[INFO] Apache CloudStack Framework - REST ................ SUCCESS [26.518s]
[INFO] Apache CloudStack Framework - IPC ................. SUCCESS [38.250s]
[INFO] Apache CloudStack Cloud Engine .................... SUCCESS [0.897s]
[INFO] Apache CloudStack Cloud Engine API ................ SUCCESS [26.373s]
[INFO] Apache CloudStack Framework - Security ............ SUCCESS [15.677s]
[INFO] Apache CloudStack Core ............................ SUCCESS [1:13.978s]
[INFO] Apache CloudStack Agents .......................... SUCCESS [36.681s]
[INFO] Apache CloudStack Framework - Clustering .......... SUCCESS [20.504s]
[INFO] Apache CloudStack Framework - Event Notification .. SUCCESS [15.733s]
[INFO] Apache CloudStack Cloud Engine Schema Component ... SUCCESS [1:30.968s]
[INFO] Apache CloudStack Framework - Jobs ................ SUCCESS [30.285s]
[INFO] Apache CloudStack Cloud Engine Internal Components API SUCCESS [16.970s]
[INFO] Apache CloudStack Server .......................... FAILURE [1:48.944s]
[INFO] Apache CloudStack Usage Server .................... SUCCESS [56.012s]
[INFO] Apache CloudStack Cloud Engine Orchestration Component SUCCESS [1:08.685s]
[INFO] Apache CloudStack Cloud Services .................. SUCCESS [0.926s]
[INFO] Apache CloudStack Secondary Storage ............... SUCCESS [36.113s]
[INFO] Apache CloudStack Secondary Storage Service ....... SKIPPED
[INFO] Apache CloudStack Engine Storage Component ........ SKIPPED
[INFO] Apache CloudStack Engine Storage Volume Component . SKIPPED
[INFO] Apache CloudStack Engine Storage Image Component .. SKIPPED
[INFO] Apache CloudStack Engine Storage Data Motion Component SKIPPED
[INFO] Apache CloudStack Engine Storage Cache Component .. SKIPPED
[INFO] Apache CloudStack Engine Storage Snapshot Component SKIPPED
[INFO] Apache CloudStack Cloud Engine API ................ SUCCESS [18.389s]
[INFO] Apache CloudStack Cloud Engine Service ............ SKIPPED
[INFO] Apache CloudStack Plugin POM ...................... SKIPPED
[INFO] Apache CloudStack Plugin - API Rate Limit ......... SKIPPED
[INFO] Apache CloudStack Plugin - Storage Volume default provider SKIPPED
[INFO] Apache CloudStack Plugin - Storage Volume SolidFire Provider SKIPPED
[INFO] Apache CloudStack Plugin - API SolidFire .......... SKIPPED
[INFO] Apache CloudStack Plugin - API Discovery .......... SKIPPED
[INFO] Apache CloudStack Plugin - ACL Static Role Based .. SKIPPED
[INFO] Apache CloudStack Plugin - Host Anti-Affinity Processor SKIPPED
[INFO] Apache CloudStack Plugin - Explicit Dedication Processor SKIPPED
[INFO] Apache CloudStack Plugin - User Concentrated Pod Deployment Planner SKIPPED
[INFO] Apache CloudStack Plugin - User Dispersing Deployment Planner SKIPPED
[INFO] Apache CloudStack Plugin - Implicit Dedication Planner SKIPPED
[INFO] Apache CloudStack Plugin - Skip Heurestics Planner SKIPPED
[INFO] Apache CloudStack Plugin - Host Allocator Random .. SKIPPED
[INFO] Apache CloudStack Plugin - Dedicated Resources .... SKIPPED
[INFO] Apache CloudStack Plugin - Hypervisor OracleVM .... SKIPPED
[INFO] Apache CloudStack Plugin - Open vSwitch ........... SKIPPED
[INFO] Apache CloudStack Plugin - Hypervisor XenServer ... SKIPPED
[INFO] Apache CloudStack Plugin - Hypervisor KVM ......... SKIPPED
[INFO] Apache CloudStack Plugin - RabbitMQ Event Bus ..... SKIPPED
[INFO] Apache CloudStack Plugin - In Memory Event Bus .... SKIPPED
[INFO] Apache CloudStack Plugin - Hypervisor Baremetal ... SKIPPED
[INFO] Apache CloudStack Plugin - Hypervisor UCS ......... SKIPPED
[INFO] Apache CloudStack Plugin - Hypervisor Hyper-V ..... SKIPPED
[INFO] Apache CloudStack Plugin - Network Elastic Load Balancer SKIPPED
[INFO] Apache CloudStack Plugin - Network Internal Load Balancer SKIPPED
[INFO] Apache CloudStack Framework - Spring Life Cycle ... SUCCESS [14.537s]
[INFO] Apache CloudStack Plugin - Network Juniper Contrail SKIPPED
[INFO] Apache CloudStack Plugin - Palo Alto .............. SKIPPED
[INFO] Apache CloudStack Plugin - Network Netscaler ...... SKIPPED
[INFO] Apache CloudStack Plugin - Network Nicira NVP ..... SKIPPED
[INFO] Apache CloudStack Plugin - BigSwitch Virtual Network Segment SKIPPED
[INFO] Apache CloudStack Plugin - Network Brocade VCS .... SKIPPED
[INFO] Apache CloudStack Plugin - Midokura Midonet ....... SKIPPED
[INFO] Apache CloudStack Plugin - Stratosphere SSP ....... SKIPPED
[INFO] Apache CloudStack Plugin - Network Opendaylight ... SKIPPED
[INFO] Apache CloudStack Plugin - Storage Allocator Random SKIPPED
[INFO] Apache CloudStack Plugin - User Authenticator LDAP SKIPPED
[INFO] Apache CloudStack Plugin - User Authenticator MD5 . SKIPPED
[INFO] Apache CloudStack Plugin - User Authenticator Plain Text SKIPPED
[INFO] Apache CloudStack Plugin - User Authenticator SAML2 SKIPPED
[INFO] Apache CloudStack Plugin - User Authenticator SHA256 Salted SKIPPED
[INFO] Apache CloudStack Plugin - Dns Notifier Example ... SKIPPED
[INFO] Apache CloudStack Plugin - Storage Image S3 ....... SKIPPED
[INFO] Apache CloudStack Plugin - Storage Image Swift provider SKIPPED
[INFO] Apache CloudStack Plugin - Storage Image default provider SKIPPED
[INFO] Apache CloudStack Plugin - Storage Image sample provider SKIPPED
[INFO] Apache CloudStack Plugin - Storage Volume Nexenta Provider SKIPPED
[INFO] Apache CloudStack Plugin - Storage Volume CloudByte Provider SKIPPED
[INFO] Apache CloudStack Plugin - Storage Volume sample provider SKIPPED
[INFO] Apache CloudStack Plugin - SNMP Alerts ............ SKIPPED
[INFO] Apache CloudStack Plugin - Syslog Alerts .......... SKIPPED
[INFO] Apache CloudStack Plugin - Network VXLAN .......... SKIPPED
[INFO] Apache CloudStack Plugin - GloboDNS ............... SKIPPED
[INFO] Apache CloudStack Framework - Spring Module ....... SUCCESS [47.458s]
[INFO] Apache CloudStack Secondary Storage Controller .... SKIPPED
[INFO] Apache CloudStack Console Proxy - RDP Client ...... SUCCESS [1:23.834s]
[INFO] Apache CloudStack Console Proxy ................... SUCCESS [35.333s]
[INFO] Apache CloudStack Console Proxy - Server .......... SUCCESS [37.744s]
[INFO] Apache CloudStack System VM ....................... SKIPPED
[INFO] Apache CloudStack Client UI ....................... SKIPPED
[INFO] Apache CloudStack Framework - QuickCloud .......... SUCCESS [3.424s]
[INFO] Apache CloudStack AWS API Bridge .................. SKIPPED
[INFO] ------------------------------------------------------------------------
[INFO] BUILD FAILURE
[INFO] ------------------------------------------------------------------------
[INFO] Total time: 9:27.539s (Wall Clock)
[INFO] Finished at: Thu Oct 16 00:52:23 EDT 2014
[INFO] Final Memory: 50M/283M
[INFO] ------------------------------------------------------------------------
[ERROR] Failed to execute goal org.apache.maven.plugins:maven-compiler-plugin:2.5.1:compile (default-compile) on project cloud-server: Compilation failure: Compilation failure:
[ERROR] <http://jenkins.buildacloud.org/job/build-4.5/ws/server/src/com/cloud/resource/ResourceManagerImpl.java>:[1649,34] error: variable ssCmd is already defined in method createHostVO(StartupCommand[],ServerResource,Map<String,String>,List<String>,Event)
[ERROR] <http://jenkins.buildacloud.org/job/build-4.5/ws/server/src/com/cloud/resource/ResourceManagerImpl.java>:[1650,25] error: variable implicitHostTags is already defined in method createHostVO(StartupCommand[],ServerResource,Map<String,String>,List<String>,Event)
[ERROR] -> [Help 1]
[ERROR]
[ERROR] To see the full stack trace of the errors, re-run Maven with the -e switch.
[ERROR] Re-run Maven using the -X switch to enable full debug logging.
[ERROR]
[ERROR] For more information about the errors and possible solutions, please read the following articles:
[ERROR] [Help 1] http://cwiki.apache.org/confluence/display/MAVEN/MojoFailureException
[ERROR]
[ERROR] After correcting the problems, you can resume the build with the command
[ERROR] mvn <goals> -rf :cloud-server
Build step 'Invoke top-level Maven targets' marked build as failure
Recording test results
Build failed in Jenkins: build-4.5 #23
Posted by je...@cloudstack.org.
See <http://jenkins.buildacloud.org/job/build-4.5/23/changes>
Changes:
[jayapal] CLOUDSTACK-7536 user vm can get a gateway ip when gateway ip is a part of the guest ip range.
[jayapal] CLOUDSTACK-7728: Fixed adding icmp rules with different types and codes
[jayapal] CLOUDSTACK-7728: Fixed adding iptables rules for egress allow on VR reboot
------------------------------------------
[...truncated 1650 lines...]
[INFO]
[INFO] ------------------------------------------------------------------------
[INFO] Building Apache CloudStack Cloud Engine API 4.5.0-SNAPSHOT
[INFO] ------------------------------------------------------------------------
[INFO] Building Apache CloudStack Cloud Engine Orchestration Component 4.5.0-SNAPSHOT
[INFO] ------------------------------------------------------------------------
[INFO] ------------------------------------------------------------------------
[INFO]
[INFO] --- maven-clean-plugin:2.5:clean (default-clean) @ cloud-engine-orchestration ---
[INFO]
[INFO] --- maven-clean-plugin:2.5:clean (default-clean) @ cloud-engine-network ---
[INFO]
[INFO] --- maven-clean-plugin:2.5:clean (default-clean) @ cloud-server ---
[INFO] Deleting <http://jenkins.buildacloud.org/job/build-4.5/ws/engine/network/target> (includes = [**/*], excludes = [])
[INFO] Deleting <http://jenkins.buildacloud.org/job/build-4.5/ws/engine/orchestration/target> (includes = [**/*], excludes = [])
[INFO] Deleting <http://jenkins.buildacloud.org/job/build-4.5/ws/server/target> (includes = [**/*], excludes = [])
[INFO]
[INFO] --- maven-clean-plugin:2.5:clean (default-clean) @ cloud-usage ---
[INFO] Deleting <http://jenkins.buildacloud.org/job/build-4.5/ws/usage/target> (includes = [**/*], excludes = [])
[INFO] Deleting <http://jenkins.buildacloud.org/job/build-4.5/ws/engine/network> (includes = [target, dist], excludes = [])
[INFO]
[INFO] --- maven-checkstyle-plugin:2.11:check (cloudstack-checkstyle) @ cloud-engine-network ---
[INFO] Deleting <http://jenkins.buildacloud.org/job/build-4.5/ws/usage> (includes = [target, dist], excludes = [])
[INFO]
[INFO] --- maven-checkstyle-plugin:2.11:check (cloudstack-checkstyle) @ cloud-usage ---
[INFO] Deleting <http://jenkins.buildacloud.org/job/build-4.5/ws/engine/orchestration> (includes = [target, dist], excludes = [])
[INFO]
[INFO] --- maven-checkstyle-plugin:2.11:check (cloudstack-checkstyle) @ cloud-engine-orchestration ---
[INFO] Deleting <http://jenkins.buildacloud.org/job/build-4.5/ws/server> (includes = [target, dist], excludes = [])
[INFO]
[INFO] --- maven-checkstyle-plugin:2.11:check (cloudstack-checkstyle) @ cloud-server ---
[INFO] Starting audit...
Audit done.
[INFO]
[INFO] --- maven-remote-resources-plugin:1.3:process (default) @ cloud-engine-network ---
[INFO] Starting audit...
Audit done.
[INFO]
[INFO] --- maven-remote-resources-plugin:1.3:process (default) @ cloud-usage ---
[INFO]
[INFO] --- maven-resources-plugin:2.5:resources (default-resources) @ cloud-engine-network ---
[debug] execute contextualize
[INFO] Using 'UTF-8' encoding to copy filtered resources.
[INFO] skip non existing resourceDirectory <http://jenkins.buildacloud.org/job/build-4.5/ws/engine/network/resources>
[INFO] Copying 3 resources
[INFO]
[INFO] --- maven-compiler-plugin:2.5.1:compile (default-compile) @ cloud-engine-network ---
[INFO] Compiling 1 source file to <http://jenkins.buildacloud.org/job/build-4.5/ws/engine/network/target/classes>
[INFO]
[INFO] --- maven-antrun-plugin:1.7:run (generate-resource) @ cloud-usage ---
[INFO] Executing tasks
main:
[copy] Copying 2 files to <http://jenkins.buildacloud.org/job/build-4.5/ws/usage/target/transformed>
[INFO] Executed tasks
[INFO]
[INFO] --- maven-resources-plugin:2.5:resources (default-resources) @ cloud-usage ---
[debug] execute contextualize
[INFO] Using 'UTF-8' encoding to copy filtered resources.
[INFO] Copying 1 resource
[INFO] Copying 3 resources
[INFO]
[INFO] --- maven-compiler-plugin:2.5.1:compile (default-compile) @ cloud-usage ---
[INFO] Compiling 19 source files to <http://jenkins.buildacloud.org/job/build-4.5/ws/usage/target/classes>
[INFO] Starting audit...
Audit done.
[INFO]
[INFO] --- maven-remote-resources-plugin:1.3:process (default) @ cloud-engine-orchestration ---
[INFO]
[INFO] --- maven-resources-plugin:2.5:testResources (default-testResources) @ cloud-engine-network ---
[debug] execute contextualize
[INFO] Using 'UTF-8' encoding to copy filtered resources.
[INFO] skip non existing resourceDirectory <http://jenkins.buildacloud.org/job/build-4.5/ws/engine/network/test/resources>
[INFO] Copying 3 resources
[INFO]
[INFO] --- maven-compiler-plugin:2.5.1:testCompile (default-testCompile) @ cloud-engine-network ---
[INFO] No sources to compile
[INFO]
[INFO] --- maven-surefire-plugin:2.12:test (default-test) @ cloud-engine-network ---
[INFO] Surefire report directory: <http://jenkins.buildacloud.org/job/build-4.5/ws/engine/network/target/surefire-reports>
-------------------------------------------------------
T E S T S
-------------------------------------------------------
[INFO]
[INFO] --- maven-resources-plugin:2.5:resources (default-resources) @ cloud-engine-orchestration ---
[debug] execute contextualize
[INFO] Using 'UTF-8' encoding to copy filtered resources.
[INFO] Copying 1 resource
[INFO] Copying 3 resources
[INFO]
[INFO] --- maven-compiler-plugin:2.5.1:compile (default-compile) @ cloud-engine-orchestration ---
[INFO] Compiling 68 source files to <http://jenkins.buildacloud.org/job/build-4.5/ws/engine/orchestration/target/classes>
Results :
Tests run: 0, Failures: 0, Errors: 0, Skipped: 0
[INFO]
[INFO] --- maven-resources-plugin:2.5:testResources (default-testResources) @ cloud-usage ---
[debug] execute contextualize
[INFO] Using 'UTF-8' encoding to copy filtered resources.
[INFO] Copying 8 resources
[INFO] Copying 3 resources
[INFO]
[INFO] --- maven-compiler-plugin:2.5.1:testCompile (default-testCompile) @ cloud-usage ---
[INFO] Compiling 4 source files to <http://jenkins.buildacloud.org/job/build-4.5/ws/usage/target/test-classes>
[INFO] Starting audit...
<http://jenkins.buildacloud.org/job/build-4.5/ws/server/src/com/cloud/network/router/VirtualNetworkApplianceManagerImpl.java>:173:1: Duplicate import to line 166 - com.cloud.network.rules.FirewallRuleVO.
<http://jenkins.buildacloud.org/job/build-4.5/ws/server/src/com/cloud/network/router/VirtualNetworkApplianceManagerImpl.java>:179:1: Duplicate import to line 178 - com.cloud.offerings.NetworkOfferingVO.
Audit done.
[INFO]
[INFO] --- maven-surefire-plugin:2.12:test (default-test) @ cloud-usage ---
[INFO] Surefire report directory: <http://jenkins.buildacloud.org/job/build-4.5/ws/usage/target/surefire-reports>
-------------------------------------------------------
T E S T S
-------------------------------------------------------
Running com.cloud.usage.UsageSanityCheckerTest
[INFO] ------------------------------------------------------------------------
[INFO] Reactor Summary:
[INFO]
[INFO] Apache CloudStack Developer Tools - Checkstyle Configuration SUCCESS [4.589s]
[INFO] Apache CloudStack ................................. SUCCESS [5.020s]
[INFO] Apache CloudStack Maven Conventions Parent ........ SUCCESS [9.712s]
[INFO] Apache CloudStack Framework - Managed Context ..... SUCCESS [16.388s]
[INFO] Apache CloudStack Utils ........................... SUCCESS [1:01.365s]
[INFO] Apache CloudStack Framework ....................... SUCCESS [1.675s]
[INFO] Apache CloudStack Framework - Event Notification .. SUCCESS [49.273s]
[INFO] Apache CloudStack Framework - Configuration ....... SUCCESS [17.577s]
[INFO] Apache CloudStack API ............................. SUCCESS [1:00.434s]
[INFO] Apache CloudStack Framework - REST ................ SUCCESS [24.340s]
[INFO] Apache CloudStack Framework - IPC ................. SUCCESS [24.504s]
[INFO] Apache CloudStack Cloud Engine .................... SUCCESS [1.568s]
[INFO] Apache CloudStack Cloud Engine API ................ SUCCESS [17.861s]
[INFO] Apache CloudStack Framework - Security ............ SUCCESS [10.284s]
[INFO] Apache CloudStack Core ............................ SUCCESS [55.582s]
[INFO] Apache CloudStack Agents .......................... SUCCESS [25.941s]
[INFO] Apache CloudStack Framework - Clustering .......... SUCCESS [15.021s]
[INFO] Apache CloudStack Framework - Event Notification .. SUCCESS [24.466s]
[INFO] Apache CloudStack Cloud Engine Schema Component ... SUCCESS [1:13.562s]
[INFO] Apache CloudStack Framework - Jobs ................ SUCCESS [20.027s]
[INFO] Apache CloudStack Cloud Engine Internal Components API SUCCESS [11.429s]
[INFO] Apache CloudStack Server .......................... FAILURE [28.358s]
[INFO] Apache CloudStack Usage Server .................... SKIPPED
[INFO] Apache CloudStack Cloud Engine Orchestration Component SKIPPED
[INFO] Apache CloudStack Cloud Services .................. SUCCESS [1.454s]
[INFO] Apache CloudStack Secondary Storage ............... SUCCESS [26.737s]
[INFO] Apache CloudStack Secondary Storage Service ....... SKIPPED
[INFO] Apache CloudStack Engine Storage Component ........ SKIPPED
[INFO] Apache CloudStack Engine Storage Volume Component . SKIPPED
[INFO] Apache CloudStack Engine Storage Image Component .. SKIPPED
[INFO] Apache CloudStack Engine Storage Data Motion Component SKIPPED
[INFO] Apache CloudStack Engine Storage Cache Component .. SKIPPED
[INFO] Apache CloudStack Engine Storage Snapshot Component SKIPPED
[INFO] Apache CloudStack Cloud Engine API ................ SUCCESS [10.032s]
[INFO] Apache CloudStack Cloud Engine Service ............ SKIPPED
[INFO] Apache CloudStack Plugin POM ...................... SKIPPED
[INFO] Apache CloudStack Plugin - API Rate Limit ......... SKIPPED
[INFO] Apache CloudStack Plugin - Storage Volume default provider SKIPPED
[INFO] Apache CloudStack Plugin - Storage Volume SolidFire Provider SKIPPED
[INFO] Apache CloudStack Plugin - API SolidFire .......... SKIPPED
[INFO] Apache CloudStack Plugin - API Discovery .......... SKIPPED
[INFO] Apache CloudStack Plugin - ACL Static Role Based .. SKIPPED
[INFO] Apache CloudStack Plugin - Host Anti-Affinity Processor SKIPPED
[INFO] Apache CloudStack Plugin - Explicit Dedication Processor SKIPPED
[INFO] Apache CloudStack Plugin - User Concentrated Pod Deployment Planner SKIPPED
[INFO] Apache CloudStack Plugin - User Dispersing Deployment Planner SKIPPED
[INFO] Apache CloudStack Plugin - Implicit Dedication Planner SKIPPED
[INFO] Apache CloudStack Plugin - Skip Heurestics Planner SKIPPED
[INFO] Apache CloudStack Plugin - Host Allocator Random .. SKIPPED
[INFO] Apache CloudStack Plugin - Dedicated Resources .... SKIPPED
[INFO] Apache CloudStack Plugin - Hypervisor OracleVM .... SKIPPED
[INFO] Apache CloudStack Plugin - Open vSwitch ........... SKIPPED
[INFO] Apache CloudStack Plugin - Hypervisor XenServer ... SKIPPED
[INFO] Apache CloudStack Plugin - Hypervisor KVM ......... SKIPPED
[INFO] Apache CloudStack Plugin - RabbitMQ Event Bus ..... SKIPPED
[INFO] Apache CloudStack Plugin - In Memory Event Bus .... SKIPPED
[INFO] Apache CloudStack Plugin - Hypervisor Baremetal ... SKIPPED
[INFO] Apache CloudStack Plugin - Hypervisor UCS ......... SKIPPED
[INFO] Apache CloudStack Plugin - Hypervisor Hyper-V ..... SKIPPED
[INFO] Apache CloudStack Plugin - Network Elastic Load Balancer SKIPPED
[INFO] Apache CloudStack Plugin - Network Internal Load Balancer SKIPPED
[INFO] Apache CloudStack Framework - Spring Life Cycle ... SUCCESS [12.523s]
[INFO] Apache CloudStack Plugin - Network Juniper Contrail SKIPPED
[INFO] Apache CloudStack Plugin - Palo Alto .............. SKIPPED
[INFO] Apache CloudStack Plugin - Network Netscaler ...... SKIPPED
[INFO] Apache CloudStack Plugin - Network Nicira NVP ..... SKIPPED
[INFO] Apache CloudStack Plugin - BigSwitch Virtual Network Segment SKIPPED
[INFO] Apache CloudStack Plugin - Network Brocade VCS .... SKIPPED
[INFO] Apache CloudStack Plugin - Midokura Midonet ....... SKIPPED
[INFO] Apache CloudStack Plugin - Stratosphere SSP ....... SKIPPED
[INFO] Apache CloudStack Plugin - Network Opendaylight ... SKIPPED
[INFO] Apache CloudStack Plugin - Storage Allocator Random SKIPPED
[INFO] Apache CloudStack Plugin - User Authenticator LDAP SKIPPED
[INFO] Apache CloudStack Plugin - User Authenticator MD5 . SKIPPED
[INFO] Apache CloudStack Plugin - User Authenticator Plain Text SKIPPED
[INFO] Apache CloudStack Plugin - User Authenticator SAML2 SKIPPED
[INFO] Apache CloudStack Plugin - User Authenticator SHA256 Salted SKIPPED
[INFO] Apache CloudStack Plugin - Dns Notifier Example ... SKIPPED
[INFO] Apache CloudStack Plugin - Storage Image S3 ....... SKIPPED
[INFO] Apache CloudStack Plugin - Storage Image Swift provider SKIPPED
[INFO] Apache CloudStack Plugin - Storage Image default provider SKIPPED
[INFO] Apache CloudStack Plugin - Storage Image sample provider SKIPPED
[INFO] Apache CloudStack Plugin - Storage Volume Nexenta Provider SKIPPED
[INFO] Apache CloudStack Plugin - Storage Volume CloudByte Provider SKIPPED
[INFO] Apache CloudStack Plugin - Storage Volume sample provider SKIPPED
[INFO] Apache CloudStack Plugin - SNMP Alerts ............ SKIPPED
[INFO] Apache CloudStack Plugin - Syslog Alerts .......... SKIPPED
[INFO] Apache CloudStack Plugin - Network VXLAN .......... SKIPPED
[INFO] Apache CloudStack Plugin - GloboDNS ............... SKIPPED
[INFO] Apache CloudStack Framework - Spring Module ....... SUCCESS [51.517s]
[INFO] Apache CloudStack Secondary Storage Controller .... SKIPPED
[INFO] Apache CloudStack Console Proxy - RDP Client ...... SUCCESS [1:22.898s]
[INFO] Apache CloudStack Console Proxy ................... SUCCESS [25.757s]
[INFO] Apache CloudStack Console Proxy - Server .......... SUCCESS [39.101s]
[INFO] Apache CloudStack System VM ....................... SKIPPED
[INFO] Apache CloudStack Client UI ....................... SKIPPED
[INFO] Apache CloudStack Framework - QuickCloud .......... SUCCESS [4.635s]
[INFO] Apache CloudStack AWS API Bridge .................. SKIPPED
[INFO] ------------------------------------------------------------------------
[INFO] BUILD FAILURE
[INFO] ------------------------------------------------------------------------
[INFO] Total time: 7:13.549s (Wall Clock)
[INFO] Finished at: Thu Oct 16 00:20:16 EDT 2014
[INFO] Final Memory: 50M/272M
[INFO] ------------------------------------------------------------------------
Tests run: 1, Failures: 0, Errors: 0, Skipped: 0, Time elapsed: 5.747 sec
Results :
Tests run: 1, Failures: 0, Errors: 0, Skipped: 0
[ERROR] Failed to execute goal org.apache.maven.plugins:maven-checkstyle-plugin:2.11:check (cloudstack-checkstyle) on project cloud-server: Failed during checkstyle execution: There are 2 checkstyle errors. -> [Help 1]
[ERROR]
[ERROR] To see the full stack trace of the errors, re-run Maven with the -e switch.
[ERROR] Re-run Maven using the -X switch to enable full debug logging.
[ERROR]
[ERROR] For more information about the errors and possible solutions, please read the following articles:
[ERROR] [Help 1] http://cwiki.apache.org/confluence/display/MAVEN/MojoExecutionException
[ERROR]
[ERROR] After correcting the problems, you can resume the build with the command
[ERROR] mvn <goals> -rf :cloud-server
Build step 'Invoke top-level Maven targets' marked build as failure
Recording test results
Build failed in Jenkins: build-4.5 #22
Posted by je...@cloudstack.org.
See <http://jenkins.buildacloud.org/job/build-4.5/22/changes>
Changes:
[nitin.mehta] CLOUDSTACK-7532: Template status is not shown in UI/API response for non-default account users. Show it if the owner of the template is the caller
------------------------------------------
[...truncated 1689 lines...]
[INFO]
[INFO] --- maven-remote-resources-plugin:1.3:process (default) @ cloud-usage ---
[INFO]
[INFO] --- maven-resources-plugin:2.5:resources (default-resources) @ cloud-engine-network ---
[debug] execute contextualize
[INFO] Using 'UTF-8' encoding to copy filtered resources.
[INFO] skip non existing resourceDirectory <http://jenkins.buildacloud.org/job/build-4.5/ws/engine/network/resources>
[INFO] Copying 3 resources
[INFO]
[INFO] --- maven-compiler-plugin:2.5.1:compile (default-compile) @ cloud-engine-network ---
[INFO] Compiling 1 source file to <http://jenkins.buildacloud.org/job/build-4.5/ws/engine/network/target/classes>
[INFO] Starting audit...
Audit done.
[INFO]
[INFO] --- maven-remote-resources-plugin:1.3:process (default) @ cloud-engine-orchestration ---
[INFO]
[INFO] --- maven-antrun-plugin:1.7:run (generate-resource) @ cloud-usage ---
[INFO] Executing tasks
main:
[copy] Copying 2 files to <http://jenkins.buildacloud.org/job/build-4.5/ws/usage/target/transformed>
[INFO] Executed tasks
[INFO]
[INFO] --- maven-resources-plugin:2.5:resources (default-resources) @ cloud-usage ---
[debug] execute contextualize
[INFO] Using 'UTF-8' encoding to copy filtered resources.
[INFO] Copying 1 resource
[INFO] Copying 3 resources
[INFO]
[INFO] --- maven-compiler-plugin:2.5.1:compile (default-compile) @ cloud-usage ---
[INFO] Compiling 19 source files to <http://jenkins.buildacloud.org/job/build-4.5/ws/usage/target/classes>
[INFO]
[INFO] --- maven-resources-plugin:2.5:resources (default-resources) @ cloud-engine-orchestration ---
[debug] execute contextualize
[INFO] Using 'UTF-8' encoding to copy filtered resources.
[INFO] Copying 1 resource
[INFO] Copying 3 resources
[INFO]
[INFO] --- maven-compiler-plugin:2.5.1:compile (default-compile) @ cloud-engine-orchestration ---
[INFO] Compiling 68 source files to <http://jenkins.buildacloud.org/job/build-4.5/ws/engine/orchestration/target/classes>
[INFO]
[INFO] --- maven-resources-plugin:2.5:testResources (default-testResources) @ cloud-engine-network ---
[debug] execute contextualize
[INFO] Using 'UTF-8' encoding to copy filtered resources.
[INFO] skip non existing resourceDirectory <http://jenkins.buildacloud.org/job/build-4.5/ws/engine/network/test/resources>
[INFO] Copying 3 resources
[INFO]
[INFO] --- maven-compiler-plugin:2.5.1:testCompile (default-testCompile) @ cloud-engine-network ---
[INFO] No sources to compile
[INFO]
[INFO] --- maven-surefire-plugin:2.12:test (default-test) @ cloud-engine-network ---
[INFO] Surefire report directory: <http://jenkins.buildacloud.org/job/build-4.5/ws/engine/network/target/surefire-reports>
-------------------------------------------------------
T E S T S
-------------------------------------------------------
Results :
Tests run: 0, Failures: 0, Errors: 0, Skipped: 0
[INFO] Starting audit...
Audit done.
[INFO]
[INFO] --- maven-remote-resources-plugin:1.3:process (default) @ cloud-server ---
[INFO]
[INFO] --- maven-resources-plugin:2.5:testResources (default-testResources) @ cloud-usage ---
[debug] execute contextualize
[INFO] Using 'UTF-8' encoding to copy filtered resources.
[INFO] Copying 8 resources
[INFO] Copying 3 resources
[INFO]
[INFO] --- maven-compiler-plugin:2.5.1:testCompile (default-testCompile) @ cloud-usage ---
[INFO] Compiling 4 source files to <http://jenkins.buildacloud.org/job/build-4.5/ws/usage/target/test-classes>
[INFO]
[INFO] --- maven-antrun-plugin:1.7:run (generate-resource) @ cloud-server ---
[INFO] Executing tasks
main:
[copy] Copying 3 files to <http://jenkins.buildacloud.org/job/build-4.5/ws/server/target/conf>
[copy] Copying 1 file to <http://jenkins.buildacloud.org/job/build-4.5/ws/server/target/conf>
[INFO] Executed tasks
[INFO]
[INFO] --- maven-resources-plugin:2.5:resources (default-resources) @ cloud-server ---
[debug] execute contextualize
[INFO] Using 'UTF-8' encoding to copy filtered resources.
[INFO] Copying 30 resources
[INFO] Copying 3 resources
[INFO]
[INFO] --- maven-compiler-plugin:2.5.1:compile (default-compile) @ cloud-server ---
[INFO] Compiling 367 source files to <http://jenkins.buildacloud.org/job/build-4.5/ws/server/target/classes>
[INFO]
[INFO] --- maven-surefire-plugin:2.12:test (default-test) @ cloud-usage ---
[INFO] Surefire report directory: <http://jenkins.buildacloud.org/job/build-4.5/ws/usage/target/surefire-reports>
-------------------------------------------------------
T E S T S
-------------------------------------------------------
Running com.cloud.usage.UsageSanityCheckerTest
Tests run: 1, Failures: 0, Errors: 0, Skipped: 0, Time elapsed: 4.6 sec
Results :
Tests run: 1, Failures: 0, Errors: 0, Skipped: 0
[INFO]
[INFO] --- maven-resources-plugin:2.5:testResources (default-testResources) @ cloud-engine-orchestration ---
[debug] execute contextualize
[INFO] Using 'UTF-8' encoding to copy filtered resources.
[INFO] skip non existing resourceDirectory <http://jenkins.buildacloud.org/job/build-4.5/ws/engine/orchestration/test/resources>
[INFO] Copying 3 resources
[INFO]
[INFO] --- maven-compiler-plugin:2.5.1:testCompile (default-testCompile) @ cloud-engine-orchestration ---
[INFO] Compiling 5 source files to <http://jenkins.buildacloud.org/job/build-4.5/ws/engine/orchestration/target/test-classes>
[INFO]
[INFO] --- maven-surefire-plugin:2.12:test (default-test) @ cloud-engine-orchestration ---
[INFO] Tests are skipped.
[INFO] -------------------------------------------------------------
[ERROR] COMPILATION ERROR :
[INFO] -------------------------------------------------------------
[ERROR] <http://jenkins.buildacloud.org/job/build-4.5/ws/server/src/com/cloud/resource/ResourceManagerImpl.java>:[1649,34] error: variable ssCmd is already defined in method createHostVO(StartupCommand[],ServerResource,Map<String,String>,List<String>,Event)
[ERROR] <http://jenkins.buildacloud.org/job/build-4.5/ws/server/src/com/cloud/resource/ResourceManagerImpl.java>:[1650,25] error: variable implicitHostTags is already defined in method createHostVO(StartupCommand[],ServerResource,Map<String,String>,List<String>,Event)
[INFO] 2 errors
[INFO] -------------------------------------------------------------
[INFO] ------------------------------------------------------------------------
[INFO] Reactor Summary:
[INFO]
[INFO] Apache CloudStack Developer Tools - Checkstyle Configuration SUCCESS [4.655s]
[INFO] Apache CloudStack ................................. SUCCESS [4.205s]
[INFO] Apache CloudStack Maven Conventions Parent ........ SUCCESS [10.282s]
[INFO] Apache CloudStack Framework - Managed Context ..... SUCCESS [18.800s]
[INFO] Apache CloudStack Utils ........................... SUCCESS [54.014s]
[INFO] Apache CloudStack Framework ....................... SUCCESS [0.889s]
[INFO] Apache CloudStack Framework - Event Notification .. SUCCESS [46.877s]
[INFO] Apache CloudStack Framework - Configuration ....... SUCCESS [14.707s]
[INFO] Apache CloudStack API ............................. SUCCESS [53.839s]
[INFO] Apache CloudStack Framework - REST ................ SUCCESS [34.026s]
[INFO] Apache CloudStack Framework - IPC ................. SUCCESS [28.211s]
[INFO] Apache CloudStack Cloud Engine .................... SUCCESS [0.925s]
[INFO] Apache CloudStack Cloud Engine API ................ SUCCESS [20.789s]
[INFO] Apache CloudStack Framework - Security ............ SUCCESS [12.294s]
[INFO] Apache CloudStack Core ............................ SUCCESS [59.544s]
[INFO] Apache CloudStack Agents .......................... SUCCESS [30.655s]
[INFO] Apache CloudStack Framework - Clustering .......... SUCCESS [16.995s]
[INFO] Apache CloudStack Framework - Event Notification .. SUCCESS [16.042s]
[INFO] Apache CloudStack Cloud Engine Schema Component ... SUCCESS [1:14.123s]
[INFO] Apache CloudStack Framework - Jobs ................ SUCCESS [25.121s]
[INFO] Apache CloudStack Cloud Engine Internal Components API SUCCESS [12.076s]
[INFO] Apache CloudStack Server .......................... FAILURE [1:20.380s]
[INFO] Apache CloudStack Usage Server .................... SUCCESS [44.195s]
[INFO] Apache CloudStack Cloud Engine Orchestration Component SUCCESS [58.048s]
[INFO] Apache CloudStack Cloud Services .................. SUCCESS [0.911s]
[INFO] Apache CloudStack Secondary Storage ............... SUCCESS [42.152s]
[INFO] Apache CloudStack Secondary Storage Service ....... SKIPPED
[INFO] Apache CloudStack Engine Storage Component ........ SKIPPED
[INFO] Apache CloudStack Engine Storage Volume Component . SKIPPED
[INFO] Apache CloudStack Engine Storage Image Component .. SKIPPED
[INFO] Apache CloudStack Engine Storage Data Motion Component SKIPPED
[INFO] Apache CloudStack Engine Storage Cache Component .. SKIPPED
[INFO] Apache CloudStack Engine Storage Snapshot Component SKIPPED
[INFO] Apache CloudStack Cloud Engine API ................ SUCCESS [16.190s]
[INFO] Apache CloudStack Cloud Engine Service ............ SKIPPED
[INFO] Apache CloudStack Plugin POM ...................... SKIPPED
[INFO] Apache CloudStack Plugin - API Rate Limit ......... SKIPPED
[INFO] Apache CloudStack Plugin - Storage Volume default provider SKIPPED
[INFO] Apache CloudStack Plugin - Storage Volume SolidFire Provider SKIPPED
[INFO] Apache CloudStack Plugin - API SolidFire .......... SKIPPED
[INFO] Apache CloudStack Plugin - API Discovery .......... SKIPPED
[INFO] Apache CloudStack Plugin - ACL Static Role Based .. SKIPPED
[INFO] Apache CloudStack Plugin - Host Anti-Affinity Processor SKIPPED
[INFO] Apache CloudStack Plugin - Explicit Dedication Processor SKIPPED
[INFO] Apache CloudStack Plugin - User Concentrated Pod Deployment Planner SKIPPED
[INFO] Apache CloudStack Plugin - User Dispersing Deployment Planner SKIPPED
[INFO] Apache CloudStack Plugin - Implicit Dedication Planner SKIPPED
[INFO] Apache CloudStack Plugin - Skip Heurestics Planner SKIPPED
[INFO] Apache CloudStack Plugin - Host Allocator Random .. SKIPPED
[INFO] Apache CloudStack Plugin - Dedicated Resources .... SKIPPED
[INFO] Apache CloudStack Plugin - Hypervisor OracleVM .... SKIPPED
[INFO] Apache CloudStack Plugin - Open vSwitch ........... SKIPPED
[INFO] Apache CloudStack Plugin - Hypervisor XenServer ... SKIPPED
[INFO] Apache CloudStack Plugin - Hypervisor KVM ......... SKIPPED
[INFO] Apache CloudStack Plugin - RabbitMQ Event Bus ..... SKIPPED
[INFO] Apache CloudStack Plugin - In Memory Event Bus .... SKIPPED
[INFO] Apache CloudStack Plugin - Hypervisor Baremetal ... SKIPPED
[INFO] Apache CloudStack Plugin - Hypervisor UCS ......... SKIPPED
[INFO] Apache CloudStack Plugin - Hypervisor Hyper-V ..... SKIPPED
[INFO] Apache CloudStack Plugin - Network Elastic Load Balancer SKIPPED
[INFO] Apache CloudStack Plugin - Network Internal Load Balancer SKIPPED
[INFO] Apache CloudStack Framework - Spring Life Cycle ... SUCCESS [11.787s]
[INFO] Apache CloudStack Plugin - Network Juniper Contrail SKIPPED
[INFO] Apache CloudStack Plugin - Palo Alto .............. SKIPPED
[INFO] Apache CloudStack Plugin - Network Netscaler ...... SKIPPED
[INFO] Apache CloudStack Plugin - Network Nicira NVP ..... SKIPPED
[INFO] Apache CloudStack Plugin - BigSwitch Virtual Network Segment SKIPPED
[INFO] Apache CloudStack Plugin - Network Brocade VCS .... SKIPPED
[INFO] Apache CloudStack Plugin - Midokura Midonet ....... SKIPPED
[INFO] Apache CloudStack Plugin - Stratosphere SSP ....... SKIPPED
[INFO] Apache CloudStack Plugin - Network Opendaylight ... SKIPPED
[INFO] Apache CloudStack Plugin - Storage Allocator Random SKIPPED
[INFO] Apache CloudStack Plugin - User Authenticator LDAP SKIPPED
[INFO] Apache CloudStack Plugin - User Authenticator MD5 . SKIPPED
[INFO] Apache CloudStack Plugin - User Authenticator Plain Text SKIPPED
[INFO] Apache CloudStack Plugin - User Authenticator SAML2 SKIPPED
[INFO] Apache CloudStack Plugin - User Authenticator SHA256 Salted SKIPPED
[INFO] Apache CloudStack Plugin - Dns Notifier Example ... SKIPPED
[INFO] Apache CloudStack Plugin - Storage Image S3 ....... SKIPPED
[INFO] Apache CloudStack Plugin - Storage Image Swift provider SKIPPED
[INFO] Apache CloudStack Plugin - Storage Image default provider SKIPPED
[INFO] Apache CloudStack Plugin - Storage Image sample provider SKIPPED
[INFO] Apache CloudStack Plugin - Storage Volume Nexenta Provider SKIPPED
[INFO] Apache CloudStack Plugin - Storage Volume CloudByte Provider SKIPPED
[INFO] Apache CloudStack Plugin - Storage Volume sample provider SKIPPED
[INFO] Apache CloudStack Plugin - SNMP Alerts ............ SKIPPED
[INFO] Apache CloudStack Plugin - Syslog Alerts .......... SKIPPED
[INFO] Apache CloudStack Plugin - Network VXLAN .......... SKIPPED
[INFO] Apache CloudStack Plugin - GloboDNS ............... SKIPPED
[INFO] Apache CloudStack Framework - Spring Module ....... SUCCESS [45.175s]
[INFO] Apache CloudStack Secondary Storage Controller .... SKIPPED
[INFO] Apache CloudStack Console Proxy - RDP Client ...... SUCCESS [1:27.787s]
[INFO] Apache CloudStack Console Proxy ................... SUCCESS [32.513s]
[INFO] Apache CloudStack Console Proxy - Server .......... SUCCESS [35.877s]
[INFO] Apache CloudStack System VM ....................... SKIPPED
[INFO] Apache CloudStack Client UI ....................... SKIPPED
[INFO] Apache CloudStack Framework - QuickCloud .......... SUCCESS [2.667s]
[INFO] Apache CloudStack AWS API Bridge .................. SKIPPED
[INFO] ------------------------------------------------------------------------
[INFO] BUILD FAILURE
[INFO] ------------------------------------------------------------------------
[INFO] Total time: 8:05.240s (Wall Clock)
[INFO] Finished at: Wed Oct 15 17:13:51 EDT 2014
[INFO] Final Memory: 50M/296M
[INFO] ------------------------------------------------------------------------
[ERROR] Failed to execute goal org.apache.maven.plugins:maven-compiler-plugin:2.5.1:compile (default-compile) on project cloud-server: Compilation failure: Compilation failure:
[ERROR] <http://jenkins.buildacloud.org/job/build-4.5/ws/server/src/com/cloud/resource/ResourceManagerImpl.java>:[1649,34] error: variable ssCmd is already defined in method createHostVO(StartupCommand[],ServerResource,Map<String,String>,List<String>,Event)
[ERROR] <http://jenkins.buildacloud.org/job/build-4.5/ws/server/src/com/cloud/resource/ResourceManagerImpl.java>:[1650,25] error: variable implicitHostTags is already defined in method createHostVO(StartupCommand[],ServerResource,Map<String,String>,List<String>,Event)
[ERROR] -> [Help 1]
[ERROR]
[ERROR] To see the full stack trace of the errors, re-run Maven with the -e switch.
[ERROR] Re-run Maven using the -X switch to enable full debug logging.
[ERROR]
[ERROR] For more information about the errors and possible solutions, please read the following articles:
[ERROR] [Help 1] http://cwiki.apache.org/confluence/display/MAVEN/MojoFailureException
[ERROR]
[ERROR] After correcting the problems, you can resume the build with the command
[ERROR] mvn <goals> -rf :cloud-server
Build step 'Invoke top-level Maven targets' marked build as failure
Recording test results