You are viewing a plain text version of this content. The canonical link for it is here.
Posted to yarn-dev@hadoop.apache.org by Apache Jenkins Server <je...@builds.apache.org> on 2015/05/25 20:57:17 UTC

Failed: YARN-3655 PreCommit Build #8072

Jira: https://issues.apache.org/jira/browse/YARN-3655
Build: https://builds.apache.org/job/PreCommit-YARN-Build/8072/

###################################################################################
########################## LAST 60 LINES OF THE CONSOLE ###########################
[...truncated 266 lines...]
|      |                     |            | warnings.
|  -1  |         checkstyle  |  0m 46s    | The applied patch generated 1 new 
|      |                     |            | checkstyle issues (total was 123,
|      |                     |            | now 120).
|  +1  |         whitespace  |  0m 3s     | The patch has no lines that end in 
|      |                     |            | whitespace.
|  +1  |            install  |  1m 33s    | mvn install still works. 
|  +1  |    eclipse:eclipse  |  0m 36s    | The patch built with 
|      |                     |            | eclipse:eclipse.
|  +1  |           findbugs  |  1m 15s    | The patch does not introduce any 
|      |                     |            | new Findbugs (version 3.0.0)
|      |                     |            | warnings.
|  +1  |         yarn tests  |  50m 10s   | Tests passed in 
|      |                     |            | hadoop-yarn-server-resourcemanager.
|      |                     |  86m 31s   | 


|| Subsystem || Report/Notes ||
============================================================================
| Patch URL | http://issues.apache.org/jira/secure/attachment/12735189/YARN-3655.003.patch |
| Optional Tests | javadoc javac unit findbugs checkstyle |
| git revision | trunk / ada233b |
| checkstyle |  /home/jenkins/jenkins-slave/workspace/PreCommit-YARN-Build/patchprocess/diffcheckstylehadoop-yarn-server-resourcemanager.txt |
| hadoop-yarn-server-resourcemanager test log | /home/jenkins/jenkins-slave/workspace/PreCommit-YARN-Build/patchprocess/testrun_hadoop-yarn-server-resourcemanager.txt |
| Test Results | https://builds.apache.org/job/PreCommit-YARN-Build/8072/testReport/ |
| Java | 1.7.0_55 |
| uname | Linux asf905.gq1.ygridcore.net 3.13.0-36-lowlatency #63-Ubuntu SMP PREEMPT Wed Sep 3 21:56:12 UTC 2014 x86_64 x86_64 x86_64 GNU/Linux |


============================================================================
============================================================================
                          Adding comment to JIRA
============================================================================
============================================================================


Comment added.
8edaa33f29fc89fc2b320c8e22e10a1b91fca470 logged out


============================================================================
============================================================================
                              Finished build.
============================================================================
============================================================================


Build step 'Execute shell' marked build as failure
Archiving artifacts
Sending artifact delta relative to PreCommit-YARN-Build #8069
Archived 25 artifacts
Archive block size is 32768
Received 228 blocks and 5604124 bytes
Compression is 57.1%
Took 5.6 sec
[description-setter] Could not determine description.
Recording test results
Email was triggered for: Failure
Sending email for trigger: Failure



###################################################################################
############################## FAILED TESTS (if any) ##############################
All tests passed

Success: YARN-3655 PreCommit Build #8077

Posted by Apache Jenkins Server <je...@builds.apache.org>.
Jira: https://issues.apache.org/jira/browse/YARN-3655
Build: https://builds.apache.org/job/PreCommit-YARN-Build/8077/

###################################################################################
########################## LAST 60 LINES OF THE CONSOLE ###########################
[...truncated 260 lines...]
|      |                     |            | messages.
|  +1  |      release audit  |  0m 22s    | The applied patch does not increase 
|      |                     |            | the total number of release audit
|      |                     |            | warnings.
|  +1  |         checkstyle  |  0m 54s    | There were no new checkstyle 
|      |                     |            | issues.
|  +1  |         whitespace  |  0m 5s     | The patch has no lines that end in 
|      |                     |            | whitespace.
|  +1  |            install  |  1m 34s    | mvn install still works. 
|  +1  |    eclipse:eclipse  |  0m 33s    | The patch built with 
|      |                     |            | eclipse:eclipse.
|  +1  |           findbugs  |  1m 16s    | The patch does not introduce any 
|      |                     |            | new Findbugs (version 3.0.0)
|      |                     |            | warnings.
|  +1  |         yarn tests  |  50m 14s   | Tests passed in 
|      |                     |            | hadoop-yarn-server-resourcemanager.
|      |                     |  86m 38s   | 


|| Subsystem || Report/Notes ||
============================================================================
| Patch URL | http://issues.apache.org/jira/secure/attachment/12735229/YARN-3655.003.patch |
| Optional Tests | javadoc javac unit findbugs checkstyle |
| git revision | trunk / ada233b |
| hadoop-yarn-server-resourcemanager test log | /home/jenkins/jenkins-slave/workspace/PreCommit-YARN-Build/patchprocess/testrun_hadoop-yarn-server-resourcemanager.txt |
| Test Results | https://builds.apache.org/job/PreCommit-YARN-Build/8077/testReport/ |
| Java | 1.7.0_55 |
| uname | Linux asf906.gq1.ygridcore.net 3.13.0-36-lowlatency #63-Ubuntu SMP PREEMPT Wed Sep 3 21:56:12 UTC 2014 x86_64 x86_64 x86_64 GNU/Linux |


============================================================================
============================================================================
                          Adding comment to JIRA
============================================================================
============================================================================


Comment added.
1fa3a2f9792de58f4e1dbd8b51a40b96a21307cf logged out


============================================================================
============================================================================
                              Finished build.
============================================================================
============================================================================


Archiving artifacts
Sending artifact delta relative to PreCommit-YARN-Build #8069
Archived 24 artifacts
Archive block size is 32768
Received 56 blocks and 11254438 bytes
Compression is 14.0%
Took 3.5 sec
Description set: YARN-3655
Recording test results
Email was triggered for: Success
Sending email for trigger: Success



###################################################################################
############################## FAILED TESTS (if any) ##############################
All tests passed

Failed: YARN-2369 PreCommit Build #8076

Posted by Apache Jenkins Server <je...@builds.apache.org>.
Jira: https://issues.apache.org/jira/browse/YARN-2369
Build: https://builds.apache.org/job/PreCommit-YARN-Build/8076/

###################################################################################
########################## LAST 60 LINES OF THE CONSOLE ###########################
[...truncated 343 lines...]
|      |                     |            | eclipse:eclipse.
|  +1  |           findbugs  |  5m 16s    | The patch does not introduce any 
|      |                     |            | new Findbugs (version 3.0.0)
|      |                     |            | warnings.
|  +1  |       common tests  |  23m 19s   | Tests passed in hadoop-common. 
|  +1  |    mapreduce tests  |  0m 46s    | Tests passed in 
|      |                     |            | hadoop-mapreduce-client-common.
|  +1  |    mapreduce tests  |  1m 35s    | Tests passed in 
|      |                     |            | hadoop-mapreduce-client-core.
|  +1  |         yarn tests  |  1m 58s    | Tests passed in hadoop-yarn-common. 
|      |                     |  70m 13s   | 


|| Subsystem || Report/Notes ||
============================================================================
| Patch URL | http://issues.apache.org/jira/secure/attachment/12735218/YARN-2369-5.patch |
| Optional Tests | javadoc javac unit findbugs checkstyle |
| git revision | trunk / ada233b |
| checkstyle |  /home/jenkins/jenkins-slave/workspace/PreCommit-YARN-Build/patchprocess/diffcheckstylehadoop-common.txt /home/jenkins/jenkins-slave/workspace/PreCommit-YARN-Build/patchprocess/diffcheckstylehadoop-mapreduce-client-core.txt /home/jenkins/jenkins-slave/workspace/PreCommit-YARN-Build/patchprocess/diffcheckstylehadoop-yarn-common.txt |
| whitespace | /home/jenkins/jenkins-slave/workspace/PreCommit-YARN-Build/patchprocess/whitespace.txt |
| hadoop-common test log | /home/jenkins/jenkins-slave/workspace/PreCommit-YARN-Build/patchprocess/testrun_hadoop-common.txt |
| hadoop-mapreduce-client-common test log | /home/jenkins/jenkins-slave/workspace/PreCommit-YARN-Build/patchprocess/testrun_hadoop-mapreduce-client-common.txt |
| hadoop-mapreduce-client-core test log | /home/jenkins/jenkins-slave/workspace/PreCommit-YARN-Build/patchprocess/testrun_hadoop-mapreduce-client-core.txt |
| hadoop-yarn-common test log | /home/jenkins/jenkins-slave/workspace/PreCommit-YARN-Build/patchprocess/testrun_hadoop-yarn-common.txt |
| Test Results | https://builds.apache.org/job/PreCommit-YARN-Build/8076/testReport/ |
| Java | 1.7.0_55 |
| uname | Linux asf906.gq1.ygridcore.net 3.13.0-36-lowlatency #63-Ubuntu SMP PREEMPT Wed Sep 3 21:56:12 UTC 2014 x86_64 x86_64 x86_64 GNU/Linux |


============================================================================
============================================================================
                          Adding comment to JIRA
============================================================================
============================================================================


Comment added.
d8dd7cb9df33577af395ecfc3fe2a74619a0380a logged out


============================================================================
============================================================================
                              Finished build.
============================================================================
============================================================================


Build step 'Execute shell' marked build as failure
Archiving artifacts
Sending artifact delta relative to PreCommit-YARN-Build #8069
Archived 54 artifacts
Archive block size is 32768
Received 52 blocks and 28260934 bytes
Compression is 5.7%
Took 7.3 sec
[description-setter] Could not determine description.
Recording test results
Email was triggered for: Failure
Sending email for trigger: Failure



###################################################################################
############################## FAILED TESTS (if any) ##############################
All tests passed

Failed: YARN-2369 PreCommit Build #8075

Posted by Apache Jenkins Server <je...@builds.apache.org>.
Jira: https://issues.apache.org/jira/browse/YARN-2369
Build: https://builds.apache.org/job/PreCommit-YARN-Build/8075/

###################################################################################
########################## LAST 60 LINES OF THE CONSOLE ###########################
[...truncated 338 lines...]
|      |                     |            | eclipse:eclipse.
|  +1  |           findbugs  |  5m 15s    | The patch does not introduce any 
|      |                     |            | new Findbugs (version 3.0.0)
|      |                     |            | warnings.
|  +1  |       common tests  |  23m 22s   | Tests passed in hadoop-common. 
|  +1  |    mapreduce tests  |  0m 45s    | Tests passed in 
|      |                     |            | hadoop-mapreduce-client-common.
|  +1  |    mapreduce tests  |  1m 36s    | Tests passed in 
|      |                     |            | hadoop-mapreduce-client-core.
|  +1  |         yarn tests  |  1m 56s    | Tests passed in hadoop-yarn-common. 
|      |                     |  70m 19s   | 


|| Subsystem || Report/Notes ||
============================================================================
| Patch URL | http://issues.apache.org/jira/secure/attachment/12735207/YARN-2369-4.patch |
| Optional Tests | javadoc javac unit findbugs checkstyle |
| git revision | trunk / ada233b |
| checkstyle |  /home/jenkins/jenkins-slave/workspace/PreCommit-YARN-Build/patchprocess/diffcheckstylehadoop-common.txt /home/jenkins/jenkins-slave/workspace/PreCommit-YARN-Build/patchprocess/diffcheckstylehadoop-mapreduce-client-core.txt /home/jenkins/jenkins-slave/workspace/PreCommit-YARN-Build/patchprocess/diffcheckstylehadoop-yarn-common.txt |
| whitespace | /home/jenkins/jenkins-slave/workspace/PreCommit-YARN-Build/patchprocess/whitespace.txt |
| hadoop-common test log | /home/jenkins/jenkins-slave/workspace/PreCommit-YARN-Build/patchprocess/testrun_hadoop-common.txt |
| hadoop-mapreduce-client-common test log | /home/jenkins/jenkins-slave/workspace/PreCommit-YARN-Build/patchprocess/testrun_hadoop-mapreduce-client-common.txt |
| hadoop-mapreduce-client-core test log | /home/jenkins/jenkins-slave/workspace/PreCommit-YARN-Build/patchprocess/testrun_hadoop-mapreduce-client-core.txt |
| hadoop-yarn-common test log | /home/jenkins/jenkins-slave/workspace/PreCommit-YARN-Build/patchprocess/testrun_hadoop-yarn-common.txt |
| Test Results | https://builds.apache.org/job/PreCommit-YARN-Build/8075/testReport/ |
| Java | 1.7.0_55 |
| uname | Linux asf905.gq1.ygridcore.net 3.13.0-36-lowlatency #63-Ubuntu SMP PREEMPT Wed Sep 3 21:56:12 UTC 2014 x86_64 x86_64 x86_64 GNU/Linux |


============================================================================
============================================================================
                          Adding comment to JIRA
============================================================================
============================================================================


Comment added.
922923e037b9891cbe2f8f3c8d695bacefac7d07 logged out


============================================================================
============================================================================
                              Finished build.
============================================================================
============================================================================


Build step 'Execute shell' marked build as failure
Archiving artifacts
Sending artifact delta relative to PreCommit-YARN-Build #8069
Archived 54 artifacts
Archive block size is 32768
Received 223 blocks and 22643181 bytes
Compression is 24.4%
Took 6.4 sec
[description-setter] Could not determine description.
Recording test results
Email was triggered for: Failure
Sending email for trigger: Failure



###################################################################################
############################## FAILED TESTS (if any) ##############################
All tests passed

Failed: YARN-3581 PreCommit Build #8074

Posted by Apache Jenkins Server <je...@builds.apache.org>.
Jira: https://issues.apache.org/jira/browse/YARN-3581
Build: https://builds.apache.org/job/PreCommit-YARN-Build/8074/

###################################################################################
########################## LAST 60 LINES OF THE CONSOLE ###########################
[...truncated 271 lines...]
|      |                     |            | the total number of release audit
|      |                     |            | warnings.
|  -1  |         checkstyle  |  0m 28s    | The applied patch generated 2 new 
|      |                     |            | checkstyle issues (total was 40, now
|      |                     |            | 42).
|  +1  |         whitespace  |  0m 1s     | The patch has no lines that end in 
|      |                     |            | whitespace.
|  +1  |            install  |  1m 31s    | mvn install still works. 
|  +1  |    eclipse:eclipse  |  0m 38s    | The patch built with 
|      |                     |            | eclipse:eclipse.
|  +1  |           findbugs  |  0m 43s    | The patch does not introduce any 
|      |                     |            | new Findbugs (version 3.0.0)
|      |                     |            | warnings.
|  +1  |         yarn tests  |  6m 53s    | Tests passed in hadoop-yarn-client. 
|      |                     |  42m 15s   | 


|| Subsystem || Report/Notes ||
============================================================================
| Patch URL | http://issues.apache.org/jira/secure/attachment/12735195/YARN-3581.20150525-1.patch |
| Optional Tests | javadoc javac unit findbugs checkstyle |
| git revision | trunk / ada233b |
| checkstyle |  /home/jenkins/jenkins-slave/workspace/PreCommit-YARN-Build/patchprocess/diffcheckstylehadoop-yarn-client.txt |
| hadoop-yarn-client test log | /home/jenkins/jenkins-slave/workspace/PreCommit-YARN-Build/patchprocess/testrun_hadoop-yarn-client.txt |
| Test Results | https://builds.apache.org/job/PreCommit-YARN-Build/8074/testReport/ |
| Java | 1.7.0_55 |
| uname | Linux asf909.gq1.ygridcore.net 3.13.0-36-lowlatency #63-Ubuntu SMP PREEMPT Wed Sep 3 21:56:12 UTC 2014 x86_64 x86_64 x86_64 GNU/Linux |


============================================================================
============================================================================
                          Adding comment to JIRA
============================================================================
============================================================================


Comment added.
365da32eff2e918f76835ea88d32a60573f5a70b logged out


============================================================================
============================================================================
                              Finished build.
============================================================================
============================================================================


Build step 'Execute shell' marked build as failure
Archiving artifacts
Sending artifact delta relative to PreCommit-YARN-Build #8069
Archived 25 artifacts
Archive block size is 32768
Received 59 blocks and 7755142 bytes
Compression is 20.0%
Took 3.2 sec
[description-setter] Could not determine description.
Recording test results
Email was triggered for: Failure
Sending email for trigger: Failure



###################################################################################
############################## FAILED TESTS (if any) ##############################
All tests passed

Failed: YARN-3581 PreCommit Build #8073

Posted by Apache Jenkins Server <je...@builds.apache.org>.
Jira: https://issues.apache.org/jira/browse/YARN-3581
Build: https://builds.apache.org/job/PreCommit-YARN-Build/8073/

###################################################################################
########################## LAST 60 LINES OF THE CONSOLE ###########################
[...truncated 271 lines...]
|      |                     |            | warnings.
|  -1  |         checkstyle  |  0m 30s    | The applied patch generated 1 new 
|      |                     |            | checkstyle issues (total was 37, now
|      |                     |            | 38).
|  +1  |         whitespace  |  0m 0s     | The patch has no lines that end in 
|      |                     |            | whitespace.
|  +1  |            install  |  1m 33s    | mvn install still works. 
|  +1  |    eclipse:eclipse  |  0m 32s    | The patch built with 
|      |                     |            | eclipse:eclipse.
|  +1  |           findbugs  |  0m 44s    | The patch does not introduce any 
|      |                     |            | new Findbugs (version 3.0.0)
|      |                     |            | warnings.
|  +1  |         yarn tests  |  6m 58s    | Tests passed in hadoop-yarn-client. 
|      |                     |  42m 26s   | 


|| Subsystem || Report/Notes ||
============================================================================
| Patch URL | http://issues.apache.org/jira/secure/attachment/12735192/YARN-3581.20150525-1.patch |
| Optional Tests | javadoc javac unit findbugs checkstyle |
| git revision | trunk / ada233b |
| checkstyle |  /home/jenkins/jenkins-slave/workspace/PreCommit-YARN-Build/patchprocess/diffcheckstylehadoop-yarn-client.txt |
| hadoop-yarn-client test log | /home/jenkins/jenkins-slave/workspace/PreCommit-YARN-Build/patchprocess/testrun_hadoop-yarn-client.txt |
| Test Results | https://builds.apache.org/job/PreCommit-YARN-Build/8073/testReport/ |
| Java | 1.7.0_55 |
| uname | Linux asf906.gq1.ygridcore.net 3.13.0-36-lowlatency #63-Ubuntu SMP PREEMPT Wed Sep 3 21:56:12 UTC 2014 x86_64 x86_64 x86_64 GNU/Linux |


============================================================================
============================================================================
                          Adding comment to JIRA
============================================================================
============================================================================


Comment added.
1f6978d100372993849d73ff6f82c25f0602ecf7 logged out


============================================================================
============================================================================
                              Finished build.
============================================================================
============================================================================


Build step 'Execute shell' marked build as failure
Archiving artifacts
Sending artifact delta relative to PreCommit-YARN-Build #8069
Archived 25 artifacts
Archive block size is 32768
Received 58 blocks and 7778767 bytes
Compression is 19.6%
Took 3.1 sec
[description-setter] Could not determine description.
Recording test results
Publish JUnit test result report is waiting for a checkpoint on PreCommit-YARN-Build #8072
Email was triggered for: Failure
Sending email for trigger: Failure



###################################################################################
############################## FAILED TESTS (if any) ##############################
All tests passed