You are viewing a plain text version of this content. The canonical link for it is here.
Posted to commits@beam.apache.org by Apache Jenkins Server <je...@builds.apache.org> on 2018/06/19 18:19:13 UTC

Build failed in Jenkins: beam_PostCommit_Java_Nexmark_Spark #3

See <https://builds.apache.org/job/beam_PostCommit_Java_Nexmark_Spark/3/display/redirect>

------------------------------------------
[...truncated 213.18 KB...]

Configurations:
  Conf  Description
  0000  query:0; exportSummaryToBigQuery:true; streamTimeout:60
  0001  query:1; exportSummaryToBigQuery:true; streamTimeout:60
  0002  query:2; exportSummaryToBigQuery:true; streamTimeout:60
  0003  query:3; exportSummaryToBigQuery:true; streamTimeout:60
  0004  query:4; exportSummaryToBigQuery:true; numEvents:10000; streamTimeout:60
  0005  query:5; exportSummaryToBigQuery:true; streamTimeout:60
  0006  query:6; exportSummaryToBigQuery:true; numEvents:10000; streamTimeout:60
  0007  query:7; exportSummaryToBigQuery:true; streamTimeout:60
  0008  query:8; exportSummaryToBigQuery:true; streamTimeout:60
  0009  query:9; exportSummaryToBigQuery:true; numEvents:10000; streamTimeout:60
  0010  query:10; exportSummaryToBigQuery:true; streamTimeout:60
  0011  query:11; exportSummaryToBigQuery:true; streamTimeout:60
  0012  query:12; exportSummaryToBigQuery:true; streamTimeout:60

Performance:
  Conf  Runtime(sec)    (Baseline)  Events(/sec)    (Baseline)       Results    (Baseline)
  0000           2.5                     39494.5                      100000              
  0001           1.7                     59916.1                       92000              
  0002           1.2                     80128.2                         351              
  0003           3.2                     31655.6                         580              
  0004           1.5                      6775.1                          40              
  0005           2.9                     34843.2                          12              
  0006           1.3                      7524.5                         103              
  0007           3.9                     25673.9                           1              
  0008           3.8                     26560.4                        6000              
  0009           1.6                      6142.5                         298              
  0010  *** not run ***
  0011  *** not run ***
  0012  *** not run ***
==========================================================================================

2018-06-19T18:18:49.221Z Running query:10; exportSummaryToBigQuery:true; streamTimeout:60
2018-06-19T18:18:49.223Z Generating 100000 events in batch mode
2018-06-19T18:18:55.030Z Waiting for main pipeline to 'finish'
2018-06-19T18:18:55.030Z DONE Query10

==========================================================================================
Run started 2018-06-19T18:17:56.790Z and ran for PT58.242S

Default configuration:
{"debug":true,"query":0,"sourceType":"DIRECT","sinkType":"DEVNULL","exportSummaryToBigQuery":false,"pubSubMode":"COMBINED","numEvents":100000,"numEventGenerators":100,"rateShape":"SINE","firstEventRate":10000,"nextEventRate":10000,"rateUnit":"PER_SECOND","ratePeriodSec":600,"preloadSeconds":0,"streamTimeout":240,"isRateLimited":false,"useWallclockEventTime":false,"avgPersonByteSize":200,"avgAuctionByteSize":500,"avgBidByteSize":100,"hotAuctionRatio":2,"hotSellersRatio":4,"hotBiddersRatio":4,"windowSizeSec":10,"windowPeriodSec":5,"watermarkHoldbackSec":0,"numInFlightAuctions":100,"numActivePeople":1000,"coderStrategy":"HAND","cpuDelayMs":0,"diskBusyBytes":0,"auctionSkip":123,"fanout":5,"maxAuctionsWaitingTime":600,"occasionalDelaySec":3,"probDelayedEvent":0.1,"maxLogEvents":100000,"usePubsubPublishTime":false,"outOfOrderGroupSize":1}

Configurations:
  Conf  Description
  0000  query:0; exportSummaryToBigQuery:true; streamTimeout:60
  0001  query:1; exportSummaryToBigQuery:true; streamTimeout:60
  0002  query:2; exportSummaryToBigQuery:true; streamTimeout:60
  0003  query:3; exportSummaryToBigQuery:true; streamTimeout:60
  0004  query:4; exportSummaryToBigQuery:true; numEvents:10000; streamTimeout:60
  0005  query:5; exportSummaryToBigQuery:true; streamTimeout:60
  0006  query:6; exportSummaryToBigQuery:true; numEvents:10000; streamTimeout:60
  0007  query:7; exportSummaryToBigQuery:true; streamTimeout:60
  0008  query:8; exportSummaryToBigQuery:true; streamTimeout:60
  0009  query:9; exportSummaryToBigQuery:true; numEvents:10000; streamTimeout:60
  0010  query:10; exportSummaryToBigQuery:true; streamTimeout:60
  0011  query:11; exportSummaryToBigQuery:true; streamTimeout:60
  0012  query:12; exportSummaryToBigQuery:true; streamTimeout:60

Performance:
  Conf  Runtime(sec)    (Baseline)  Events(/sec)    (Baseline)       Results    (Baseline)
  0000           2.5                     39494.5                      100000              
  0001           1.7                     59916.1                       92000              
  0002           1.2                     80128.2                         351              
  0003           3.2                     31655.6                         580              
  0004           1.5                      6775.1                          40              
  0005           2.9                     34843.2                          12              
  0006           1.3                      7524.5                         103              
  0007           3.9                     25673.9                           1              
  0008           3.8                     26560.4                        6000              
  0009           1.6                      6142.5                         298              
  0010           2.4                     41101.5                           1              
  0011  *** not run ***
  0012  *** not run ***
==========================================================================================

2018-06-19T18:18:55.033Z Running query:11; exportSummaryToBigQuery:true; streamTimeout:60
2018-06-19T18:18:55.034Z Generating 100000 events in batch mode
2018-06-19T18:19:02.219Z Waiting for main pipeline to 'finish'
2018-06-19T18:19:02.219Z DONE Query11

==========================================================================================
Run started 2018-06-19T18:17:56.790Z and ran for PT65.431S

Default configuration:
{"debug":true,"query":0,"sourceType":"DIRECT","sinkType":"DEVNULL","exportSummaryToBigQuery":false,"pubSubMode":"COMBINED","numEvents":100000,"numEventGenerators":100,"rateShape":"SINE","firstEventRate":10000,"nextEventRate":10000,"rateUnit":"PER_SECOND","ratePeriodSec":600,"preloadSeconds":0,"streamTimeout":240,"isRateLimited":false,"useWallclockEventTime":false,"avgPersonByteSize":200,"avgAuctionByteSize":500,"avgBidByteSize":100,"hotAuctionRatio":2,"hotSellersRatio":4,"hotBiddersRatio":4,"windowSizeSec":10,"windowPeriodSec":5,"watermarkHoldbackSec":0,"numInFlightAuctions":100,"numActivePeople":1000,"coderStrategy":"HAND","cpuDelayMs":0,"diskBusyBytes":0,"auctionSkip":123,"fanout":5,"maxAuctionsWaitingTime":600,"occasionalDelaySec":3,"probDelayedEvent":0.1,"maxLogEvents":100000,"usePubsubPublishTime":false,"outOfOrderGroupSize":1}

Configurations:
  Conf  Description
  0000  query:0; exportSummaryToBigQuery:true; streamTimeout:60
  0001  query:1; exportSummaryToBigQuery:true; streamTimeout:60
  0002  query:2; exportSummaryToBigQuery:true; streamTimeout:60
  0003  query:3; exportSummaryToBigQuery:true; streamTimeout:60
  0004  query:4; exportSummaryToBigQuery:true; numEvents:10000; streamTimeout:60
  0005  query:5; exportSummaryToBigQuery:true; streamTimeout:60
  0006  query:6; exportSummaryToBigQuery:true; numEvents:10000; streamTimeout:60
  0007  query:7; exportSummaryToBigQuery:true; streamTimeout:60
  0008  query:8; exportSummaryToBigQuery:true; streamTimeout:60
  0009  query:9; exportSummaryToBigQuery:true; numEvents:10000; streamTimeout:60
  0010  query:10; exportSummaryToBigQuery:true; streamTimeout:60
  0011  query:11; exportSummaryToBigQuery:true; streamTimeout:60
  0012  query:12; exportSummaryToBigQuery:true; streamTimeout:60

Performance:
  Conf  Runtime(sec)    (Baseline)  Events(/sec)    (Baseline)       Results    (Baseline)
  0000           2.5                     39494.5                      100000              
  0001           1.7                     59916.1                       92000              
  0002           1.2                     80128.2                         351              
  0003           3.2                     31655.6                         580              
  0004           1.5                      6775.1                          40              
  0005           2.9                     34843.2                          12              
  0006           1.3                      7524.5                         103              
  0007           3.9                     25673.9                           1              
  0008           3.8                     26560.4                        6000              
  0009           1.6                      6142.5                         298              
  0010           2.4                     41101.5                           1              
  0011           3.5                     28851.7                        1919              
  0012  *** not run ***
==========================================================================================

2018-06-19T18:19:02.222Z Running query:12; exportSummaryToBigQuery:true; streamTimeout:60
2018-06-19T18:19:02.224Z Generating 100000 events in batch mode
2018-06-19T18:19:09.260Z Waiting for main pipeline to 'finish'
2018-06-19T18:19:09.261Z DONE Query12

==========================================================================================
Run started 2018-06-19T18:17:56.790Z and ran for PT72.473S

Default configuration:
{"debug":true,"query":0,"sourceType":"DIRECT","sinkType":"DEVNULL","exportSummaryToBigQuery":false,"pubSubMode":"COMBINED","numEvents":100000,"numEventGenerators":100,"rateShape":"SINE","firstEventRate":10000,"nextEventRate":10000,"rateUnit":"PER_SECOND","ratePeriodSec":600,"preloadSeconds":0,"streamTimeout":240,"isRateLimited":false,"useWallclockEventTime":false,"avgPersonByteSize":200,"avgAuctionByteSize":500,"avgBidByteSize":100,"hotAuctionRatio":2,"hotSellersRatio":4,"hotBiddersRatio":4,"windowSizeSec":10,"windowPeriodSec":5,"watermarkHoldbackSec":0,"numInFlightAuctions":100,"numActivePeople":1000,"coderStrategy":"HAND","cpuDelayMs":0,"diskBusyBytes":0,"auctionSkip":123,"fanout":5,"maxAuctionsWaitingTime":600,"occasionalDelaySec":3,"probDelayedEvent":0.1,"maxLogEvents":100000,"usePubsubPublishTime":false,"outOfOrderGroupSize":1}

Configurations:
  Conf  Description
  0000  query:0; exportSummaryToBigQuery:true; streamTimeout:60
  0001  query:1; exportSummaryToBigQuery:true; streamTimeout:60
  0002  query:2; exportSummaryToBigQuery:true; streamTimeout:60
  0003  query:3; exportSummaryToBigQuery:true; streamTimeout:60
  0004  query:4; exportSummaryToBigQuery:true; numEvents:10000; streamTimeout:60
  0005  query:5; exportSummaryToBigQuery:true; streamTimeout:60
  0006  query:6; exportSummaryToBigQuery:true; numEvents:10000; streamTimeout:60
  0007  query:7; exportSummaryToBigQuery:true; streamTimeout:60
  0008  query:8; exportSummaryToBigQuery:true; streamTimeout:60
  0009  query:9; exportSummaryToBigQuery:true; numEvents:10000; streamTimeout:60
  0010  query:10; exportSummaryToBigQuery:true; streamTimeout:60
  0011  query:11; exportSummaryToBigQuery:true; streamTimeout:60
  0012  query:12; exportSummaryToBigQuery:true; streamTimeout:60

Performance:
  Conf  Runtime(sec)    (Baseline)  Events(/sec)    (Baseline)       Results    (Baseline)
  0000           2.5                     39494.5                      100000              
  0001           1.7                     59916.1                       92000              
  0002           1.2                     80128.2                         351              
  0003           3.2                     31655.6                         580              
  0004           1.5                      6775.1                          40              
  0005           2.9                     34843.2                          12              
  0006           1.3                      7524.5                         103              
  0007           3.9                     25673.9                           1              
  0008           3.8                     26560.4                        6000              
  0009           1.6                      6142.5                         298              
  0010           2.4                     41101.5                           1              
  0011           3.5                     28851.7                        1919              
  0012           2.9                     34293.6                        1919              
==========================================================================================


==========================================================================================
Run started 2018-06-19T18:17:56.790Z and ran for PT72.897S

Default configuration:
{"debug":true,"query":0,"sourceType":"DIRECT","sinkType":"DEVNULL","exportSummaryToBigQuery":false,"pubSubMode":"COMBINED","numEvents":100000,"numEventGenerators":100,"rateShape":"SINE","firstEventRate":10000,"nextEventRate":10000,"rateUnit":"PER_SECOND","ratePeriodSec":600,"preloadSeconds":0,"streamTimeout":240,"isRateLimited":false,"useWallclockEventTime":false,"avgPersonByteSize":200,"avgAuctionByteSize":500,"avgBidByteSize":100,"hotAuctionRatio":2,"hotSellersRatio":4,"hotBiddersRatio":4,"windowSizeSec":10,"windowPeriodSec":5,"watermarkHoldbackSec":0,"numInFlightAuctions":100,"numActivePeople":1000,"coderStrategy":"HAND","cpuDelayMs":0,"diskBusyBytes":0,"auctionSkip":123,"fanout":5,"maxAuctionsWaitingTime":600,"occasionalDelaySec":3,"probDelayedEvent":0.1,"maxLogEvents":100000,"usePubsubPublishTime":false,"outOfOrderGroupSize":1}

Configurations:
  Conf  Description
  0000  query:0; exportSummaryToBigQuery:true; streamTimeout:60
  0001  query:1; exportSummaryToBigQuery:true; streamTimeout:60
Exception in thread "main"   0002  query:2; exportSummaryToBigQuery:true; streamTimeout:60
  0003  query:3; exportSummaryToBigQuery:true; streamTimeout:60
  0004  query:4; exportSummaryToBigQuery:true; numEvents:10000; streamTimeout:60
  0005  query:5; exportSummaryToBigQuery:true; streamTimeout:60
  0006  query:6; exportSummaryToBigQuery:true; numEvents:10000; streamTimeout:60
  0007  query:7; exportSummaryToBigQuery:true; streamTimeout:60
  0008  query:8; exportSummaryToBigQuery:true; streamTimeout:60
java.lang.IllegalArgumentException: BigQueryIO.Write needs a GCS temp location to store temp files.
  0009  query:9; exportSummaryToBigQuery:true; numEvents:10000; streamTimeout:60
  0010  query:10; exportSummaryToBigQuery:true; streamTimeout:60
  0011  query:11; exportSummaryToBigQuery:true; streamTimeout:60
	at com.google.common.base.Preconditions.checkArgument(Preconditions.java:122)
  0012  query:12; exportSummaryToBigQuery:true; streamTimeout:60
	at org.apache.beam.sdk.io.gcp.bigquery.BatchLoads.validate(BatchLoads.java:194)

	at org.apache.beam.sdk.Pipeline$ValidateVisitor.enterCompositeTransform(Pipeline.java:640)
Performance:
	at org.apache.beam.sdk.runners.TransformHierarchy$Node.visit(TransformHierarchy.java:656)
  Conf  Runtime(sec)    (Baseline)  Events(/sec)    (Baseline)       Results    (Baseline)
	at org.apache.beam.sdk.runners.TransformHierarchy$Node.visit(TransformHierarchy.java:660)
  0000           2.5                     39494.5                      100000              
	at org.apache.beam.sdk.runners.TransformHierarchy$Node.visit(TransformHierarchy.java:660)
  0001           1.7                     59916.1                       92000              
	at org.apache.beam.sdk.runners.TransformHierarchy$Node.access$600(TransformHierarchy.java:311)
  0002           1.2                     80128.2                         351              
	at org.apache.beam.sdk.runners.TransformHierarchy.visit(TransformHierarchy.java:245)
	at org.apache.beam.sdk.Pipeline.traverseTopologically(Pipeline.java:458)
  0003           3.2                     31655.6                         580              
	at org.apache.beam.sdk.Pipeline.validate(Pipeline.java:575)
  0004           1.5                      6775.1                          40              
	at org.apache.beam.sdk.Pipeline.run(Pipeline.java:310)
  0005           2.9                     34843.2                          12              
	at org.apache.beam.sdk.Pipeline.run(Pipeline.java:297)
  0006           1.3                      7524.5                         103              
	at org.apache.beam.sdk.nexmark.Main.savePerfsToBigQuery(Main.java:182)
  0007           3.9                     25673.9                           1              
	at org.apache.beam.sdk.nexmark.Main.runAll(Main.java:102)
  0008           3.8                     26560.4                        6000              
	at org.apache.beam.sdk.nexmark.Main.main(Main.java:395)
  0009           1.6                      6142.5                         298              
  0010           2.4                     41101.5                           1              
  0011           3.5                     28851.7                        1919              
  0012           2.9                     34293.6                        1919              
==========================================================================================


> Task :beam-sdks-java-nexmark:run FAILED
:beam-sdks-java-nexmark:run (Thread[Task worker for ':' Thread 3,5,main]) completed. Took 1 mins 16.054 secs.

FAILURE: Build failed with an exception.

* What went wrong:
Execution failed for task ':beam-sdks-java-nexmark:run'.
> Process 'command '/usr/local/asfpackages/java/jdk1.8.0_152/bin/java'' finished with non-zero exit value 1

* Try:
Run with --stacktrace option to get the stack trace. Run with --debug option to get more log output. Run with --scan to get full insights.

* Get more help at https://help.gradle.org

Deprecated Gradle features were used in this build, making it incompatible with Gradle 5.0.
See https://docs.gradle.org/4.8/userguide/command_line_interface.html#sec:command_line_warnings

BUILD FAILED in 4m 51s
61 actionable tasks: 57 executed, 4 from cache

Publishing build scan...
https://gradle.com/s/c4rl5n6o7ezga

Build step 'Invoke Gradle script' changed build result to FAILURE
Build step 'Invoke Gradle script' marked build as failure
Not sending mail to unregistered user jiangkai@gmail.com

Jenkins build is back to normal : beam_PostCommit_Java_Nexmark_Spark #4

Posted by Apache Jenkins Server <je...@builds.apache.org>.
See <https://builds.apache.org/job/beam_PostCommit_Java_Nexmark_Spark/4/display/redirect?page=changes>