You are viewing a plain text version of this content. The canonical link for it is here.
Posted to builds@beam.apache.org by Apache Jenkins Server <je...@builds.apache.org> on 2019/05/07 00:46:39 UTC
Build failed in Jenkins:
beam_PostCommit_Java_ValidatesRunner_PortabilityApi_Dataflow #1271
See <https://builds.apache.org/job/beam_PostCommit_Java_ValidatesRunner_PortabilityApi_Dataflow/1271/display/redirect?page=changes>
Changes:
[mxm] [BEAM-5197] Guard access to test timer service by a lock
[markliu] Fix project path in beam_PerformanceTests_Python35
[relax] Merge pull request #8485: Fixed bug where fieldIdsAccessed order could
------------------------------------------
[...truncated 55.15 KB...]
88476fc5ab03: Layer already exists
8f79a0a593d1: Layer already exists
029592f69d75: Layer already exists
20190503120021: digest: sha256:539b16c6d73e21b17a2845c7102f76efe8df4505ff48a4449bacdfeff694f6ad size: 3262
a9558fdbc929: Preparing
5756a9dff47f: Preparing
42ccdf1e4964: Preparing
66cc44adb860: Preparing
fdca19c25145: Preparing
e9e7988f81dd: Preparing
f7d12d471667: Preparing
f350d0146bb3: Preparing
e38df31d449c: Preparing
af5ae4841776: Preparing
b17cc31e431b: Preparing
12cb127eee44: Preparing
604829a174eb: Preparing
fbb641a8b943: Preparing
e9e7988f81dd: Waiting
f7d12d471667: Waiting
f350d0146bb3: Waiting
b17cc31e431b: Waiting
12cb127eee44: Waiting
e38df31d449c: Waiting
fbb641a8b943: Waiting
604829a174eb: Waiting
fdca19c25145: Layer already exists
66cc44adb860: Layer already exists
f7d12d471667: Layer already exists
f350d0146bb3: Layer already exists
e38df31d449c: Layer already exists
af5ae4841776: Layer already exists
b17cc31e431b: Layer already exists
12cb127eee44: Layer already exists
604829a174eb: Layer already exists
fbb641a8b943: Layer already exists
5756a9dff47f: Layer already exists
a9558fdbc929: Layer already exists
e9e7988f81dd: Layer already exists
42ccdf1e4964: Layer already exists
20190505060022: digest: sha256:b9df5a03d3fbd5c4dc8092c7e06e9533135da2bb4e5cd81ec28a83218d8a2d98 size: 3262
ff0be66e9ad0: Preparing
6570214da7ab: Preparing
513daa83f817: Preparing
a324b6f1f3b6: Preparing
4232feb721cf: Preparing
d4e9f18febfa: Preparing
f7d12d471667: Preparing
f350d0146bb3: Preparing
e38df31d449c: Preparing
af5ae4841776: Preparing
b17cc31e431b: Preparing
12cb127eee44: Preparing
604829a174eb: Preparing
fbb641a8b943: Preparing
f350d0146bb3: Waiting
e38df31d449c: Waiting
b17cc31e431b: Waiting
12cb127eee44: Waiting
604829a174eb: Waiting
fbb641a8b943: Waiting
af5ae4841776: Waiting
d4e9f18febfa: Waiting
f7d12d471667: Waiting
6570214da7ab: Pushed
513daa83f817: Pushed
f7d12d471667: Layer already exists
f350d0146bb3: Layer already exists
e38df31d449c: Layer already exists
af5ae4841776: Layer already exists
b17cc31e431b: Layer already exists
12cb127eee44: Layer already exists
604829a174eb: Layer already exists
fbb641a8b943: Layer already exists
4232feb721cf: Pushed
ff0be66e9ad0: Pushed
d4e9f18febfa: Pushed
a324b6f1f3b6: Pushed
20190506221928: digest: sha256:2b799692c5141c05104cfa6f39b698ffe4435c71d479327121c146238eb71ba6 size: 3262
> Task :beam-runners-google-cloud-dataflow-java:validatesRunnerFnApiWorkerTest
org.apache.beam.sdk.transforms.ParDoTest$StateCoderInferenceTests > testCombiningStateCoderInference FAILED
java.lang.RuntimeException at ParDoTest.java:2369
org.apache.beam.sdk.transforms.WithTimestampsTest > withTimestampsShouldApplyTimestamps FAILED
java.lang.RuntimeException at WithTimestampsTest.java:78
org.apache.beam.sdk.transforms.KeysTest > testKeys FAILED
java.lang.RuntimeException at KeysTest.java:60
org.apache.beam.sdk.transforms.windowing.WindowTest > testTimestampCombinerEndOfWindow FAILED
java.lang.RuntimeException at WindowTest.java:498
org.apache.beam.sdk.transforms.join.CoGroupByKeyTest > testCoGroupByKey FAILED
java.lang.RuntimeException at CoGroupByKeyTest.java:296
org.apache.beam.sdk.transforms.ReshuffleTest > testReshuffleAfterSessionsAndGroupByKey FAILED
java.lang.RuntimeException at ReshuffleTest.java:169
org.apache.beam.sdk.values.PCollectionTupleTest > testComposePCollectionTuple FAILED
java.lang.RuntimeException at PCollectionTupleTest.java:106
org.apache.beam.sdk.transforms.GroupByKeyTest$BasicTests > testLargeKeys1MB FAILED
java.lang.RuntimeException at GroupByKeyTest.java:365
org.apache.beam.sdk.transforms.ParDoTest$MultipleInputsAndOutputTests > testParDoWithOnlyTaggedOutput FAILED
java.lang.RuntimeException at ParDoTest.java:688
org.apache.beam.sdk.transforms.CombineTest$BasicTests > testBinaryCombinePerKeyInstanceMethodReference FAILED
java.lang.RuntimeException at CombineTest.java:953
org.apache.beam.sdk.transforms.ImpulseTest > testImpulse FAILED
java.lang.RuntimeException at ImpulseTest.java:47
org.apache.beam.sdk.transforms.ReifyTimestampsTest > extractFromValuesWhenValueTimestampedLaterSucceeds FAILED
java.lang.RuntimeException at ReifyTimestampsTest.java:128
org.apache.beam.sdk.transforms.KvSwapTest > testKvSwap FAILED
java.lang.RuntimeException at KvSwapTest.java:77
org.apache.beam.sdk.transforms.ViewTest > testMapAsEntrySetSideInput FAILED
java.lang.RuntimeException at ViewTest.java:977
org.apache.beam.sdk.transforms.windowing.WindowingTest > testMergingWindowing FAILED
java.lang.RuntimeException at WindowingTest.java:168
org.apache.beam.sdk.transforms.ParDoTest$StateTests > testCombiningState FAILED
java.lang.RuntimeException at ParDoTest.java:1925
org.apache.beam.sdk.transforms.GroupByKeyTest$WindowTests > testGroupByKeyMergingWindows FAILED
java.lang.RuntimeException at GroupByKeyTest.java:480
org.apache.beam.sdk.transforms.CombineTest$WindowingTests > testGlobalCombineWithDefaultsAndTriggers FAILED
java.lang.RuntimeException at CombineTest.java:1241
org.apache.beam.sdk.transforms.CombineTest$CombineWithContextTests > testSimpleCombineWithContext FAILED
java.lang.RuntimeException at CombineTest.java:997
org.apache.beam.sdk.PipelineTest > testTupleInjectionTransform FAILED
java.lang.RuntimeException at PipelineTest.java:344
org.apache.beam.sdk.transforms.ParDoTest$StateTests > testValueStateSameId FAILED
java.lang.RuntimeException at ParDoTest.java:1671
org.apache.beam.sdk.transforms.ParDoTest$MultipleInputsAndOutputTests > testMultiOutputParDoWithSideInputs FAILED
java.lang.RuntimeException at ParDoTest.java:810
org.apache.beam.sdk.transforms.GroupByKeyTest$WindowTests > testGroupByKeyMultipleWindows FAILED
java.lang.RuntimeException at GroupByKeyTest.java:452
org.apache.beam.sdk.transforms.ParDoTest$BasicTests > testParDo FAILED
java.lang.RuntimeException at ParDoTest.java:347
org.apache.beam.sdk.transforms.FlattenTest > testFlattenIterablesCollections FAILED
java.lang.RuntimeException at FlattenTest.java:297
org.apache.beam.sdk.transforms.CombineTest$CombineWithContextTests > testSimpleCombineWithContextEmpty FAILED
java.lang.RuntimeException at CombineTest.java:1007
org.apache.beam.sdk.transforms.ParDoTest$LifecycleTests > testWindowingInStartAndFinishBundle FAILED
java.lang.RuntimeException at ParDoTest.java:1221
org.apache.beam.sdk.testing.PAssertTest > testAssertionSiteIsCapturedWithMessage FAILED
java.lang.AssertionError at PAssertTest.java:526
org.apache.beam.sdk.transforms.CreateTest > testCreateEmpty FAILED
java.lang.RuntimeException at CreateTest.java:101
org.apache.beam.sdk.transforms.CombineTest$BasicTests > testCombinePerKeyInstanceMethodReference FAILED
java.lang.RuntimeException at CombineTest.java:939
org.apache.beam.sdk.transforms.FlattenTest > testEmptyFlattenAsSideInput FAILED
java.lang.RuntimeException at FlattenTest.java:211
org.apache.beam.sdk.transforms.CombineTest$WindowingTests > testCombineGloballyLambda FAILED
java.lang.RuntimeException at CombineTest.java:1423
org.apache.beam.sdk.transforms.ViewTest > testMultimapSideInput FAILED
java.lang.RuntimeException at ViewTest.java:543
org.apache.beam.sdk.transforms.windowing.WindowingTest > testWindowPreservation FAILED
java.lang.RuntimeException at WindowingTest.java:197
org.apache.beam.sdk.transforms.ReshuffleTest > testReshuffleAfterFixedWindows FAILED
java.lang.RuntimeException at ReshuffleTest.java:231
org.apache.beam.sdk.transforms.KeysTest > testKeysEmpty FAILED
java.lang.RuntimeException at KeysTest.java:73
org.apache.beam.sdk.transforms.ParDoTest$StateTests > testValueStateSimple FAILED
java.lang.RuntimeException at ParDoTest.java:1427
org.apache.beam.sdk.transforms.ParDoTest$BasicTests > testPipelineOptionsParameter FAILED
java.lang.RuntimeException at ParDoTest.java:545
156 tests completed, 38 failed, 2 skipped
> Task :beam-runners-google-cloud-dataflow-java:validatesRunnerFnApiWorkerTest FAILED
> Task :beam-runners-google-cloud-dataflow-java:cleanUpDockerImages
Untagged: us.gcr.io/apache-beam-testing/java-postcommit-it/java:20190506221928
Untagged: us.gcr.io/apache-beam-testing/java-postcommit-it/java@sha256:2b799692c5141c05104cfa6f39b698ffe4435c71d479327121c146238eb71ba6
Deleted: sha256:3b8e88241404a7c62ff87e3c83f2c531e5377ebb2c96a834f51f61ba4be11817
Deleted: sha256:deb6d704d1db31c77bad655a317264d49fba018a4bf1a07580e456652ff50a10
Deleted: sha256:e91da1b51f60528ede9d000d692091c526d552fe2b4c377b08c96d6d037095e8
Deleted: sha256:b10af8b2fb78f87b46060cb99a36b5ca9ac1225a1555d95e4f3777feca9d5f0a
Deleted: sha256:b31f12f1724b5cc5bddfc922aa301107a11f8a232f51e64132ea190b52084cbc
Deleted: sha256:a1ac90dd10c298a7c4da8a3899636e8c6ff7c2ec5aaf856bc4967419c2426473
Deleted: sha256:3401ccbe5bde9a631f5c32d108c07ccafe16964047b77d73440c97653f4e7868
Deleted: sha256:d7ff1b28c1b3b6d54d5cf67b1606df49b406f97de4b22d98f0648d7f1b0fbe00
Deleted: sha256:bf6e0470913a9e81846344a443245f61151c5bea3c0bc8dd903e7f99fd3b5e4b
Deleted: sha256:8a5701fcb8430e4580390fdb09858d6d8b452bc59cb4827043d4efa59988b916
Deleted: sha256:5d4cdaa0fc472c0169b50f7f5afa73a035f3bad0b1572cf3d367a4891aa2a8ad
Deleted: sha256:a6314e65cc9b76d6b7824f2334ccc7fbd144c933623d0fec674ad6f4f4527067
Deleted: sha256:883c8b6ac86698789ef8665c9190b1fbbe6f67d19056a869d582f4a9ffe64470
Deleted: sha256:0e4982d45512635986a8335f9798932fd5e8ac61530b50c77c809589d9136027
Digests:
- us.gcr.io/apache-beam-testing/java-postcommit-it/java@sha256:2b799692c5141c05104cfa6f39b698ffe4435c71d479327121c146238eb71ba6
Associated tags:
- 20190506221928
Tags:
- us.gcr.io/apache-beam-testing/java-postcommit-it/java:20190506221928
Deleted [us.gcr.io/apache-beam-testing/java-postcommit-it/java:20190506221928].
Deleted [us.gcr.io/apache-beam-testing/java-postcommit-it/java@sha256:2b799692c5141c05104cfa6f39b698ffe4435c71d479327121c146238eb71ba6].
FAILURE: Build failed with an exception.
* What went wrong:
Execution failed for task ':beam-runners-google-cloud-dataflow-java:validatesRunnerFnApiWorkerTest'.
> There were failing tests. See the report at: file://<https://builds.apache.org/job/beam_PostCommit_Java_ValidatesRunner_PortabilityApi_Dataflow/ws/src/runners/google-cloud-dataflow-java/build/reports/tests/validatesRunnerFnApiWorkerTest/index.html>
* Try:
Run with --stacktrace option to get the stack trace. Run with --info or --debug option to get more log output. Run with --scan to get full insights.
* Get more help at https://help.gradle.org
Deprecated Gradle features were used in this build, making it incompatible with Gradle 6.0.
Use '--warning-mode all' to show the individual deprecation warnings.
See https://docs.gradle.org/5.2.1/userguide/command_line_interface.html#sec:command_line_warnings
BUILD FAILED in 2h 27m 22s
78 actionable tasks: 58 executed, 19 from cache, 1 up-to-date
Publishing build scan...
https://gradle.com/s/3grd3iukbnk6s
Build step 'Invoke Gradle script' changed build result to FAILURE
Build step 'Invoke Gradle script' marked build as failure
---------------------------------------------------------------------
To unsubscribe, e-mail: builds-unsubscribe@beam.apache.org
For additional commands, e-mail: builds-help@beam.apache.org
Jenkins build is back to normal :
beam_PostCommit_Java_ValidatesRunner_PortabilityApi_Dataflow #1272
Posted by Apache Jenkins Server <je...@builds.apache.org>.
See <https://builds.apache.org/job/beam_PostCommit_Java_ValidatesRunner_PortabilityApi_Dataflow/1272/display/redirect?page=changes>
---------------------------------------------------------------------
To unsubscribe, e-mail: builds-unsubscribe@beam.apache.org
For additional commands, e-mail: builds-help@beam.apache.org