You are viewing a plain text version of this content. The canonical link for it is here.
Posted to builds@beam.apache.org by Apache Jenkins Server <je...@builds.apache.org> on 2019/04/24 16:31:51 UTC

Build failed in Jenkins: beam_PostCommit_Website_Test #5

See <https://builds.apache.org/job/beam_PostCommit_Website_Test/5/display/redirect?page=changes>

Changes:

[daniel.o.programmer] [BEAM-7087] Creating "errors" package internal to Beam Go SDK

[github] Do not use snappy if python-snappy is not installed

[github] fix

[github] fix

[markliu] [BEAM-6908] Support Python3 performance benchmarks - part 2

[ttanay100] [BEAM-5503] Update BigQueryIO time partitioning doc snippet

[bhulette] Add null check to fieldToAvatica

------------------------------------------
Started by GitHub push by aaltay
[EnvInject] - Loading node environment variables.
Building remotely on websites1 (git-websites svn-websites) in workspace <https://builds.apache.org/job/beam_PostCommit_Website_Test/ws/>
No credentials specified
 > git rev-parse --is-inside-work-tree # timeout=10
Fetching changes from the remote Git repository
 > git config remote.origin.url https://github.com/apache/beam.git # timeout=10
Fetching upstream changes from https://github.com/apache/beam.git
 > git --version # timeout=10
 > git fetch --tags --progress https://github.com/apache/beam.git +refs/heads/*:refs/remotes/origin/* +refs/pull/${ghprbPullId}/*:refs/remotes/origin/pr/${ghprbPullId}/*
 > git rev-parse origin/master^{commit} # timeout=10
Checking out Revision de2d929a37950867df1d9069ab70e0ef8953d49f (origin/master)
 > git config core.sparsecheckout # timeout=10
 > git checkout -f de2d929a37950867df1d9069ab70e0ef8953d49f
Commit message: "Merge pull request #8369 from youngoli/beam7087"
 > git rev-list --no-walk dc7b6242a8b7e9a618f2c95bfe7a926e8f681f71 # timeout=10
Cleaning workspace
 > git rev-parse --verify HEAD # timeout=10
Resetting working tree
 > git reset --hard # timeout=10
 > git clean -fdx # timeout=10
No emails were triggered.
[EnvInject] - Executing scripts and injecting environment variables after the SCM step.
[EnvInject] - Injecting as environment variables the properties content 
SPARK_LOCAL_IP=127.0.0.1

[EnvInject] - Variables injected successfully.
[Gradle] - Launching build.
[src] $ <https://builds.apache.org/job/beam_PostCommit_Website_Test/ws/src/gradlew> --continue --max-workers=12 -Dorg.gradle.jvmargs=-Xms2g -Dorg.gradle.jvmargs=-Xmx4g :beam-website:testWebsite -PdisableExternal=false
To honour the JVM settings for this build a new JVM will be forked. Please consider using the daemon: https://docs.gradle.org/5.2.1/userguide/gradle_daemon.html.
Daemon will be stopped at the end of the build stopping after processing
> Task :buildSrc:compileJava NO-SOURCE
> Task :buildSrc:compileGroovy FROM-CACHE
> Task :buildSrc:pluginDescriptors
> Task :buildSrc:processResources
> Task :buildSrc:classes
> Task :buildSrc:jar
> Task :buildSrc:assemble
> Task :buildSrc:spotlessGroovy
> Task :buildSrc:spotlessGroovyCheck
> Task :buildSrc:spotlessGroovyGradle
> Task :buildSrc:spotlessGroovyGradleCheck
> Task :buildSrc:spotlessCheck
> Task :buildSrc:pluginUnderTestMetadata
> Task :buildSrc:compileTestJava NO-SOURCE
> Task :buildSrc:compileTestGroovy NO-SOURCE
> Task :buildSrc:processTestResources NO-SOURCE
> Task :buildSrc:testClasses UP-TO-DATE
> Task :buildSrc:test NO-SOURCE
> Task :buildSrc:validateTaskProperties FROM-CACHE
> Task :buildSrc:check
> Task :buildSrc:build
Configuration on demand is an incubating feature.
> Task :beam-website:setupBuildDir

> Task :beam-website:buildDockerImage
Sending build context to Docker daemon  26.52MB
Step 1/7 : FROM ruby:2.5
 ---> e86557c9a8ab
Step 2/7 : WORKDIR /ruby
 ---> Using cache
 ---> 4e17e2700497
Step 3/7 : RUN gem install bundler
 ---> Using cache
 ---> 51c468b3241a
Step 4/7 : ADD Gemfile Gemfile.lock /ruby/
 ---> Using cache
 ---> aeb13e7f7799
Step 5/7 : RUN bundle install --deployment --path $GEM_HOME
 ---> Using cache
 ---> f1312b3bac64
Step 6/7 : ENV LC_ALL C.UTF-8
 ---> Using cache
 ---> 45b3343297a5
Step 7/7 : CMD sleep 3600
 ---> Using cache
 ---> b1da7b4e5d44
Successfully built b1da7b4e5d44
Successfully tagged beam-website:latest

> Task :beam-website:createDockerContainer

> Task :beam-website:startDockerContainer
0bb7cfa78e4b8d4207adc9ae05a124281fb978faf5355935239e1a0b4b27ae53

> Task :beam-website:setupDockerContainer

> Task :beam-website:buildLocalWebsite
`/` is not writable.
Bundler will use `/tmp/bundler/home/unknown' as your home directory temporarily.
Configuration file: /repo/website/_config.yml
Configuration file: /repo/website/_config_test.yml
Configuration file: /tmp/_config_branch_repo.yml
            Source: /repo/website/src
       Destination: generated-local-content
 Incremental build: enabled
      Generating... 
                    done in 12.354 seconds.
 Auto-regeneration: disabled. Use --watch to enable.

> Task :beam-website:testWebsite
`/` is not writable.
Bundler will use `/tmp/bundler/home/unknown' as your home directory temporarily.
Running ["ScriptCheck", "LinkCheck", "HtmlCheck", "ImageCheck"] on ["./generated-local-content"] on *.html... 


Checking 908 external links...
Ran on 193 files!


- ./generated-local-content/documentation/runners/jstorm/index.html
  *  External link http://jstorm.io/QuickStart/Deploy/index.html failed: got a time out (response code 0)
rake aborted!
HTML-Proofer found 1 failure!
/usr/local/bundle/ruby/2.5.0/gems/html-proofer-3.9.3/lib/html-proofer/runner.rb:167:in `print_failed_tests'
/usr/local/bundle/ruby/2.5.0/gems/html-proofer-3.9.3/lib/html-proofer/runner.rb:48:in `run'
/repo/build/website/Rakefile:23:in `block in <top (required)>'
/usr/local/bundle/ruby/2.5.0/gems/rake-12.3.0/exe/rake:27:in `<top (required)>'
/usr/local/bundle/bin/bundle:23:in `load'
/usr/local/bundle/bin/bundle:23:in `<main>'
Tasks: TOP => test
(See full trace by running task with --trace)

> Task :beam-website:testWebsite FAILED

> Task :beam-website:stopAndRemoveDockerContainer
0bb7cfa78e4b8d4207adc9ae05a124281fb978faf5355935239e1a0b4b27ae53

FAILURE: Build failed with an exception.

* What went wrong:
Execution failed for task ':beam-website:testWebsite'.
> Process 'command 'docker'' finished with non-zero exit value 1

* Try:
Run with --stacktrace option to get the stack trace. Run with --info or --debug option to get more log output. Run with --scan to get full insights.

* Get more help at https://help.gradle.org

Deprecated Gradle features were used in this build, making it incompatible with Gradle 6.0.
Use '--warning-mode all' to show the individual deprecation warnings.
See https://docs.gradle.org/5.2.1/userguide/command_line_interface.html#sec:command_line_warnings

BUILD FAILED in 2m 32s
8 actionable tasks: 8 executed

Publishing build scan...
https://gradle.com/s/cgvzizqqwybog

Build step 'Invoke Gradle script' changed build result to FAILURE
Build step 'Invoke Gradle script' marked build as failure

---------------------------------------------------------------------
To unsubscribe, e-mail: builds-unsubscribe@beam.apache.org
For additional commands, e-mail: builds-help@beam.apache.org


Jenkins build is back to normal : beam_PostCommit_Website_Test #6

Posted by Apache Jenkins Server <je...@builds.apache.org>.
See <https://builds.apache.org/job/beam_PostCommit_Website_Test/6/display/redirect?page=changes>


---------------------------------------------------------------------
To unsubscribe, e-mail: builds-unsubscribe@beam.apache.org
For additional commands, e-mail: builds-help@beam.apache.org