You are viewing a plain text version of this content. The canonical link for it is here.
Posted to dev@activemq.apache.org by Apache Jenkins Server <je...@builds.apache.org> on 2012/09/29 04:58:11 UTC

Build failed in Jenkins: ActiveMQ » ActiveMQ :: Core #1086

See <https://builds.apache.org/job/ActiveMQ/org.apache.activemq$activemq-core/1086/changes>

Changes:

[tabish] Polish the code, remove warnings fix spelling errors in the docs, add some new javadocs, etc.

[gtully] https://issues.apache.org/jira/browse/AMQ-2106 - Allow broker to evenly distribute message groups among consumers - have consumer order take number of assigned groups into account, such that priority is given to the least loaded consumers. When groups change frequently or are suspended this allows better distribution. When new consumer arrive they now have a good chance of getting the next available groups

------------------------------------------
[...truncated 138 lines...]
Tests run: 3, Failures: 0, Errors: 0, Skipped: 0, Time elapsed: 8.814 sec
Running org.apache.activemq.JmsDurableTopicSendReceiveTest
Tests run: 2, Failures: 0, Errors: 0, Skipped: 0, Time elapsed: 3.811 sec
Running org.apache.activemq.JmsDurableTopicTransactionTest
Tests run: 14, Failures: 0, Errors: 0, Skipped: 0, Time elapsed: 20.131 sec
Running org.apache.activemq.JmsDurableTopicWildcardSendReceiveTest
Tests run: 1, Failures: 0, Errors: 0, Skipped: 0, Time elapsed: 1.902 sec
Running org.apache.activemq.JmsQueueBrowserTest
Tests run: 8, Failures: 0, Errors: 0, Skipped: 0, Time elapsed: 9.806 sec
Running org.apache.activemq.JmsQueueCompositeSendReceiveTest
Tests run: 2, Failures: 0, Errors: 0, Skipped: 0, Time elapsed: 2.053 sec
Running org.apache.activemq.JmsQueueRequestReplyTest
Tests run: 2, Failures: 0, Errors: 0, Skipped: 0, Time elapsed: 0.818 sec
Running org.apache.activemq.JmsQueueSelectorTest
Tests run: 3, Failures: 0, Errors: 0, Skipped: 0, Time elapsed: 3.821 sec
Running org.apache.activemq.JmsQueueSendReceiveTest
Tests run: 1, Failures: 0, Errors: 0, Skipped: 0, Time elapsed: 1.754 sec
Running org.apache.activemq.JmsQueueSendReceiveTwoConnectionsStartBeforeBrokerTest
Tests run: 1, Failures: 0, Errors: 0, Skipped: 0, Time elapsed: 3.452 sec
Running org.apache.activemq.JmsQueueSendReceiveTwoConnectionsTest
Tests run: 1, Failures: 0, Errors: 0, Skipped: 0, Time elapsed: 1.724 sec
Running org.apache.activemq.JmsQueueSendReceiveUsingTwoSessionsTest
Tests run: 1, Failures: 0, Errors: 0, Skipped: 0, Time elapsed: 1.746 sec
Running org.apache.activemq.JmsQueueTopicCompositeSendReceiveTest
Tests run: 1, Failures: 0, Errors: 0, Skipped: 0, Time elapsed: 1.873 sec
Running org.apache.activemq.JmsQueueTransactionTest
Tests run: 17, Failures: 0, Errors: 0, Skipped: 0, Time elapsed: 22.349 sec
Running org.apache.activemq.JmsQueueWildcardSendReceiveTest
Tests run: 4, Failures: 0, Errors: 0, Skipped: 0, Time elapsed: 1.949 sec
Running org.apache.activemq.JmsRedeliveredTest
Tests run: 18, Failures: 0, Errors: 0, Skipped: 0, Time elapsed: 14.519 sec
Running org.apache.activemq.JmsRollbackRedeliveryTest
Tests run: 9, Failures: 0, Errors: 0, Skipped: 0, Time elapsed: 11.901 sec
Running org.apache.activemq.JmsSendReceiveWithMessageExpirationTest
Tests run: 5, Failures: 0, Errors: 0, Skipped: 0, Time elapsed: 18.171 sec
Running org.apache.activemq.JmsSendWithAsyncCallbackTest
Tests run: 1, Failures: 0, Errors: 0, Skipped: 0, Time elapsed: 3.093 sec
Running org.apache.activemq.JmsSessionRecoverTest
Tests run: 6, Failures: 0, Errors: 0, Skipped: 0, Time elapsed: 6.949 sec
Running org.apache.activemq.JmsTempDestinationTest
Tests run: 8, Failures: 0, Errors: 0, Skipped: 0, Time elapsed: 39.252 sec
Running org.apache.activemq.JmsTopicCompositeSendReceiveTest
Tests run: 1, Failures: 0, Errors: 0, Skipped: 0, Time elapsed: 1.727 sec
Running org.apache.activemq.JmsTopicRedeliverTest
Tests run: 1, Failures: 0, Errors: 0, Skipped: 0, Time elapsed: 1.641 sec
Running org.apache.activemq.JmsTopicRequestReplyTest
Tests run: 2, Failures: 0, Errors: 0, Skipped: 0, Time elapsed: 0.811 sec
Running org.apache.activemq.JmsTopicSelectorTest
Tests run: 3, Failures: 0, Errors: 0, Skipped: 0, Time elapsed: 8.796 sec
Running org.apache.activemq.JmsTopicSendReceiveSubscriberTest
Tests run: 1, Failures: 0, Errors: 0, Skipped: 0, Time elapsed: 0.697 sec
Running org.apache.activemq.JmsTopicSendReceiveTest
Tests run: 1, Failures: 0, Errors: 0, Skipped: 0, Time elapsed: 0.715 sec
Running org.apache.activemq.JmsTopicSendReceiveWithTwoConnectionsTest
Tests run: 1, Failures: 0, Errors: 0, Skipped: 0, Time elapsed: 0.729 sec
Running org.apache.activemq.JmsTopicSendReceiveWithTwoConnectionsWithJMXTest
Tests run: 1, Failures: 0, Errors: 0, Skipped: 0, Time elapsed: 0.712 sec
Running org.apache.activemq.JmsTopicSendSameMessageTest
Tests run: 1, Failures: 0, Errors: 0, Skipped: 0, Time elapsed: 0.728 sec
Running org.apache.activemq.JmsTopicTransactionTest
Tests run: 14, Failures: 0, Errors: 0, Skipped: 0, Time elapsed: 20.09 sec
Running org.apache.activemq.JmsTopicWildcardSendReceiveTest
Tests run: 4, Failures: 0, Errors: 0, Skipped: 0, Time elapsed: 1.951 sec
Running org.apache.activemq.LargeStreamletTest
Tests run: 1, Failures: 0, Errors: 0, Skipped: 0, Time elapsed: 1.591 sec
Running org.apache.activemq.MessageEvictionTest
Tests run: 3, Failures: 0, Errors: 0, Skipped: 0, Time elapsed: 94.707 sec
Running org.apache.activemq.MessageListenerRedeliveryTest
Tests run: 4, Failures: 0, Errors: 0, Skipped: 0, Time elapsed: 17.034 sec
Running org.apache.activemq.MessageTransformationTest
Tests run: 2, Failures: 0, Errors: 0, Skipped: 0, Time elapsed: 0.171 sec
Running org.apache.activemq.OnePrefetchAsyncConsumerTest
Tests run: 1, Failures: 0, Errors: 0, Skipped: 0, Time elapsed: 6.594 sec
Running org.apache.activemq.OptimizedAckTest
Tests run: 3, Failures: 0, Errors: 0, Skipped: 0, Time elapsed: 15.313 sec
Running org.apache.activemq.PerDestinationStoreLimitTest
Tests run: 2, Failures: 0, Errors: 0, Skipped: 0, Time elapsed: 43.213 sec
Running org.apache.activemq.ProducerFlowControlSendFailTest
Tests run: 7, Failures: 0, Errors: 0, Skipped: 0, Time elapsed: 18.487 sec
Running org.apache.activemq.ProducerFlowControlTest
Tests run: 6, Failures: 0, Errors: 0, Skipped: 0, Time elapsed: 25.592 sec
Running org.apache.activemq.QueueConsumerPriorityTest
Tests run: 1, Failures: 0, Errors: 0, Skipped: 0, Time elapsed: 5.466 sec
Running org.apache.activemq.ReconnectWithSameClientIDTest
Tests run: 2, Failures: 0, Errors: 0, Skipped: 0, Time elapsed: 4.811 sec
Running org.apache.activemq.RedeliveryPolicyTest
Tests run: 10, Failures: 0, Errors: 0, Skipped: 0, Time elapsed: 14.807 sec
Running org.apache.activemq.RemoveDestinationTest
Tests run: 2, Failures: 0, Errors: 0, Skipped: 0, Time elapsed: 19.86 sec
Running org.apache.activemq.TimeStampTest
Tests run: 1, Failures: 0, Errors: 0, Skipped: 0, Time elapsed: 4.563 sec
Running org.apache.activemq.TransactionContextTest
Tests run: 2, Failures: 0, Errors: 0, Skipped: 0, Time elapsed: 2.583 sec
Running org.apache.activemq.ZeroPrefetchConsumerTest
Tests run: 11, Failures: 0, Errors: 0, Skipped: 0, Time elapsed: 22.752 sec
Running org.apache.activemq.advisory.ConsumerListenerTest
Tests run: 2, Failures: 0, Errors: 0, Skipped: 0, Time elapsed: 0.776 sec
Running org.apache.activemq.advisory.DestinationListenerTest
Tests run: 3, Failures: 0, Errors: 0, Skipped: 0, Time elapsed: 8.173 sec
Running org.apache.activemq.advisory.MasterSlaveTempQueueMemoryTest
Tests run: 6, Failures: 0, Errors: 0, Skipped: 0, Time elapsed: 44.72 sec
Running org.apache.activemq.advisory.ProducerListenerTest
Tests run: 2, Failures: 0, Errors: 0, Skipped: 0, Time elapsed: 0.741 sec
Running org.apache.activemq.advisory.TempDestDeleteTest
Tests run: 2, Failures: 0, Errors: 0, Skipped: 0, Time elapsed: 0.795 sec
Running org.apache.activemq.advisory.TempDestLoadTest
Tests run: 2, Failures: 0, Errors: 0, Skipped: 0, Time elapsed: 21.343 sec
Running org.apache.activemq.advisory.TempQueueMemoryTest
Tests run: 2, Failures: 0, Errors: 0, Skipped: 0, Time elapsed: 22.929 sec
Running org.apache.activemq.blob.BlobTransferPolicyUriTest
Tests run: 1, Failures: 0, Errors: 0, Skipped: 0, Time elapsed: 0.163 sec
Running org.apache.activemq.blob.FTPBlobDownloadStrategyTest
Tests run: 3, Failures: 0, Errors: 0, Skipped: 0, Time elapsed: 1.843 sec
Running org.apache.activemq.blob.FTPBlobTest
Tests run: 1, Failures: 0, Errors: 0, Skipped: 0, Time elapsed: 1.984 sec
Running org.apache.activemq.blob.FTPBlobUploadStrategyTest
Tests run: 2, Failures: 0, Errors: 0, Skipped: 0, Time elapsed: 0.986 sec
Running org.apache.activemq.blob.FilesystemBlobTest
Tests run: 1, Failures: 0, Errors: 0, Skipped: 0, Time elapsed: 1.699 sec
Running org.apache.activemq.broker.BrokerRedeliveryTest
Tests run: 1, Failures: 0, Errors: 0, Skipped: 0, Time elapsed: 9.597 sec
Running org.apache.activemq.broker.BrokerServiceTest
Tests run: 5, Failures: 0, Errors: 0, Skipped: 0, Time elapsed: 4.882 sec
Running org.apache.activemq.broker.BrokerTest
Tests run: 129, Failures: 0, Errors: 0, Skipped: 0, Time elapsed: 26.72 sec
Running org.apache.activemq.broker.ConcurrentConnectSimulationTest
Tests run: 1, Failures: 0, Errors: 0, Skipped: 0, Time elapsed: 0.569 sec
Running org.apache.activemq.broker.CreateDestinationsOnStartupViaXBeanTest
Tests run: 1, Failures: 0, Errors: 0, Skipped: 0, Time elapsed: 2.144 sec
Running org.apache.activemq.broker.DedicatedTaskRunnerBrokerTest
Tests run: 129, Failures: 0, Errors: 0, Skipped: 0, Time elapsed: 21.87 sec
Running org.apache.activemq.broker.DoubleSubscriptionTest
Tests run: 1, Failures: 0, Errors: 0, Skipped: 0, Time elapsed: 2.586 sec
Running org.apache.activemq.broker.DurablePersistentFalseRestartTest
Tests run: 1, Failures: 0, Errors: 0, Skipped: 0, Time elapsed: 6.728 sec
Running org.apache.activemq.broker.JdbcXARecoveryBrokerTest
Tests run: 16, Failures: 0, Errors: 0, Skipped: 0, Time elapsed: 168.745 sec
Running org.apache.activemq.broker.MessageExpirationTest
Tests run: 13, Failures: 0, Errors: 0, Skipped: 0, Time elapsed: 23.122 sec
Running org.apache.activemq.broker.OutOfOrderXMLTest
Tests run: 1, Failures: 0, Errors: 0, Skipped: 0, Time elapsed: 1.581 sec
Running org.apache.activemq.broker.QueueMbeanRestartTest
Tests run: 2, Failures: 0, Errors: 0, Skipped: 0, Time elapsed: 15.047 sec
Running org.apache.activemq.broker.QueueSubscriptionTest
Tests run: 8, Failures: 0, Errors: 0, Skipped: 0, Time elapsed: 3.856 sec
Running org.apache.activemq.broker.ReconnectWithJMXEnabledTest
Tests run: 1, Failures: 0, Errors: 0, Skipped: 0, Time elapsed: 4.613 sec
Running org.apache.activemq.broker.RecoveryBrokerTest
Tests run: 9, Failures: 0, Errors: 0, Skipped: 0, Time elapsed: 30.91 sec
Running org.apache.activemq.broker.RedeliveryRestartTest
Tests run: 2, Failures: 0, Errors: 0, Skipped: 0, Time elapsed: 12.204 sec
Running org.apache.activemq.broker.SpringTest
Tests run: 1, Failures: 0, Errors: 0, Skipped: 0, Time elapsed: 2.674 sec
Running org.apache.activemq.broker.TopicSubscriptionTest
Tests run: 8, Failures: 0, Errors: 0, Skipped: 0, Time elapsed: 6.897 sec
Running org.apache.activemq.broker.XARecoveryBrokerTest
Tests run: 16, Failures: 0, Errors: 0, Skipped: 0, Time elapsed: 74.567 sec
Running org.apache.activemq.broker.advisory.AdvisoryBrokerTest
Tests run: 6, Failures: 0, Errors: 0, Skipped: 0, Time elapsed: 0.831 sec
Running org.apache.activemq.broker.advisory.AdvisoryDuplexNetworkBridgeTest
Tests run: 2, Failures: 0, Errors: 0, Skipped: 0, Time elapsed: 12.489 sec
Running org.apache.activemq.broker.advisory.AdvisoryJmxTest
Tests run: 1, Failures: 0, Errors: 0, Skipped: 0, Time elapsed: 0.767 sec
Running org.apache.activemq.broker.advisory.AdvisoryNetworkBridgeTest
Tests run: 2, Failures: 0, Errors: 0, Skipped: 0, Time elapsed: 11.001 sec
Running org.apache.activemq.broker.ft.DbRestartJDBCQueueMasterSlaveLeaseQuiesceTest
Tests run: 3, Failures: 0, Errors: 0, Skipped: 0, Time elapsed: 124.255 sec
Running org.apache.activemq.broker.ft.DbRestartJDBCQueueMasterSlaveLeaseTest
Tests run: 2, Failures: 0, Errors: 0, Skipped: 0, Time elapsed: 80.744 sec
Running org.apache.activemq.broker.ft.DbRestartJDBCQueueMasterSlaveTest
Running org.apache.activemq.broker.ft.JDBCQueueMasterSlaveTest
Tests run: 2, Failures: 0, Errors: 0, Skipped: 0, Time elapsed: 60.627 sec
Running org.apache.activemq.broker.ft.MasterSlaveProducerFlowControlTest
Tests run: 6, Failures: 0, Errors: 0, Skipped: 0, Time elapsed: 25.741 sec
Running org.apache.activemq.broker.ft.MasterSlaveSlaveDieTest
Tests run: 1, Failures: 0, Errors: 0, Skipped: 0, Time elapsed: 2.459 sec
Running org.apache.activemq.broker.ft.MasterSlaveSlaveShutdownTest
Tests run: 1, Failures: 0, Errors: 0, Skipped: 0, Time elapsed: 32.336 sec
Running org.apache.activemq.broker.ft.QueueMasterSlaveSingleUrlTest
Tests run: 2, Failures: 0, Errors: 0, Skipped: 0, Time elapsed: 15.946 sec
Running org.apache.activemq.broker.ft.QueueMasterSlaveTest
Tests run: 2, Failures: 0, Errors: 0, Skipped: 0, Time elapsed: 26.158 sec
Running org.apache.activemq.broker.ft.QueueMasterSlaveTestUsingSharedFileTest
Tests run: 2, Failures: 0, Errors: 0, Skipped: 0, Time elapsed: 40.729 sec
Running org.apache.activemq.broker.ft.QueueMasterSlaveUsingMasterConnectorElementCompositeQueueTest
Tests run: 2, Failures: 0, Errors: 0, Skipped: 0, Time elapsed: 49.664 sec
Running org.apache.activemq.broker.ft.QueueMasterSlaveUsingMasterConnectorElementTest
Tests run: 2, Failures: 0, Errors: 0, Skipped: 0, Time elapsed: 40.123 sec
Running org.apache.activemq.broker.ft.TopicMasterSlaveTest
Tests run: 2, Failures: 0, Errors: 0, Skipped: 0, Time elapsed: 29.443 sec
Running org.apache.activemq.broker.ft.TransactedTopicMasterSlaveTest
Tests run: 15, Failures: 0, Errors: 0, Skipped: 0, Time elapsed: 106.854 sec
Running org.apache.activemq.broker.jmx.BrokerViewSlowStoreStartupTest
Tests run: 1, Failures: 0, Errors: 0, Skipped: 0, Time elapsed: 1.227 sec
Running org.apache.activemq.broker.jmx.MBeanOperationTimeoutTest
Tests run: 1, Failures: 0, Errors: 0, Skipped: 0, Time elapsed: 32.988 sec
Running org.apache.activemq.broker.jmx.MBeanTest
Tests run: 19, Failures: 0, Errors: 0, Skipped: 0, Time elapsed: 55.415 sec
Running org.apache.activemq.broker.jmx.PurgeTest
Tests run: 5, Failures: 0, Errors: 0, Skipped: 0, Time elapsed: 110.375 sec
Running org.apache.activemq.broker.jmx.TransportConnectorMBeanTest
Tests run: 2, Failures: 0, Errors: 0, Skipped: 0, Time elapsed: 4.588 sec
Running org.apache.activemq.broker.mKahaDBXARecoveryBrokerTest
Tests run: 16, Failures: 0, Errors: 0, Skipped: 0, Time elapsed: 98.059 sec
Running org.apache.activemq.broker.message.security.MessageAuthenticationTest
Tests run: 1, Failures: 0, Errors: 0, Skipped: 0, Time elapsed: 0.677 sec
Running org.apache.activemq.broker.policy.AbortSlowConsumerTest
Tests run: 19, Failures: 0, Errors: 0, Skipped: 0, Time elapsed: 122.562 sec
Running org.apache.activemq.broker.policy.DeadLetterTest
Tests run: 4, Failures: 0, Errors: 0, Skipped: 0, Time elapsed: 2.308 sec
Running org.apache.activemq.broker.policy.DestinationCursorConfigTest
Tests run: 2, Failures: 0, Errors: 0, Skipped: 0, Time elapsed: 1.5 sec
Running org.apache.activemq.broker.policy.IndividualDeadLetterTest
Tests run: 5, Failures: 0, Errors: 0, Skipped: 0, Time elapsed: 4.679 sec
Running org.apache.activemq.broker.policy.IndividualDeadLetterViaXmlTest
Tests run: 4, Failures: 0, Errors: 0, Skipped: 0, Time elapsed: 3.784 sec
Running org.apache.activemq.broker.policy.MessageListenerDeadLetterTest
Tests run: 4, Failures: 0, Errors: 0, Skipped: 0, Time elapsed: 3.654 sec
Running org.apache.activemq.broker.policy.NoConsumerDeadLetterTest
Tests run: 5, Failures: 0, Errors: 0, Skipped: 0, Time elapsed: 2.054 sec
Running org.apache.activemq.broker.policy.NoRetryDeadLetterTest
Tests run: 4, Failures: 0, Errors: 0, Skipped: 0, Time elapsed: 1.021 sec
Running org.apache.activemq.broker.policy.PerDurableConsumerDeadLetterTest
Tests run: 4, Failures: 0, Errors: 0, Skipped: 0, Time elapsed: 2.338 sec
Running org.apache.activemq.broker.policy.PriorityNetworkDispatchPolicyTest
Tests run: 1, Failures: 0, Errors: 0, Skipped: 0, Time elapsed: 0.187 sec
Running org.apache.activemq.broker.policy.RoundRobinDispatchPolicyTest
Tests run: 9, Failures: 0, Errors: 0, Skipped: 0, Time elapsed: 3.822 sec
Running org.apache.activemq.broker.policy.SimpleDispatchPolicyTest
Tests run: 8, Failures: 0, Errors: 0, Skipped: 0, Time elapsed: 4.004 sec
Running org.apache.activemq.broker.policy.StrictOrderDispatchPolicyTest
Tests run: 8, Failures: 0, Errors: 0, Skipped: 0, Time elapsed: 19.176 sec
Running org.apache.activemq.broker.region.DestinationGCTest
Tests run: 2, Failures: 0, Errors: 0, Skipped: 0, Time elapsed: 13.757 sec
Running org.apache.activemq.broker.region.DestinationRemoveRestartTest
Tests run: 2, Failures: 0, Errors: 0, Skipped: 0, Time elapsed: 4.306 sec
Running org.apache.activemq.broker.region.QueueDuplicatesFromStoreTest
Tests run: 2, Failures: 0, Errors: 0, Skipped: 0, Time elapsed: 173.304 sec
Running org.apache.activemq.broker.region.QueueOptimizedDispatchExceptionTest
Tests run: 1, Failures: 0, Errors: 0, Skipped: 0, Time elapsed: 0.42 sec
Running org.apache.activemq.broker.region.QueuePurgeTest

Results :

Tests run: 1074, Failures: 0, Errors: 0, Skipped: 0

mojoFailed org.apache.maven.plugins:maven-surefire-plugin:2.12.3(default-test)
[JENKINS] Recording test results
projectFailed org.apache.activemq:activemq-core:5.7-SNAPSHOT

Build failed in Jenkins: ActiveMQ » ActiveMQ :: Core #1092

Posted by Apache Jenkins Server <je...@builds.apache.org>.
See <https://builds.apache.org/job/ActiveMQ/org.apache.activemq$activemq-core/1092/>

------------------------------------------
[...truncated 280 lines...]
Tests run: 2, Failures: 0, Errors: 0, Skipped: 0, Time elapsed: 3.334 sec
Running org.apache.activemq.broker.QueueSubscriptionTest
Tests run: 8, Failures: 0, Errors: 0, Skipped: 0, Time elapsed: 2.388 sec
Running org.apache.activemq.broker.ReconnectWithJMXEnabledTest
Tests run: 1, Failures: 0, Errors: 0, Skipped: 0, Time elapsed: 4.511 sec
Running org.apache.activemq.broker.RecoveryBrokerTest
Tests run: 9, Failures: 0, Errors: 0, Skipped: 0, Time elapsed: 28.097 sec
Running org.apache.activemq.broker.RedeliveryRestartTest
Tests run: 2, Failures: 0, Errors: 0, Skipped: 0, Time elapsed: 11.572 sec
Running org.apache.activemq.broker.SpringTest
Tests run: 1, Failures: 0, Errors: 0, Skipped: 0, Time elapsed: 2.386 sec
Running org.apache.activemq.broker.TopicSubscriptionTest
Tests run: 8, Failures: 0, Errors: 0, Skipped: 0, Time elapsed: 3.274 sec
Running org.apache.activemq.broker.XARecoveryBrokerTest
Tests run: 16, Failures: 0, Errors: 0, Skipped: 0, Time elapsed: 68.011 sec
Running org.apache.activemq.broker.advisory.AdvisoryBrokerTest
Tests run: 6, Failures: 0, Errors: 0, Skipped: 0, Time elapsed: 0.805 sec
Running org.apache.activemq.broker.advisory.AdvisoryDuplexNetworkBridgeTest
Tests run: 2, Failures: 0, Errors: 0, Skipped: 0, Time elapsed: 10.821 sec
Running org.apache.activemq.broker.advisory.AdvisoryJmxTest
Tests run: 1, Failures: 0, Errors: 0, Skipped: 0, Time elapsed: 0.692 sec
Running org.apache.activemq.broker.advisory.AdvisoryNetworkBridgeTest
Tests run: 2, Failures: 0, Errors: 0, Skipped: 0, Time elapsed: 10.389 sec
Running org.apache.activemq.broker.ft.DbRestartJDBCQueueMasterSlaveLeaseQuiesceTest
Tests run: 3, Failures: 0, Errors: 0, Skipped: 0, Time elapsed: 40.29 sec
Running org.apache.activemq.broker.ft.DbRestartJDBCQueueMasterSlaveLeaseTest
Tests run: 2, Failures: 0, Errors: 0, Skipped: 0, Time elapsed: 19.263 sec
Running org.apache.activemq.broker.ft.DbRestartJDBCQueueMasterSlaveTest
Running org.apache.activemq.broker.ft.JDBCQueueMasterSlaveTest
Tests run: 2, Failures: 0, Errors: 0, Skipped: 0, Time elapsed: 12.255 sec
Running org.apache.activemq.broker.ft.MasterSlaveProducerFlowControlTest
Tests run: 6, Failures: 0, Errors: 0, Skipped: 0, Time elapsed: 25.649 sec
Running org.apache.activemq.broker.ft.MasterSlaveSlaveDieTest
Tests run: 1, Failures: 0, Errors: 0, Skipped: 0, Time elapsed: 2.399 sec
Running org.apache.activemq.broker.ft.MasterSlaveSlaveShutdownTest
Tests run: 1, Failures: 0, Errors: 0, Skipped: 0, Time elapsed: 32.294 sec
Running org.apache.activemq.broker.ft.QueueMasterSlaveSingleUrlTest
Tests run: 2, Failures: 0, Errors: 0, Skipped: 0, Time elapsed: 14.69 sec
Running org.apache.activemq.broker.ft.QueueMasterSlaveTest
Tests run: 2, Failures: 0, Errors: 0, Skipped: 0, Time elapsed: 12.877 sec
Running org.apache.activemq.broker.ft.QueueMasterSlaveTestUsingSharedFileTest
Tests run: 2, Failures: 0, Errors: 0, Skipped: 0, Time elapsed: 27.149 sec
Running org.apache.activemq.broker.ft.QueueMasterSlaveUsingMasterConnectorElementCompositeQueueTest
Tests run: 2, Failures: 0, Errors: 0, Skipped: 0, Time elapsed: 13.579 sec
Running org.apache.activemq.broker.ft.QueueMasterSlaveUsingMasterConnectorElementTest
Tests run: 2, Failures: 0, Errors: 0, Skipped: 0, Time elapsed: 13.365 sec
Running org.apache.activemq.broker.ft.TopicMasterSlaveTest
Tests run: 2, Failures: 0, Errors: 0, Skipped: 0, Time elapsed: 13.375 sec
Running org.apache.activemq.broker.ft.TransactedTopicMasterSlaveTest
Tests run: 15, Failures: 0, Errors: 0, Skipped: 0, Time elapsed: 80.325 sec
Running org.apache.activemq.broker.jmx.BrokerViewSlowStoreStartupTest
Tests run: 1, Failures: 0, Errors: 0, Skipped: 0, Time elapsed: 0.955 sec
Running org.apache.activemq.broker.jmx.MBeanOperationTimeoutTest
Tests run: 1, Failures: 0, Errors: 0, Skipped: 0, Time elapsed: 8.374 sec
Running org.apache.activemq.broker.jmx.MBeanTest
Tests run: 19, Failures: 0, Errors: 0, Skipped: 0, Time elapsed: 54.759 sec
Running org.apache.activemq.broker.jmx.PurgeTest
Tests run: 5, Failures: 0, Errors: 0, Skipped: 0, Time elapsed: 16.177 sec
Running org.apache.activemq.broker.jmx.TransportConnectorMBeanTest
Tests run: 2, Failures: 0, Errors: 0, Skipped: 0, Time elapsed: 4.536 sec
Running org.apache.activemq.broker.mKahaDBXARecoveryBrokerTest
Tests run: 16, Failures: 0, Errors: 0, Skipped: 0, Time elapsed: 79.043 sec
Running org.apache.activemq.broker.message.security.MessageAuthenticationTest
Tests run: 1, Failures: 0, Errors: 0, Skipped: 0, Time elapsed: 0.637 sec
Running org.apache.activemq.broker.policy.AbortSlowConsumerTest
Tests run: 19, Failures: 0, Errors: 0, Skipped: 0, Time elapsed: 153.97 sec
Running org.apache.activemq.broker.policy.DeadLetterTest
Tests run: 4, Failures: 0, Errors: 0, Skipped: 0, Time elapsed: 2.253 sec
Running org.apache.activemq.broker.policy.DestinationCursorConfigTest
Tests run: 2, Failures: 0, Errors: 0, Skipped: 0, Time elapsed: 1.433 sec
Running org.apache.activemq.broker.policy.IndividualDeadLetterTest
Tests run: 5, Failures: 0, Errors: 0, Skipped: 0, Time elapsed: 4.397 sec
Running org.apache.activemq.broker.policy.IndividualDeadLetterViaXmlTest
Tests run: 4, Failures: 0, Errors: 0, Skipped: 0, Time elapsed: 3.188 sec
Running org.apache.activemq.broker.policy.MessageListenerDeadLetterTest
Tests run: 4, Failures: 0, Errors: 0, Skipped: 0, Time elapsed: 2.201 sec
Running org.apache.activemq.broker.policy.NoConsumerDeadLetterTest
Tests run: 5, Failures: 0, Errors: 0, Skipped: 0, Time elapsed: 1.692 sec
Running org.apache.activemq.broker.policy.NoRetryDeadLetterTest
Tests run: 4, Failures: 0, Errors: 0, Skipped: 0, Time elapsed: 0.913 sec
Running org.apache.activemq.broker.policy.PerDurableConsumerDeadLetterTest
Tests run: 4, Failures: 0, Errors: 0, Skipped: 0, Time elapsed: 2.378 sec
Running org.apache.activemq.broker.policy.PriorityNetworkDispatchPolicyTest
Tests run: 1, Failures: 0, Errors: 0, Skipped: 0, Time elapsed: 0.161 sec
Running org.apache.activemq.broker.policy.RoundRobinDispatchPolicyTest
Tests run: 9, Failures: 0, Errors: 0, Skipped: 0, Time elapsed: 2.815 sec
Running org.apache.activemq.broker.policy.SimpleDispatchPolicyTest
Tests run: 8, Failures: 0, Errors: 0, Skipped: 0, Time elapsed: 3.147 sec
Running org.apache.activemq.broker.policy.StrictOrderDispatchPolicyTest
Tests run: 8, Failures: 0, Errors: 0, Skipped: 0, Time elapsed: 3.309 sec
Running org.apache.activemq.broker.region.DestinationGCTest
Tests run: 2, Failures: 0, Errors: 0, Skipped: 0, Time elapsed: 14.795 sec
Running org.apache.activemq.broker.region.DestinationRemoveRestartTest
Tests run: 2, Failures: 0, Errors: 0, Skipped: 0, Time elapsed: 3.478 sec
Running org.apache.activemq.broker.region.QueueDuplicatesFromStoreTest
Tests run: 2, Failures: 0, Errors: 0, Skipped: 0, Time elapsed: 6.303 sec
Running org.apache.activemq.broker.region.QueueOptimizedDispatchExceptionTest
Tests run: 1, Failures: 0, Errors: 0, Skipped: 0, Time elapsed: 0.479 sec
Running org.apache.activemq.broker.region.QueuePurgeTest
Tests run: 3, Failures: 0, Errors: 0, Skipped: 0, Time elapsed: 80.434 sec
Running org.apache.activemq.broker.region.UniquePropertyMessageEvictionStrategyTest
Tests run: 1, Failures: 0, Errors: 0, Skipped: 0, Time elapsed: 12.466 sec
Running org.apache.activemq.broker.region.cursors.CursorDurableTest
Tests run: 2, Failures: 0, Errors: 0, Skipped: 0, Time elapsed: 4.085 sec
Running org.apache.activemq.broker.region.cursors.CursorQueueStoreTest
Tests run: 5, Failures: 0, Errors: 0, Skipped: 0, Time elapsed: 103.369 sec
Running org.apache.activemq.broker.region.cursors.FilePendingMessageCursorTest
Tests run: 2, Failures: 0, Errors: 0, Skipped: 0, Time elapsed: 2.455 sec
Running org.apache.activemq.broker.region.cursors.NegativeQueueTest
Tests run: 4, Failures: 0, Errors: 0, Skipped: 0, Time elapsed: 100.582 sec
Running org.apache.activemq.broker.region.cursors.OrderPendingListTest
Tests run: 9, Failures: 0, Errors: 0, Skipped: 0, Time elapsed: 0.421 sec
Running org.apache.activemq.broker.region.cursors.PrioritizedPendingListTest
Tests run: 7, Failures: 0, Errors: 0, Skipped: 0, Time elapsed: 0.334 sec
Running org.apache.activemq.broker.region.cursors.StoreBasedCursorTest
Tests run: 5, Failures: 0, Errors: 0, Skipped: 0, Time elapsed: 16.067 sec
Running org.apache.activemq.broker.region.cursors.StoreQueueCursorJDBCNoDuplicateTest
Tests run: 1, Failures: 0, Errors: 0, Skipped: 0, Time elapsed: 3.101 sec
Running org.apache.activemq.broker.region.cursors.StoreQueueCursorJournalNoDuplicateTest
Tests run: 1, Failures: 0, Errors: 0, Skipped: 0, Time elapsed: 0.792 sec
Running org.apache.activemq.broker.region.cursors.StoreQueueCursorKahaDBNoDuplicateTest
Tests run: 1, Failures: 0, Errors: 0, Skipped: 0, Time elapsed: 1.045 sec
Running org.apache.activemq.broker.region.cursors.StoreQueueCursorMemoryNoDuplicateTest
Tests run: 1, Failures: 0, Errors: 0, Skipped: 0, Time elapsed: 0.371 sec
Running org.apache.activemq.broker.region.cursors.StoreQueueCursorNoDuplicateTest
Tests run: 1, Failures: 0, Errors: 0, Skipped: 0, Time elapsed: 1.062 sec
Running org.apache.activemq.broker.region.group.MessageGroupHashBucketTest
Tests run: 2, Failures: 0, Errors: 0, Skipped: 0, Time elapsed: 0.048 sec
Running org.apache.activemq.broker.region.group.MessageGroupMapTest
Tests run: 2, Failures: 0, Errors: 0, Skipped: 0, Time elapsed: 0.031 sec
Running org.apache.activemq.broker.region.group.MessageGroupTest
Tests run: 3, Failures: 0, Errors: 0, Skipped: 0, Time elapsed: 1.351 sec
Running org.apache.activemq.broker.scheduler.CronParserTest
Tests run: 13, Failures: 0, Errors: 0, Skipped: 0, Time elapsed: 0.197 sec
Running org.apache.activemq.broker.scheduler.JmsCronSchedulerTest
Tests run: 2, Failures: 0, Errors: 0, Skipped: 0, Time elapsed: 198.581 sec
Running org.apache.activemq.broker.scheduler.JmsSchedulerTest
Tests run: 5, Failures: 0, Errors: 0, Skipped: 0, Time elapsed: 87.602 sec
Running org.apache.activemq.broker.scheduler.JobSchedulerManagementTest
Tests run: 7, Failures: 0, Errors: 0, Skipped: 0, Time elapsed: 74.945 sec
Running org.apache.activemq.broker.scheduler.JobSchedulerStoreTest
Tests run: 1, Failures: 0, Errors: 0, Skipped: 0, Time elapsed: 1.523 sec
Running org.apache.activemq.broker.scheduler.JobSchedulerTest
Tests run: 9, Failures: 1, Errors: 0, Skipped: 0, Time elapsed: 75.828 sec <<< FAILURE!
testAddCronAndByteSequence(org.apache.activemq.broker.scheduler.JobSchedulerTest)  Time elapsed: 70052 sec  <<< FAILURE!
java.lang.AssertionError
	at org.junit.Assert.fail(Assert.java:92)
	at org.junit.Assert.assertTrue(Assert.java:43)
	at org.junit.Assert.assertTrue(Assert.java:54)
	at org.apache.activemq.broker.scheduler.JobSchedulerTest.testAddCronAndByteSequence(JobSchedulerTest.java:82)
	at sun.reflect.NativeMethodAccessorImpl.invoke0(Native Method)
	at sun.reflect.NativeMethodAccessorImpl.invoke(NativeMethodAccessorImpl.java:39)
	at sun.reflect.DelegatingMethodAccessorImpl.invoke(DelegatingMethodAccessorImpl.java:25)
	at java.lang.reflect.Method.invoke(Method.java:597)
	at org.junit.runners.model.FrameworkMethod$1.runReflectiveCall(FrameworkMethod.java:45)
	at org.junit.internal.runners.model.ReflectiveCallable.run(ReflectiveCallable.java:15)
	at org.junit.runners.model.FrameworkMethod.invokeExplosively(FrameworkMethod.java:42)
	at org.junit.internal.runners.statements.InvokeMethod.evaluate(InvokeMethod.java:20)
	at org.junit.internal.runners.statements.RunBefores.evaluate(RunBefores.java:28)
	at org.junit.internal.runners.statements.RunAfters.evaluate(RunAfters.java:30)
	at org.junit.runners.ParentRunner.runLeaf(ParentRunner.java:263)
	at org.junit.runners.BlockJUnit4ClassRunner.runChild(BlockJUnit4ClassRunner.java:68)
	at org.junit.runners.BlockJUnit4ClassRunner.runChild(BlockJUnit4ClassRunner.java:47)
	at org.junit.runners.ParentRunner$3.run(ParentRunner.java:231)
	at org.junit.runners.ParentRunner$1.schedule(ParentRunner.java:60)
	at org.junit.runners.ParentRunner.runChildren(ParentRunner.java:229)
	at org.junit.runners.ParentRunner.access$000(ParentRunner.java:50)
	at org.junit.runners.ParentRunner$2.evaluate(ParentRunner.java:222)
	at org.junit.runners.ParentRunner.run(ParentRunner.java:300)
	at org.apache.maven.surefire.junit4.JUnit4Provider.execute(JUnit4Provider.java:252)
	at org.apache.maven.surefire.junit4.JUnit4Provider.executeTestSet(JUnit4Provider.java:141)
	at org.apache.maven.surefire.junit4.JUnit4Provider.invoke(JUnit4Provider.java:112)
	at sun.reflect.NativeMethodAccessorImpl.invoke0(Native Method)
	at sun.reflect.NativeMethodAccessorImpl.invoke(NativeMethodAccessorImpl.java:39)
	at sun.reflect.DelegatingMethodAccessorImpl.invoke(DelegatingMethodAccessorImpl.java:25)
	at java.lang.reflect.Method.invoke(Method.java:597)
	at org.apache.maven.surefire.util.ReflectionUtils.invokeMethodWithArray(ReflectionUtils.java:189)
	at org.apache.maven.surefire.booter.ProviderFactory$ProviderProxy.invoke(ProviderFactory.java:165)
	at org.apache.maven.surefire.booter.ProviderFactory.invokeProvider(ProviderFactory.java:85)
	at org.apache.maven.surefire.booter.ForkedBooter.runSuitesInProcess(ForkedBooter.java:115)
	at org.apache.maven.surefire.booter.ForkedBooter.main(ForkedBooter.java:75)

Running org.apache.activemq.broker.store.DefaultStoreRecoveryBrokerTest
Tests run: 9, Failures: 0, Errors: 0, Skipped: 0, Time elapsed: 32.796 sec
Running org.apache.activemq.broker.store.RecoverExpiredMessagesTest
Tests run: 4, Failures: 0, Errors: 0, Skipped: 0, Time elapsed: 30.204 sec
Running org.apache.activemq.broker.store.TransactionStoreTest
Tests run: 1, Failures: 0, Errors: 0, Skipped: 0, Time elapsed: 0.208 sec
Running org.apache.activemq.broker.util.PluginBrokerTest
Tests run: 1, Failures: 0, Errors: 0, Skipped: 0, Time elapsed: 2.369 sec
Running org.apache.activemq.broker.util.RedeliveryPluginTest
Tests run: 1, Failures: 0, Errors: 0, Skipped: 0, Time elapsed: 0.142 sec
Running org.apache.activemq.broker.util.TimeStampingBrokerPluginTest
Tests run: 3, Failures: 0, Errors: 0, Skipped: 0, Time elapsed: 6.844 sec
Running org.apache.activemq.broker.util.TraceBrokerPathPluginTest
Tests run: 1, Failures: 0, Errors: 0, Skipped: 0, Time elapsed: 2.652 sec
Running org.apache.activemq.broker.virtual.CompositeQueueTest
Tests run: 1, Failures: 0, Errors: 0, Skipped: 0, Time elapsed: 0.969 sec
Running org.apache.activemq.broker.virtual.CompositeTopicTest
Tests run: 1, Failures: 0, Errors: 0, Skipped: 0, Time elapsed: 1.429 sec
Running org.apache.activemq.broker.virtual.FilteredQueueTest
Tests run: 1, Failures: 0, Errors: 0, Skipped: 0, Time elapsed: 1.634 sec
Running org.apache.activemq.broker.virtual.MirroredQueueCorrectMemoryUsageTest
Tests run: 1, Failures: 0, Errors: 0, Skipped: 0, Time elapsed: 5.429 sec
Running org.apache.activemq.broker.virtual.MirroredQueueTest
Tests run: 2, Failures: 0, Errors: 0, Skipped: 0, Time elapsed: 0.67 sec
Running org.apache.activemq.broker.virtual.MirroredQueueUsingVirtualTopicQueueTest
Tests run: 2, Failures: 0, Errors: 0, Skipped: 0, Time elapsed: 0.668 sec
Running org.apache.activemq.broker.virtual.VirtualTopicDLQTest
Tests run: 1, Failures: 0, Errors: 0, Skipped: 0, Time elapsed: 7.422 sec
Running org.apache.activemq.broker.virtual.VirtualTopicDisconnectSelectorTest
Tests run: 1, Failures: 0, Errors: 0, Skipped: 0, Time elapsed: 1.712 sec
Running org.apache.activemq.broker.virtual.VirtualTopicPubSubTest
Tests run: 2, Failures: 0, Errors: 0, Skipped: 0, Time elapsed: 0.842 sec
Running org.apache.activemq.broker.virtual.VirtualTopicPubSubUsingXBeanTest
Tests run: 2, Failures: 0, Errors: 0, Skipped: 0, Time elapsed: 0.766 sec
Running org.apache.activemq.broker.virtual.VirtualTopicSelectorTest
Tests run: 1, Failures: 0, Errors: 0, Skipped: 0, Time elapsed: 0.643 sec
Running org.apache.activemq.broker.virtual.VirtualTopicsAndDurableSubsTest
Tests run: 20, Failures: 0, Errors: 0, Skipped: 0, Time elapsed: 48.86 sec
Running org.apache.activemq.bugs.AMQ1687Test
Tests run: 1, Failures: 0, Errors: 0, Skipped: 0, Time elapsed: 2.511 sec
Running org.apache.activemq.bugs.AMQ1853Test
Tests run: 1, Failures: 0, Errors: 0, Skipped: 0, Time elapsed: 7.361 sec
Running org.apache.activemq.bugs.AMQ1893Test
Tests run: 1, Failures: 0, Errors: 0, Skipped: 0, Time elapsed: 15.733 sec
Running org.apache.activemq.bugs.AMQ1917Test
Tests run: 1, Failures: 0, Errors: 0, Skipped: 0, Time elapsed: 4.637 sec
Running org.apache.activemq.bugs.AMQ1936Test
Tests run: 1, Failures: 0, Errors: 0, Skipped: 0, Time elapsed: 34.199 sec
Running org.apache.activemq.bugs.AMQ2021Test
Tests run: 1, Failures: 0, Errors: 0, Skipped: 0, Time elapsed: 4.636 sec
Running org.apache.activemq.bugs.AMQ2084Test
Tests run: 2, Failures: 0, Errors: 0, Skipped: 0, Time elapsed: 8.726 sec
Running org.apache.activemq.bugs.AMQ2102Test
Tests run: 2, Failures: 0, Errors: 0, Skipped: 0, Time elapsed: 47.886 sec
Running org.apache.activemq.bugs.AMQ2103Test
Tests run: 2, Failures: 0, Errors: 0, Skipped: 0, Time elapsed: 0.651 sec
Running org.apache.activemq.bugs.AMQ2149KahaDBTest

Results :

Failed tests:   testAddCronAndByteSequence(org.apache.activemq.broker.scheduler.JobSchedulerTest)

Tests run: 1228, Failures: 1, Errors: 0, Skipped: 0

mojoFailed org.apache.maven.plugins:maven-surefire-plugin:2.12.3(default-test)
[JENKINS] Recording test results
projectFailed org.apache.activemq:activemq-core:5.8-SNAPSHOT

Build failed in Jenkins: ActiveMQ » ActiveMQ :: Core #1090

Posted by Apache Jenkins Server <je...@builds.apache.org>.
See <https://builds.apache.org/job/ActiveMQ/org.apache.activemq$activemq-core/1090/changes>

Changes:

[gtully] ensure slow-tests profile overrides excludes and runs all tests - duplicate the config in that profile, so order is the same etc; don't see another way atm

------------------------------------------
[...truncated 276 lines...]
Tests run: 2, Failures: 0, Errors: 0, Skipped: 0, Time elapsed: 0.8 sec
Running org.apache.activemq.advisory.TempDestLoadTest
Tests run: 2, Failures: 0, Errors: 0, Skipped: 0, Time elapsed: 16.447 sec
Running org.apache.activemq.advisory.TempQueueMemoryTest
Tests run: 2, Failures: 0, Errors: 0, Skipped: 0, Time elapsed: 18.14 sec
Running org.apache.activemq.blob.BlobTransferPolicyUriTest
Tests run: 1, Failures: 0, Errors: 0, Skipped: 0, Time elapsed: 0.13 sec
Running org.apache.activemq.blob.FTPBlobDownloadStrategyTest
Tests run: 3, Failures: 0, Errors: 0, Skipped: 0, Time elapsed: 1.595 sec
Running org.apache.activemq.blob.FTPBlobTest
Tests run: 1, Failures: 0, Errors: 0, Skipped: 0, Time elapsed: 1.826 sec
Running org.apache.activemq.blob.FTPBlobUploadStrategyTest
Tests run: 2, Failures: 0, Errors: 0, Skipped: 0, Time elapsed: 0.807 sec
Running org.apache.activemq.blob.FilesystemBlobTest
Tests run: 1, Failures: 0, Errors: 0, Skipped: 0, Time elapsed: 1.584 sec
Running org.apache.activemq.broker.BrokerRedeliveryTest
Tests run: 1, Failures: 0, Errors: 0, Skipped: 0, Time elapsed: 8.133 sec
Running org.apache.activemq.broker.BrokerServiceTest
Tests run: 5, Failures: 0, Errors: 0, Skipped: 0, Time elapsed: 4.588 sec
Running org.apache.activemq.broker.BrokerTest
Tests run: 129, Failures: 0, Errors: 0, Skipped: 0, Time elapsed: 19.866 sec
Running org.apache.activemq.broker.ConcurrentConnectSimulationTest
Tests run: 1, Failures: 0, Errors: 0, Skipped: 0, Time elapsed: 0.481 sec
Running org.apache.activemq.broker.CreateDestinationsOnStartupViaXBeanTest
Tests run: 1, Failures: 0, Errors: 0, Skipped: 0, Time elapsed: 1.894 sec
Running org.apache.activemq.broker.DedicatedTaskRunnerBrokerTest
Tests run: 129, Failures: 0, Errors: 0, Skipped: 0, Time elapsed: 19.939 sec
Running org.apache.activemq.broker.DoubleSubscriptionTest
Tests run: 1, Failures: 0, Errors: 0, Skipped: 0, Time elapsed: 2.448 sec
Running org.apache.activemq.broker.DurablePersistentFalseRestartTest
Tests run: 1, Failures: 0, Errors: 0, Skipped: 0, Time elapsed: 6.629 sec
Running org.apache.activemq.broker.JdbcXARecoveryBrokerTest
Tests run: 16, Failures: 0, Errors: 0, Skipped: 0, Time elapsed: 56.907 sec
Running org.apache.activemq.broker.MessageExpirationTest
Tests run: 13, Failures: 0, Errors: 0, Skipped: 0, Time elapsed: 23.948 sec
Running org.apache.activemq.broker.OutOfOrderXMLTest
Tests run: 1, Failures: 0, Errors: 0, Skipped: 0, Time elapsed: 1.156 sec
Running org.apache.activemq.broker.QueueMbeanRestartTest
Tests run: 2, Failures: 0, Errors: 0, Skipped: 0, Time elapsed: 3.285 sec
Running org.apache.activemq.broker.QueueSubscriptionTest
Tests run: 8, Failures: 0, Errors: 0, Skipped: 0, Time elapsed: 2.429 sec
Running org.apache.activemq.broker.ReconnectWithJMXEnabledTest
Tests run: 1, Failures: 0, Errors: 0, Skipped: 0, Time elapsed: 4.49 sec
Running org.apache.activemq.broker.RecoveryBrokerTest
Tests run: 9, Failures: 0, Errors: 0, Skipped: 0, Time elapsed: 28.284 sec
Running org.apache.activemq.broker.RedeliveryRestartTest
Tests run: 2, Failures: 0, Errors: 0, Skipped: 0, Time elapsed: 10.439 sec
Running org.apache.activemq.broker.SpringTest
Tests run: 1, Failures: 0, Errors: 0, Skipped: 0, Time elapsed: 2.29 sec
Running org.apache.activemq.broker.TopicSubscriptionTest
Tests run: 8, Failures: 0, Errors: 0, Skipped: 0, Time elapsed: 3.437 sec
Running org.apache.activemq.broker.XARecoveryBrokerTest
Tests run: 16, Failures: 0, Errors: 0, Skipped: 0, Time elapsed: 67.905 sec
Running org.apache.activemq.broker.advisory.AdvisoryBrokerTest
Tests run: 6, Failures: 0, Errors: 0, Skipped: 0, Time elapsed: 0.839 sec
Running org.apache.activemq.broker.advisory.AdvisoryDuplexNetworkBridgeTest
Tests run: 2, Failures: 0, Errors: 0, Skipped: 0, Time elapsed: 10.742 sec
Running org.apache.activemq.broker.advisory.AdvisoryJmxTest
Tests run: 1, Failures: 0, Errors: 0, Skipped: 0, Time elapsed: 0.684 sec
Running org.apache.activemq.broker.advisory.AdvisoryNetworkBridgeTest
Tests run: 2, Failures: 0, Errors: 0, Skipped: 0, Time elapsed: 10.353 sec
Running org.apache.activemq.broker.ft.DbRestartJDBCQueueMasterSlaveLeaseQuiesceTest
Tests run: 3, Failures: 0, Errors: 0, Skipped: 0, Time elapsed: 39.859 sec
Running org.apache.activemq.broker.ft.DbRestartJDBCQueueMasterSlaveLeaseTest
Tests run: 2, Failures: 0, Errors: 0, Skipped: 0, Time elapsed: 19.099 sec
Running org.apache.activemq.broker.ft.DbRestartJDBCQueueMasterSlaveTest
Running org.apache.activemq.broker.ft.JDBCQueueMasterSlaveTest
Tests run: 2, Failures: 0, Errors: 0, Skipped: 0, Time elapsed: 12.212 sec
Running org.apache.activemq.broker.ft.MasterSlaveProducerFlowControlTest
Tests run: 6, Failures: 0, Errors: 0, Skipped: 0, Time elapsed: 25.61 sec
Running org.apache.activemq.broker.ft.MasterSlaveSlaveDieTest
Tests run: 1, Failures: 0, Errors: 0, Skipped: 0, Time elapsed: 2.37 sec
Running org.apache.activemq.broker.ft.MasterSlaveSlaveShutdownTest
Tests run: 1, Failures: 0, Errors: 0, Skipped: 0, Time elapsed: 32.299 sec
Running org.apache.activemq.broker.ft.QueueMasterSlaveSingleUrlTest
Tests run: 2, Failures: 0, Errors: 0, Skipped: 0, Time elapsed: 14.815 sec
Running org.apache.activemq.broker.ft.QueueMasterSlaveTest
Tests run: 2, Failures: 0, Errors: 0, Skipped: 0, Time elapsed: 12.772 sec
Running org.apache.activemq.broker.ft.QueueMasterSlaveTestUsingSharedFileTest
Tests run: 2, Failures: 0, Errors: 0, Skipped: 0, Time elapsed: 27.117 sec
Running org.apache.activemq.broker.ft.QueueMasterSlaveUsingMasterConnectorElementCompositeQueueTest
Tests run: 2, Failures: 0, Errors: 0, Skipped: 0, Time elapsed: 13.375 sec
Running org.apache.activemq.broker.ft.QueueMasterSlaveUsingMasterConnectorElementTest
Tests run: 2, Failures: 0, Errors: 0, Skipped: 0, Time elapsed: 13.239 sec
Running org.apache.activemq.broker.ft.TopicMasterSlaveTest
Tests run: 2, Failures: 0, Errors: 0, Skipped: 0, Time elapsed: 13.251 sec
Running org.apache.activemq.broker.ft.TransactedTopicMasterSlaveTest
Tests run: 15, Failures: 0, Errors: 0, Skipped: 0, Time elapsed: 76.87 sec
Running org.apache.activemq.broker.jmx.BrokerViewSlowStoreStartupTest
Tests run: 1, Failures: 0, Errors: 0, Skipped: 0, Time elapsed: 0.893 sec
Running org.apache.activemq.broker.jmx.MBeanOperationTimeoutTest
Tests run: 1, Failures: 0, Errors: 0, Skipped: 0, Time elapsed: 8.8 sec
Running org.apache.activemq.broker.jmx.MBeanTest
Tests run: 19, Failures: 0, Errors: 0, Skipped: 0, Time elapsed: 54.78 sec
Running org.apache.activemq.broker.jmx.PurgeTest
Tests run: 5, Failures: 0, Errors: 0, Skipped: 0, Time elapsed: 15.224 sec
Running org.apache.activemq.broker.jmx.TransportConnectorMBeanTest
Tests run: 2, Failures: 0, Errors: 0, Skipped: 0, Time elapsed: 4.495 sec
Running org.apache.activemq.broker.mKahaDBXARecoveryBrokerTest
Tests run: 16, Failures: 0, Errors: 0, Skipped: 0, Time elapsed: 78.535 sec
Running org.apache.activemq.broker.message.security.MessageAuthenticationTest
Tests run: 1, Failures: 0, Errors: 0, Skipped: 0, Time elapsed: 0.565 sec
Running org.apache.activemq.broker.policy.AbortSlowConsumerTest
Tests run: 19, Failures: 0, Errors: 0, Skipped: 0, Time elapsed: 194.733 sec
Running org.apache.activemq.broker.policy.DeadLetterTest
Tests run: 4, Failures: 0, Errors: 0, Skipped: 0, Time elapsed: 2.208 sec
Running org.apache.activemq.broker.policy.DestinationCursorConfigTest
Tests run: 2, Failures: 0, Errors: 0, Skipped: 0, Time elapsed: 1.217 sec
Running org.apache.activemq.broker.policy.IndividualDeadLetterTest
Tests run: 5, Failures: 0, Errors: 0, Skipped: 0, Time elapsed: 4.411 sec
Running org.apache.activemq.broker.policy.IndividualDeadLetterViaXmlTest
Tests run: 4, Failures: 0, Errors: 0, Skipped: 0, Time elapsed: 3.637 sec
Running org.apache.activemq.broker.policy.MessageListenerDeadLetterTest
Tests run: 4, Failures: 0, Errors: 0, Skipped: 0, Time elapsed: 2.234 sec
Running org.apache.activemq.broker.policy.NoConsumerDeadLetterTest
Tests run: 5, Failures: 0, Errors: 0, Skipped: 0, Time elapsed: 1.792 sec
Running org.apache.activemq.broker.policy.NoRetryDeadLetterTest
Tests run: 4, Failures: 0, Errors: 0, Skipped: 0, Time elapsed: 0.838 sec
Running org.apache.activemq.broker.policy.PerDurableConsumerDeadLetterTest
Tests run: 4, Failures: 0, Errors: 0, Skipped: 0, Time elapsed: 2.304 sec
Running org.apache.activemq.broker.policy.PriorityNetworkDispatchPolicyTest
Tests run: 1, Failures: 0, Errors: 0, Skipped: 0, Time elapsed: 0.175 sec
Running org.apache.activemq.broker.policy.RoundRobinDispatchPolicyTest
Tests run: 9, Failures: 0, Errors: 0, Skipped: 0, Time elapsed: 4.4 sec
Running org.apache.activemq.broker.policy.SimpleDispatchPolicyTest
Tests run: 8, Failures: 0, Errors: 0, Skipped: 0, Time elapsed: 2.745 sec
Running org.apache.activemq.broker.policy.StrictOrderDispatchPolicyTest
Tests run: 8, Failures: 0, Errors: 0, Skipped: 0, Time elapsed: 2.879 sec
Running org.apache.activemq.broker.region.DestinationGCTest
Tests run: 2, Failures: 0, Errors: 0, Skipped: 0, Time elapsed: 13.595 sec
Running org.apache.activemq.broker.region.DestinationRemoveRestartTest
Tests run: 2, Failures: 0, Errors: 0, Skipped: 0, Time elapsed: 3.056 sec
Running org.apache.activemq.broker.region.QueueDuplicatesFromStoreTest
Tests run: 2, Failures: 0, Errors: 0, Skipped: 0, Time elapsed: 6.807 sec
Running org.apache.activemq.broker.region.QueueOptimizedDispatchExceptionTest
Tests run: 1, Failures: 0, Errors: 0, Skipped: 0, Time elapsed: 0.369 sec
Running org.apache.activemq.broker.region.QueuePurgeTest
Tests run: 3, Failures: 0, Errors: 0, Skipped: 0, Time elapsed: 76.493 sec
Running org.apache.activemq.broker.region.UniquePropertyMessageEvictionStrategyTest
Tests run: 1, Failures: 0, Errors: 0, Skipped: 0, Time elapsed: 11.75 sec
Running org.apache.activemq.broker.region.cursors.CursorDurableTest
Tests run: 2, Failures: 0, Errors: 0, Skipped: 0, Time elapsed: 3.884 sec
Running org.apache.activemq.broker.region.cursors.CursorQueueStoreTest
Tests run: 5, Failures: 0, Errors: 0, Skipped: 0, Time elapsed: 103.265 sec
Running org.apache.activemq.broker.region.cursors.FilePendingMessageCursorTest
Tests run: 2, Failures: 0, Errors: 0, Skipped: 0, Time elapsed: 1.686 sec
Running org.apache.activemq.broker.region.cursors.NegativeQueueTest
Tests run: 4, Failures: 0, Errors: 0, Skipped: 0, Time elapsed: 100.122 sec
Running org.apache.activemq.broker.region.cursors.OrderPendingListTest
Tests run: 9, Failures: 0, Errors: 0, Skipped: 0, Time elapsed: 0.281 sec
Running org.apache.activemq.broker.region.cursors.PrioritizedPendingListTest
Tests run: 7, Failures: 0, Errors: 0, Skipped: 0, Time elapsed: 0.273 sec
Running org.apache.activemq.broker.region.cursors.StoreBasedCursorTest
Tests run: 5, Failures: 0, Errors: 0, Skipped: 0, Time elapsed: 14.623 sec
Running org.apache.activemq.broker.region.cursors.StoreQueueCursorJDBCNoDuplicateTest
Tests run: 1, Failures: 0, Errors: 0, Skipped: 0, Time elapsed: 2.307 sec
Running org.apache.activemq.broker.region.cursors.StoreQueueCursorJournalNoDuplicateTest
Tests run: 1, Failures: 0, Errors: 0, Skipped: 0, Time elapsed: 0.548 sec
Running org.apache.activemq.broker.region.cursors.StoreQueueCursorKahaDBNoDuplicateTest
Tests run: 1, Failures: 0, Errors: 0, Skipped: 0, Time elapsed: 0.985 sec
Running org.apache.activemq.broker.region.cursors.StoreQueueCursorMemoryNoDuplicateTest
Tests run: 1, Failures: 0, Errors: 0, Skipped: 0, Time elapsed: 0.383 sec
Running org.apache.activemq.broker.region.cursors.StoreQueueCursorNoDuplicateTest
Tests run: 1, Failures: 0, Errors: 0, Skipped: 0, Time elapsed: 0.994 sec
Running org.apache.activemq.broker.region.group.MessageGroupHashBucketTest
Tests run: 2, Failures: 0, Errors: 0, Skipped: 0, Time elapsed: 0.027 sec
Running org.apache.activemq.broker.region.group.MessageGroupMapTest
Tests run: 2, Failures: 0, Errors: 0, Skipped: 0, Time elapsed: 0.045 sec
Running org.apache.activemq.broker.region.group.MessageGroupTest
Tests run: 3, Failures: 0, Errors: 0, Skipped: 0, Time elapsed: 1.002 sec
Running org.apache.activemq.broker.scheduler.CronParserTest
Tests run: 13, Failures: 0, Errors: 0, Skipped: 0, Time elapsed: 0.176 sec
Running org.apache.activemq.broker.scheduler.JmsCronSchedulerTest
Tests run: 2, Failures: 0, Errors: 0, Skipped: 0, Time elapsed: 198.367 sec
Running org.apache.activemq.broker.scheduler.JmsSchedulerTest
Tests run: 5, Failures: 0, Errors: 0, Skipped: 0, Time elapsed: 86.708 sec
Running org.apache.activemq.broker.scheduler.JobSchedulerManagementTest
Tests run: 7, Failures: 0, Errors: 0, Skipped: 0, Time elapsed: 74.89 sec
Running org.apache.activemq.broker.scheduler.JobSchedulerStoreTest
Tests run: 1, Failures: 0, Errors: 0, Skipped: 0, Time elapsed: 2.096 sec
Running org.apache.activemq.broker.scheduler.JobSchedulerTest
Tests run: 9, Failures: 0, Errors: 0, Skipped: 0, Time elapsed: 53.463 sec
Running org.apache.activemq.broker.store.DefaultStoreRecoveryBrokerTest
Tests run: 9, Failures: 0, Errors: 0, Skipped: 0, Time elapsed: 33.128 sec
Running org.apache.activemq.broker.store.RecoverExpiredMessagesTest
Tests run: 4, Failures: 0, Errors: 0, Skipped: 0, Time elapsed: 30.164 sec
Running org.apache.activemq.broker.store.TransactionStoreTest
Tests run: 1, Failures: 0, Errors: 0, Skipped: 0, Time elapsed: 0.29 sec
Running org.apache.activemq.broker.util.PluginBrokerTest
Tests run: 1, Failures: 0, Errors: 0, Skipped: 0, Time elapsed: 2.422 sec
Running org.apache.activemq.broker.util.RedeliveryPluginTest
Tests run: 1, Failures: 0, Errors: 0, Skipped: 0, Time elapsed: 0.159 sec
Running org.apache.activemq.broker.util.TimeStampingBrokerPluginTest
Tests run: 3, Failures: 0, Errors: 0, Skipped: 0, Time elapsed: 6.546 sec
Running org.apache.activemq.broker.util.TraceBrokerPathPluginTest
Tests run: 1, Failures: 0, Errors: 0, Skipped: 0, Time elapsed: 2.669 sec
Running org.apache.activemq.broker.virtual.CompositeQueueTest
Tests run: 1, Failures: 0, Errors: 0, Skipped: 0, Time elapsed: 1.065 sec
Running org.apache.activemq.broker.virtual.CompositeTopicTest
Tests run: 1, Failures: 0, Errors: 0, Skipped: 0, Time elapsed: 1.383 sec
Running org.apache.activemq.broker.virtual.FilteredQueueTest
Tests run: 1, Failures: 0, Errors: 0, Skipped: 0, Time elapsed: 1.671 sec
Running org.apache.activemq.broker.virtual.MirroredQueueCorrectMemoryUsageTest
Tests run: 1, Failures: 0, Errors: 0, Skipped: 0, Time elapsed: 7.955 sec
Running org.apache.activemq.broker.virtual.MirroredQueueTest
Tests run: 2, Failures: 0, Errors: 0, Skipped: 0, Time elapsed: 0.844 sec
Running org.apache.activemq.broker.virtual.MirroredQueueUsingVirtualTopicQueueTest
Tests run: 2, Failures: 0, Errors: 0, Skipped: 0, Time elapsed: 0.768 sec
Running org.apache.activemq.broker.virtual.VirtualTopicDLQTest
Tests run: 1, Failures: 0, Errors: 0, Skipped: 0, Time elapsed: 7.328 sec
Running org.apache.activemq.broker.virtual.VirtualTopicDisconnectSelectorTest
Tests run: 1, Failures: 0, Errors: 0, Skipped: 0, Time elapsed: 2.224 sec
Running org.apache.activemq.broker.virtual.VirtualTopicPubSubTest
Tests run: 2, Failures: 0, Errors: 0, Skipped: 0, Time elapsed: 1.012 sec
Running org.apache.activemq.broker.virtual.VirtualTopicPubSubUsingXBeanTest
Tests run: 2, Failures: 0, Errors: 0, Skipped: 0, Time elapsed: 0.915 sec
Running org.apache.activemq.broker.virtual.VirtualTopicSelectorTest
Tests run: 1, Failures: 0, Errors: 0, Skipped: 0, Time elapsed: 1.792 sec
Running org.apache.activemq.broker.virtual.VirtualTopicsAndDurableSubsTest
Tests run: 20, Failures: 0, Errors: 0, Skipped: 0, Time elapsed: 49.063 sec
Running org.apache.activemq.bugs.AMQ1687Test
Tests run: 1, Failures: 0, Errors: 0, Skipped: 0, Time elapsed: 2.574 sec
Running org.apache.activemq.bugs.AMQ1853Test
Tests run: 1, Failures: 0, Errors: 0, Skipped: 0, Time elapsed: 7.355 sec
Running org.apache.activemq.bugs.AMQ1893Test
Tests run: 1, Failures: 0, Errors: 0, Skipped: 0, Time elapsed: 18.259 sec
Running org.apache.activemq.bugs.AMQ1917Test
Tests run: 1, Failures: 0, Errors: 0, Skipped: 0, Time elapsed: 4.77 sec
Running org.apache.activemq.bugs.AMQ1936Test
Tests run: 1, Failures: 0, Errors: 0, Skipped: 0, Time elapsed: 36.699 sec
Running org.apache.activemq.bugs.AMQ2021Test
Tests run: 1, Failures: 0, Errors: 0, Skipped: 0, Time elapsed: 4.262 sec
Running org.apache.activemq.bugs.AMQ2084Test
Tests run: 2, Failures: 0, Errors: 0, Skipped: 0, Time elapsed: 8.829 sec
Running org.apache.activemq.bugs.AMQ2102Test
Tests run: 2, Failures: 0, Errors: 0, Skipped: 0, Time elapsed: 54.017 sec
Running org.apache.activemq.bugs.AMQ2103Test
Tests run: 2, Failures: 0, Errors: 0, Skipped: 0, Time elapsed: 0.83 sec
Running org.apache.activemq.bugs.AMQ2149KahaDBTest

Results :

Failed tests:   testAsyncCallbackIsFaster(org.apache.activemq.JmsSendWithAsyncCallbackTest)

Tests run: 1228, Failures: 1, Errors: 0, Skipped: 0

mojoFailed org.apache.maven.plugins:maven-surefire-plugin:2.12.3(default-test)
[JENKINS] Recording test results
projectFailed org.apache.activemq:activemq-core:5.8-SNAPSHOT

Build failed in Jenkins: ActiveMQ » ActiveMQ :: Core #1089

Posted by Apache Jenkins Server <je...@builds.apache.org>.
See <https://builds.apache.org/job/ActiveMQ/org.apache.activemq$activemq-core/1089/changes>

Changes:

[gtully] remove dud import

[gtully] https://issues.apache.org/jira/browse/AMQ-4091 - apply destination policy to temp topics, allows a memory limit to be specified to partition temp dest usage and enable producer flow control

[dejanb] [maven-release-plugin] prepare for next development iteration

[dejanb] [maven-release-plugin] prepare release activemq-5.7.0

[dejanb] [maven-release-plugin] rollback the release of activemq-parent-5.7.0

[dejanb] [maven-release-plugin] prepare release activemq-parent-5.7.0

[gtully] add verification of blocking via full advisory - odd that advisory arrives late, hmm

[dejanb] [maven-release-plugin] rollback the release of activemq-5.7.0

[dejanb] [maven-release-plugin] prepare for next development iteration

[dejanb] [maven-release-plugin] prepare release activemq-5.7.0

[dejanb] rolling back version because of failed release:perform

[dejanb] [maven-release-plugin] prepare release activemq-5.7.0

------------------------------------------
[...truncated 182 lines...]
Tests run: 1, Failures: 0, Errors: 0, Skipped: 0, Time elapsed: 1.653 sec
Running org.apache.activemq.JmsTopicRequestReplyTest
Tests run: 2, Failures: 0, Errors: 0, Skipped: 0, Time elapsed: 0.788 sec
Running org.apache.activemq.JmsTopicSelectorTest
Tests run: 3, Failures: 0, Errors: 0, Skipped: 0, Time elapsed: 8.801 sec
Running org.apache.activemq.JmsTopicSendReceiveSubscriberTest
Tests run: 1, Failures: 0, Errors: 0, Skipped: 0, Time elapsed: 0.711 sec
Running org.apache.activemq.JmsTopicSendReceiveTest
Tests run: 1, Failures: 0, Errors: 0, Skipped: 0, Time elapsed: 0.713 sec
Running org.apache.activemq.JmsTopicSendReceiveWithTwoConnectionsTest
Tests run: 1, Failures: 0, Errors: 0, Skipped: 0, Time elapsed: 0.726 sec
Running org.apache.activemq.JmsTopicSendReceiveWithTwoConnectionsWithJMXTest
Tests run: 1, Failures: 0, Errors: 0, Skipped: 0, Time elapsed: 0.718 sec
Running org.apache.activemq.JmsTopicSendSameMessageTest
Tests run: 1, Failures: 0, Errors: 0, Skipped: 0, Time elapsed: 0.728 sec
Running org.apache.activemq.JmsTopicTransactionTest
Tests run: 14, Failures: 0, Errors: 0, Skipped: 0, Time elapsed: 20.073 sec
Running org.apache.activemq.JmsTopicWildcardSendReceiveTest
Tests run: 4, Failures: 0, Errors: 0, Skipped: 0, Time elapsed: 1.943 sec
Running org.apache.activemq.LargeStreamletTest
Tests run: 1, Failures: 0, Errors: 0, Skipped: 0, Time elapsed: 1.596 sec
Running org.apache.activemq.MessageEvictionTest
Tests run: 3, Failures: 0, Errors: 0, Skipped: 0, Time elapsed: 90.111 sec
Running org.apache.activemq.MessageListenerRedeliveryTest
Tests run: 4, Failures: 0, Errors: 0, Skipped: 0, Time elapsed: 16.986 sec
Running org.apache.activemq.MessageTransformationTest
Tests run: 2, Failures: 0, Errors: 0, Skipped: 0, Time elapsed: 0.153 sec
Running org.apache.activemq.OnePrefetchAsyncConsumerTest
Tests run: 1, Failures: 0, Errors: 0, Skipped: 0, Time elapsed: 6.588 sec
Running org.apache.activemq.OptimizedAckTest
Tests run: 3, Failures: 0, Errors: 0, Skipped: 0, Time elapsed: 14.848 sec
Running org.apache.activemq.PerDestinationStoreLimitTest
Tests run: 2, Failures: 0, Errors: 0, Skipped: 0, Time elapsed: 39.795 sec
Running org.apache.activemq.ProducerFlowControlSendFailTest
Tests run: 7, Failures: 0, Errors: 0, Skipped: 0, Time elapsed: 22.036 sec
Running org.apache.activemq.ProducerFlowControlTest
Tests run: 6, Failures: 0, Errors: 0, Skipped: 0, Time elapsed: 28.251 sec
Running org.apache.activemq.QueueConsumerPriorityTest
Tests run: 1, Failures: 0, Errors: 0, Skipped: 0, Time elapsed: 5.415 sec
Running org.apache.activemq.ReconnectWithSameClientIDTest
Tests run: 2, Failures: 0, Errors: 0, Skipped: 0, Time elapsed: 4.807 sec
Running org.apache.activemq.RedeliveryPolicyTest
Tests run: 10, Failures: 0, Errors: 0, Skipped: 0, Time elapsed: 14.824 sec
Running org.apache.activemq.RemoveDestinationTest
Tests run: 2, Failures: 0, Errors: 0, Skipped: 0, Time elapsed: 26.116 sec
Running org.apache.activemq.TimeStampTest
Tests run: 1, Failures: 0, Errors: 0, Skipped: 0, Time elapsed: 4.612 sec
Running org.apache.activemq.TransactionContextTest
Tests run: 2, Failures: 0, Errors: 0, Skipped: 0, Time elapsed: 2.263 sec
Running org.apache.activemq.ZeroPrefetchConsumerTest
Tests run: 11, Failures: 0, Errors: 0, Skipped: 0, Time elapsed: 29.585 sec
Running org.apache.activemq.advisory.ConsumerListenerTest
Tests run: 2, Failures: 0, Errors: 0, Skipped: 0, Time elapsed: 0.796 sec
Running org.apache.activemq.advisory.DestinationListenerTest
Tests run: 3, Failures: 0, Errors: 0, Skipped: 0, Time elapsed: 7.944 sec
Running org.apache.activemq.advisory.MasterSlaveTempQueueMemoryTest
Tests run: 6, Failures: 0, Errors: 0, Skipped: 0, Time elapsed: 42.658 sec
Running org.apache.activemq.advisory.ProducerListenerTest
Tests run: 2, Failures: 0, Errors: 0, Skipped: 0, Time elapsed: 0.764 sec
Running org.apache.activemq.advisory.TempDestDeleteTest
Tests run: 2, Failures: 0, Errors: 0, Skipped: 0, Time elapsed: 0.8 sec
Running org.apache.activemq.advisory.TempDestLoadTest
Tests run: 2, Failures: 0, Errors: 0, Skipped: 0, Time elapsed: 22.65 sec
Running org.apache.activemq.advisory.TempQueueMemoryTest
Tests run: 2, Failures: 0, Errors: 0, Skipped: 0, Time elapsed: 24.503 sec
Running org.apache.activemq.blob.BlobTransferPolicyUriTest
Tests run: 1, Failures: 0, Errors: 0, Skipped: 0, Time elapsed: 0.157 sec
Running org.apache.activemq.blob.FTPBlobDownloadStrategyTest
Tests run: 3, Failures: 0, Errors: 0, Skipped: 0, Time elapsed: 1.782 sec
Running org.apache.activemq.blob.FTPBlobTest
Tests run: 1, Failures: 0, Errors: 0, Skipped: 0, Time elapsed: 2.021 sec
Running org.apache.activemq.blob.FTPBlobUploadStrategyTest
Tests run: 2, Failures: 0, Errors: 0, Skipped: 0, Time elapsed: 0.984 sec
Running org.apache.activemq.blob.FilesystemBlobTest
Tests run: 1, Failures: 0, Errors: 0, Skipped: 0, Time elapsed: 1.702 sec
Running org.apache.activemq.broker.BrokerRedeliveryTest
Tests run: 1, Failures: 0, Errors: 0, Skipped: 0, Time elapsed: 8.297 sec
Running org.apache.activemq.broker.BrokerServiceTest
Tests run: 5, Failures: 0, Errors: 0, Skipped: 0, Time elapsed: 4.703 sec
Running org.apache.activemq.broker.BrokerTest
Tests run: 129, Failures: 0, Errors: 0, Skipped: 0, Time elapsed: 23.524 sec
Running org.apache.activemq.broker.ConcurrentConnectSimulationTest
Tests run: 1, Failures: 0, Errors: 0, Skipped: 0, Time elapsed: 0.599 sec
Running org.apache.activemq.broker.CreateDestinationsOnStartupViaXBeanTest
Tests run: 1, Failures: 0, Errors: 0, Skipped: 0, Time elapsed: 2.022 sec
Running org.apache.activemq.broker.DedicatedTaskRunnerBrokerTest
Tests run: 129, Failures: 0, Errors: 0, Skipped: 0, Time elapsed: 23.966 sec
Running org.apache.activemq.broker.DoubleSubscriptionTest
Tests run: 1, Failures: 0, Errors: 0, Skipped: 0, Time elapsed: 2.536 sec
Running org.apache.activemq.broker.DurablePersistentFalseRestartTest
Tests run: 1, Failures: 0, Errors: 0, Skipped: 0, Time elapsed: 6.741 sec
Running org.apache.activemq.broker.JdbcXARecoveryBrokerTest
Tests run: 16, Failures: 0, Errors: 0, Skipped: 0, Time elapsed: 65.41 sec
Running org.apache.activemq.broker.MessageExpirationTest
Tests run: 13, Failures: 0, Errors: 0, Skipped: 0, Time elapsed: 23.148 sec
Running org.apache.activemq.broker.OutOfOrderXMLTest
Tests run: 1, Failures: 0, Errors: 0, Skipped: 0, Time elapsed: 1.315 sec
Running org.apache.activemq.broker.QueueMbeanRestartTest
Tests run: 2, Failures: 0, Errors: 0, Skipped: 0, Time elapsed: 4.927 sec
Running org.apache.activemq.broker.QueueSubscriptionTest
Tests run: 8, Failures: 0, Errors: 0, Skipped: 0, Time elapsed: 4.033 sec
Running org.apache.activemq.broker.ReconnectWithJMXEnabledTest
Tests run: 1, Failures: 0, Errors: 0, Skipped: 0, Time elapsed: 4.613 sec
Running org.apache.activemq.broker.RecoveryBrokerTest
Tests run: 9, Failures: 0, Errors: 0, Skipped: 0, Time elapsed: 28.661 sec
Running org.apache.activemq.broker.RedeliveryRestartTest
Tests run: 2, Failures: 0, Errors: 0, Skipped: 0, Time elapsed: 11.462 sec
Running org.apache.activemq.broker.SpringTest
Tests run: 1, Failures: 0, Errors: 0, Skipped: 0, Time elapsed: 1.633 sec
Running org.apache.activemq.broker.TopicSubscriptionTest
Tests run: 8, Failures: 0, Errors: 0, Skipped: 0, Time elapsed: 6.748 sec
Running org.apache.activemq.broker.XARecoveryBrokerTest
Tests run: 16, Failures: 0, Errors: 0, Skipped: 0, Time elapsed: 69.672 sec
Running org.apache.activemq.broker.advisory.AdvisoryBrokerTest
Tests run: 6, Failures: 0, Errors: 0, Skipped: 0, Time elapsed: 0.891 sec
Running org.apache.activemq.broker.advisory.AdvisoryDuplexNetworkBridgeTest
Tests run: 2, Failures: 0, Errors: 0, Skipped: 0, Time elapsed: 11.14 sec
Running org.apache.activemq.broker.advisory.AdvisoryJmxTest
Tests run: 1, Failures: 0, Errors: 0, Skipped: 0, Time elapsed: 0.717 sec
Running org.apache.activemq.broker.advisory.AdvisoryNetworkBridgeTest
Tests run: 2, Failures: 0, Errors: 0, Skipped: 0, Time elapsed: 10.685 sec
Running org.apache.activemq.broker.ft.DbRestartJDBCQueueMasterSlaveLeaseQuiesceTest
Tests run: 3, Failures: 0, Errors: 0, Skipped: 0, Time elapsed: 44.297 sec
Running org.apache.activemq.broker.ft.DbRestartJDBCQueueMasterSlaveLeaseTest
Tests run: 2, Failures: 0, Errors: 0, Skipped: 0, Time elapsed: 24.081 sec
Running org.apache.activemq.broker.ft.DbRestartJDBCQueueMasterSlaveTest
Running org.apache.activemq.broker.ft.JDBCQueueMasterSlaveTest
Tests run: 2, Failures: 0, Errors: 0, Skipped: 0, Time elapsed: 15.188 sec
Running org.apache.activemq.broker.ft.MasterSlaveProducerFlowControlTest
Tests run: 6, Failures: 0, Errors: 0, Skipped: 0, Time elapsed: 25.72 sec
Running org.apache.activemq.broker.ft.MasterSlaveSlaveDieTest
Tests run: 1, Failures: 0, Errors: 0, Skipped: 0, Time elapsed: 2.435 sec
Running org.apache.activemq.broker.ft.MasterSlaveSlaveShutdownTest
Tests run: 1, Failures: 0, Errors: 0, Skipped: 0, Time elapsed: 32.322 sec
Running org.apache.activemq.broker.ft.QueueMasterSlaveSingleUrlTest
Tests run: 2, Failures: 0, Errors: 0, Skipped: 0, Time elapsed: 14.835 sec
Running org.apache.activemq.broker.ft.QueueMasterSlaveTest
Tests run: 2, Failures: 0, Errors: 0, Skipped: 0, Time elapsed: 13.321 sec
Running org.apache.activemq.broker.ft.QueueMasterSlaveTestUsingSharedFileTest
Tests run: 2, Failures: 0, Errors: 0, Skipped: 0, Time elapsed: 27.545 sec
Running org.apache.activemq.broker.ft.QueueMasterSlaveUsingMasterConnectorElementCompositeQueueTest
Tests run: 2, Failures: 0, Errors: 0, Skipped: 0, Time elapsed: 15.97 sec
Running org.apache.activemq.broker.ft.QueueMasterSlaveUsingMasterConnectorElementTest
Tests run: 2, Failures: 0, Errors: 0, Skipped: 0, Time elapsed: 13.979 sec
Running org.apache.activemq.broker.ft.TopicMasterSlaveTest
Tests run: 2, Failures: 0, Errors: 0, Skipped: 0, Time elapsed: 13.962 sec
Running org.apache.activemq.broker.ft.TransactedTopicMasterSlaveTest
Tests run: 15, Failures: 0, Errors: 0, Skipped: 0, Time elapsed: 83.099 sec
Running org.apache.activemq.broker.jmx.BrokerViewSlowStoreStartupTest
Tests run: 1, Failures: 0, Errors: 0, Skipped: 0, Time elapsed: 1.005 sec
Running org.apache.activemq.broker.jmx.MBeanOperationTimeoutTest
Tests run: 1, Failures: 0, Errors: 0, Skipped: 0, Time elapsed: 15.129 sec
Running org.apache.activemq.broker.jmx.MBeanTest
Tests run: 19, Failures: 0, Errors: 0, Skipped: 0, Time elapsed: 54.875 sec
Running org.apache.activemq.broker.jmx.PurgeTest
Tests run: 5, Failures: 0, Errors: 0, Skipped: 0, Time elapsed: 20.386 sec
Running org.apache.activemq.broker.jmx.TransportConnectorMBeanTest
Tests run: 2, Failures: 0, Errors: 0, Skipped: 0, Time elapsed: 4.598 sec
Running org.apache.activemq.broker.mKahaDBXARecoveryBrokerTest
Tests run: 16, Failures: 0, Errors: 0, Skipped: 0, Time elapsed: 81.487 sec
Running org.apache.activemq.broker.message.security.MessageAuthenticationTest
Tests run: 1, Failures: 0, Errors: 0, Skipped: 0, Time elapsed: 0.702 sec
Running org.apache.activemq.broker.policy.AbortSlowConsumerTest
Tests run: 19, Failures: 0, Errors: 0, Skipped: 0, Time elapsed: 113.61 sec
Running org.apache.activemq.broker.policy.DeadLetterTest
Tests run: 4, Failures: 0, Errors: 0, Skipped: 0, Time elapsed: 2.357 sec
Running org.apache.activemq.broker.policy.DestinationCursorConfigTest
Tests run: 2, Failures: 0, Errors: 0, Skipped: 0, Time elapsed: 1.499 sec
Running org.apache.activemq.broker.policy.IndividualDeadLetterTest
Tests run: 5, Failures: 0, Errors: 0, Skipped: 0, Time elapsed: 4.519 sec
Running org.apache.activemq.broker.policy.IndividualDeadLetterViaXmlTest
Tests run: 4, Failures: 0, Errors: 0, Skipped: 0, Time elapsed: 3.509 sec
Running org.apache.activemq.broker.policy.MessageListenerDeadLetterTest
Tests run: 4, Failures: 0, Errors: 0, Skipped: 0, Time elapsed: 3.015 sec
Running org.apache.activemq.broker.policy.NoConsumerDeadLetterTest
Tests run: 5, Failures: 0, Errors: 0, Skipped: 0, Time elapsed: 1.881 sec
Running org.apache.activemq.broker.policy.NoRetryDeadLetterTest
Tests run: 4, Failures: 0, Errors: 0, Skipped: 0, Time elapsed: 1.021 sec
Running org.apache.activemq.broker.policy.PerDurableConsumerDeadLetterTest
Tests run: 4, Failures: 0, Errors: 0, Skipped: 0, Time elapsed: 2.351 sec
Running org.apache.activemq.broker.policy.PriorityNetworkDispatchPolicyTest
Tests run: 1, Failures: 0, Errors: 0, Skipped: 0, Time elapsed: 0.186 sec
Running org.apache.activemq.broker.policy.RoundRobinDispatchPolicyTest
Tests run: 9, Failures: 0, Errors: 0, Skipped: 0, Time elapsed: 3.762 sec
Running org.apache.activemq.broker.policy.SimpleDispatchPolicyTest
Tests run: 8, Failures: 0, Errors: 0, Skipped: 0, Time elapsed: 3.686 sec
Running org.apache.activemq.broker.policy.StrictOrderDispatchPolicyTest
Tests run: 8, Failures: 0, Errors: 0, Skipped: 0, Time elapsed: 4.055 sec
Running org.apache.activemq.broker.region.DestinationGCTest
Tests run: 2, Failures: 0, Errors: 0, Skipped: 0, Time elapsed: 13.677 sec
Running org.apache.activemq.broker.region.DestinationRemoveRestartTest
Tests run: 2, Failures: 0, Errors: 0, Skipped: 0, Time elapsed: 3.373 sec
Running org.apache.activemq.broker.region.QueueDuplicatesFromStoreTest
Tests run: 2, Failures: 0, Errors: 0, Skipped: 0, Time elapsed: 17.123 sec
Running org.apache.activemq.broker.region.QueueOptimizedDispatchExceptionTest
Tests run: 1, Failures: 0, Errors: 0, Skipped: 0, Time elapsed: 0.42 sec
Running org.apache.activemq.broker.region.QueuePurgeTest
Tests run: 3, Failures: 0, Errors: 0, Skipped: 0, Time elapsed: 365.082 sec
Running org.apache.activemq.broker.region.UniquePropertyMessageEvictionStrategyTest
Tests run: 1, Failures: 0, Errors: 0, Skipped: 0, Time elapsed: 11.749 sec
Running org.apache.activemq.broker.region.cursors.CursorDurableTest
Tests run: 2, Failures: 0, Errors: 0, Skipped: 0, Time elapsed: 4.331 sec
Running org.apache.activemq.broker.region.cursors.CursorQueueStoreTest
Tests run: 5, Failures: 0, Errors: 0, Skipped: 0, Time elapsed: 103.794 sec
Running org.apache.activemq.broker.region.cursors.FilePendingMessageCursorTest
Tests run: 2, Failures: 0, Errors: 0, Skipped: 0, Time elapsed: 2.365 sec
Running org.apache.activemq.broker.region.cursors.NegativeQueueTest
Tests run: 4, Failures: 0, Errors: 0, Skipped: 0, Time elapsed: 109.319 sec
Running org.apache.activemq.broker.region.cursors.OrderPendingListTest
Tests run: 9, Failures: 0, Errors: 0, Skipped: 0, Time elapsed: 0.272 sec
Running org.apache.activemq.broker.region.cursors.PrioritizedPendingListTest
Tests run: 7, Failures: 0, Errors: 0, Skipped: 0, Time elapsed: 0.281 sec
Running org.apache.activemq.broker.region.cursors.StoreBasedCursorTest
Tests run: 5, Failures: 0, Errors: 0, Skipped: 0, Time elapsed: 14.973 sec
Running org.apache.activemq.broker.region.cursors.StoreQueueCursorJDBCNoDuplicateTest
Tests run: 1, Failures: 0, Errors: 0, Skipped: 0, Time elapsed: 3.171 sec
Running org.apache.activemq.broker.region.cursors.StoreQueueCursorJournalNoDuplicateTest
Tests run: 1, Failures: 0, Errors: 0, Skipped: 0, Time elapsed: 0.595 sec
Running org.apache.activemq.broker.region.cursors.StoreQueueCursorKahaDBNoDuplicateTest
Tests run: 1, Failures: 0, Errors: 0, Skipped: 0, Time elapsed: 1.145 sec
Running org.apache.activemq.broker.region.cursors.StoreQueueCursorMemoryNoDuplicateTest
Tests run: 1, Failures: 0, Errors: 0, Skipped: 0, Time elapsed: 0.373 sec
Running org.apache.activemq.broker.region.cursors.StoreQueueCursorNoDuplicateTest
Tests run: 1, Failures: 0, Errors: 0, Skipped: 0, Time elapsed: 1.161 sec
Running org.apache.activemq.broker.region.group.MessageGroupHashBucketTest
Tests run: 2, Failures: 0, Errors: 0, Skipped: 0, Time elapsed: 0.041 sec
Running org.apache.activemq.broker.region.group.MessageGroupMapTest
Tests run: 2, Failures: 0, Errors: 0, Skipped: 0, Time elapsed: 0.042 sec
Running org.apache.activemq.broker.region.group.MessageGroupTest
Tests run: 3, Failures: 0, Errors: 0, Skipped: 0, Time elapsed: 1.132 sec
Running org.apache.activemq.broker.scheduler.CronParserTest
Tests run: 13, Failures: 0, Errors: 0, Skipped: 0, Time elapsed: 0.174 sec
Running org.apache.activemq.broker.scheduler.JmsCronSchedulerTest
Tests run: 2, Failures: 0, Errors: 0, Skipped: 0, Time elapsed: 200.386 sec
Running org.apache.activemq.broker.scheduler.JmsSchedulerTest
Tests run: 5, Failures: 0, Errors: 0, Skipped: 0, Time elapsed: 88.586 sec
Running org.apache.activemq.broker.scheduler.JobSchedulerManagementTest
Tests run: 7, Failures: 0, Errors: 0, Skipped: 0, Time elapsed: 76.589 sec
Running org.apache.activemq.broker.scheduler.JobSchedulerStoreTest
Tests run: 1, Failures: 0, Errors: 0, Skipped: 0, Time elapsed: 7.945 sec
Running org.apache.activemq.broker.scheduler.JobSchedulerTest

Results :

Tests run: 1152, Failures: 0, Errors: 0, Skipped: 0

mojoFailed org.apache.maven.plugins:maven-surefire-plugin:2.12.3(default-test)
[JENKINS] Recording test results
projectFailed org.apache.activemq:activemq-core:5.8-SNAPSHOT

Build failed in Jenkins: ActiveMQ » ActiveMQ :: Core #1088

Posted by Apache Jenkins Server <je...@builds.apache.org>.
See <https://builds.apache.org/job/ActiveMQ/org.apache.activemq$activemq-core/1088/changes>

Changes:

[dejanb] [maven-release-plugin] prepare for next development iteration

[dejanb] [maven-release-plugin] prepare release activemq-5.7.0

------------------------------------------
[...truncated 236 lines...]
Tests run: 3, Failures: 0, Errors: 0, Skipped: 0, Time elapsed: 7.946 sec
Running org.apache.activemq.advisory.MasterSlaveTempQueueMemoryTest
Tests run: 6, Failures: 0, Errors: 0, Skipped: 0, Time elapsed: 40.643 sec
Running org.apache.activemq.advisory.ProducerListenerTest
Tests run: 2, Failures: 0, Errors: 0, Skipped: 0, Time elapsed: 0.838 sec
Running org.apache.activemq.advisory.TempDestDeleteTest
Tests run: 2, Failures: 0, Errors: 0, Skipped: 0, Time elapsed: 0.863 sec
Running org.apache.activemq.advisory.TempDestLoadTest
Tests run: 2, Failures: 0, Errors: 0, Skipped: 0, Time elapsed: 21.189 sec
Running org.apache.activemq.advisory.TempQueueMemoryTest
Tests run: 2, Failures: 0, Errors: 0, Skipped: 0, Time elapsed: 19.011 sec
Running org.apache.activemq.blob.BlobTransferPolicyUriTest
Tests run: 1, Failures: 0, Errors: 0, Skipped: 0, Time elapsed: 0.124 sec
Running org.apache.activemq.blob.FTPBlobDownloadStrategyTest
Tests run: 3, Failures: 0, Errors: 0, Skipped: 0, Time elapsed: 1.523 sec
Running org.apache.activemq.blob.FTPBlobTest
Tests run: 1, Failures: 0, Errors: 0, Skipped: 0, Time elapsed: 1.8 sec
Running org.apache.activemq.blob.FTPBlobUploadStrategyTest
Tests run: 2, Failures: 0, Errors: 0, Skipped: 0, Time elapsed: 0.865 sec
Running org.apache.activemq.blob.FilesystemBlobTest
Tests run: 1, Failures: 0, Errors: 0, Skipped: 0, Time elapsed: 1.535 sec
Running org.apache.activemq.broker.BrokerRedeliveryTest
Tests run: 1, Failures: 0, Errors: 0, Skipped: 0, Time elapsed: 8.21 sec
Running org.apache.activemq.broker.BrokerServiceTest
Tests run: 5, Failures: 0, Errors: 0, Skipped: 0, Time elapsed: 4.491 sec
Running org.apache.activemq.broker.BrokerTest
Tests run: 129, Failures: 0, Errors: 0, Skipped: 0, Time elapsed: 22.79 sec
Running org.apache.activemq.broker.ConcurrentConnectSimulationTest
Tests run: 1, Failures: 0, Errors: 0, Skipped: 0, Time elapsed: 0.489 sec
Running org.apache.activemq.broker.CreateDestinationsOnStartupViaXBeanTest
Tests run: 1, Failures: 0, Errors: 0, Skipped: 0, Time elapsed: 1.687 sec
Running org.apache.activemq.broker.DedicatedTaskRunnerBrokerTest
Tests run: 129, Failures: 0, Errors: 0, Skipped: 0, Time elapsed: 20.836 sec
Running org.apache.activemq.broker.DoubleSubscriptionTest
Tests run: 1, Failures: 0, Errors: 0, Skipped: 0, Time elapsed: 2.523 sec
Running org.apache.activemq.broker.DurablePersistentFalseRestartTest
Tests run: 1, Failures: 0, Errors: 0, Skipped: 0, Time elapsed: 6.654 sec
Running org.apache.activemq.broker.JdbcXARecoveryBrokerTest
Tests run: 16, Failures: 0, Errors: 0, Skipped: 0, Time elapsed: 58.944 sec
Running org.apache.activemq.broker.MessageExpirationTest
Tests run: 13, Failures: 0, Errors: 0, Skipped: 0, Time elapsed: 22.114 sec
Running org.apache.activemq.broker.OutOfOrderXMLTest
Tests run: 1, Failures: 0, Errors: 0, Skipped: 0, Time elapsed: 1.112 sec
Running org.apache.activemq.broker.QueueMbeanRestartTest
Tests run: 2, Failures: 0, Errors: 0, Skipped: 0, Time elapsed: 3.354 sec
Running org.apache.activemq.broker.QueueSubscriptionTest
Tests run: 8, Failures: 0, Errors: 0, Skipped: 0, Time elapsed: 2.573 sec
Running org.apache.activemq.broker.ReconnectWithJMXEnabledTest
Tests run: 1, Failures: 0, Errors: 0, Skipped: 0, Time elapsed: 4.543 sec
Running org.apache.activemq.broker.RecoveryBrokerTest
Tests run: 9, Failures: 0, Errors: 0, Skipped: 0, Time elapsed: 28.474 sec
Running org.apache.activemq.broker.RedeliveryRestartTest
Tests run: 2, Failures: 0, Errors: 0, Skipped: 0, Time elapsed: 11.49 sec
Running org.apache.activemq.broker.SpringTest
Tests run: 1, Failures: 0, Errors: 0, Skipped: 0, Time elapsed: 2.177 sec
Running org.apache.activemq.broker.TopicSubscriptionTest
Tests run: 8, Failures: 0, Errors: 0, Skipped: 0, Time elapsed: 3.684 sec
Running org.apache.activemq.broker.XARecoveryBrokerTest
Tests run: 16, Failures: 0, Errors: 0, Skipped: 0, Time elapsed: 68.499 sec
Running org.apache.activemq.broker.advisory.AdvisoryBrokerTest
Tests run: 6, Failures: 0, Errors: 0, Skipped: 0, Time elapsed: 0.936 sec
Running org.apache.activemq.broker.advisory.AdvisoryDuplexNetworkBridgeTest
Tests run: 2, Failures: 0, Errors: 0, Skipped: 0, Time elapsed: 10.901 sec
Running org.apache.activemq.broker.advisory.AdvisoryJmxTest
Tests run: 1, Failures: 0, Errors: 0, Skipped: 0, Time elapsed: 0.745 sec
Running org.apache.activemq.broker.advisory.AdvisoryNetworkBridgeTest
Tests run: 2, Failures: 0, Errors: 0, Skipped: 0, Time elapsed: 10.665 sec
Running org.apache.activemq.broker.ft.DbRestartJDBCQueueMasterSlaveLeaseQuiesceTest
Tests run: 3, Failures: 0, Errors: 0, Skipped: 0, Time elapsed: 39.904 sec
Running org.apache.activemq.broker.ft.DbRestartJDBCQueueMasterSlaveLeaseTest
Tests run: 2, Failures: 0, Errors: 0, Skipped: 0, Time elapsed: 19.187 sec
Running org.apache.activemq.broker.ft.DbRestartJDBCQueueMasterSlaveTest
Running org.apache.activemq.broker.ft.JDBCQueueMasterSlaveTest
Tests run: 2, Failures: 0, Errors: 0, Skipped: 0, Time elapsed: 12.45 sec
Running org.apache.activemq.broker.ft.MasterSlaveProducerFlowControlTest
Tests run: 6, Failures: 0, Errors: 0, Skipped: 0, Time elapsed: 25.643 sec
Running org.apache.activemq.broker.ft.MasterSlaveSlaveDieTest
Tests run: 1, Failures: 0, Errors: 0, Skipped: 0, Time elapsed: 2.427 sec
Running org.apache.activemq.broker.ft.MasterSlaveSlaveShutdownTest
Tests run: 1, Failures: 0, Errors: 0, Skipped: 0, Time elapsed: 32.285 sec
Running org.apache.activemq.broker.ft.QueueMasterSlaveSingleUrlTest
Tests run: 2, Failures: 0, Errors: 0, Skipped: 0, Time elapsed: 13.685 sec
Running org.apache.activemq.broker.ft.QueueMasterSlaveTest
Tests run: 2, Failures: 0, Errors: 0, Skipped: 0, Time elapsed: 12.919 sec
Running org.apache.activemq.broker.ft.QueueMasterSlaveTestUsingSharedFileTest
Tests run: 2, Failures: 0, Errors: 0, Skipped: 0, Time elapsed: 27.489 sec
Running org.apache.activemq.broker.ft.QueueMasterSlaveUsingMasterConnectorElementCompositeQueueTest
Tests run: 2, Failures: 0, Errors: 0, Skipped: 0, Time elapsed: 13.49 sec
Running org.apache.activemq.broker.ft.QueueMasterSlaveUsingMasterConnectorElementTest
Tests run: 2, Failures: 0, Errors: 0, Skipped: 0, Time elapsed: 13.395 sec
Running org.apache.activemq.broker.ft.TopicMasterSlaveTest
Tests run: 2, Failures: 0, Errors: 0, Skipped: 0, Time elapsed: 13.416 sec
Running org.apache.activemq.broker.ft.TransactedTopicMasterSlaveTest
Tests run: 15, Failures: 0, Errors: 0, Skipped: 0, Time elapsed: 77.59 sec
Running org.apache.activemq.broker.jmx.BrokerViewSlowStoreStartupTest
Tests run: 1, Failures: 0, Errors: 0, Skipped: 0, Time elapsed: 0.99 sec
Running org.apache.activemq.broker.jmx.MBeanOperationTimeoutTest
Tests run: 1, Failures: 0, Errors: 0, Skipped: 0, Time elapsed: 9.214 sec
Running org.apache.activemq.broker.jmx.MBeanTest
Tests run: 19, Failures: 0, Errors: 0, Skipped: 0, Time elapsed: 54.797 sec
Running org.apache.activemq.broker.jmx.PurgeTest
Tests run: 5, Failures: 0, Errors: 0, Skipped: 0, Time elapsed: 15.499 sec
Running org.apache.activemq.broker.jmx.TransportConnectorMBeanTest
Tests run: 2, Failures: 0, Errors: 0, Skipped: 0, Time elapsed: 4.546 sec
Running org.apache.activemq.broker.mKahaDBXARecoveryBrokerTest
Tests run: 16, Failures: 0, Errors: 0, Skipped: 0, Time elapsed: 82.473 sec
Running org.apache.activemq.broker.message.security.MessageAuthenticationTest
Tests run: 1, Failures: 0, Errors: 0, Skipped: 0, Time elapsed: 0.678 sec
Running org.apache.activemq.broker.policy.AbortSlowConsumerTest
Tests run: 19, Failures: 0, Errors: 0, Skipped: 0, Time elapsed: 271.723 sec
Running org.apache.activemq.broker.policy.DeadLetterTest
Tests run: 4, Failures: 0, Errors: 0, Skipped: 0, Time elapsed: 2.499 sec
Running org.apache.activemq.broker.policy.DestinationCursorConfigTest
Tests run: 2, Failures: 0, Errors: 0, Skipped: 0, Time elapsed: 1.259 sec
Running org.apache.activemq.broker.policy.IndividualDeadLetterTest
Tests run: 5, Failures: 0, Errors: 0, Skipped: 0, Time elapsed: 4.608 sec
Running org.apache.activemq.broker.policy.IndividualDeadLetterViaXmlTest
Tests run: 4, Failures: 0, Errors: 0, Skipped: 0, Time elapsed: 3.526 sec
Running org.apache.activemq.broker.policy.MessageListenerDeadLetterTest
Tests run: 4, Failures: 0, Errors: 0, Skipped: 0, Time elapsed: 2.96 sec
Running org.apache.activemq.broker.policy.NoConsumerDeadLetterTest
Tests run: 5, Failures: 0, Errors: 0, Skipped: 0, Time elapsed: 1.774 sec
Running org.apache.activemq.broker.policy.NoRetryDeadLetterTest
Tests run: 4, Failures: 0, Errors: 0, Skipped: 0, Time elapsed: 1.089 sec
Running org.apache.activemq.broker.policy.PerDurableConsumerDeadLetterTest
Tests run: 4, Failures: 0, Errors: 0, Skipped: 0, Time elapsed: 2.412 sec
Running org.apache.activemq.broker.policy.PriorityNetworkDispatchPolicyTest
Tests run: 1, Failures: 0, Errors: 0, Skipped: 0, Time elapsed: 0.147 sec
Running org.apache.activemq.broker.policy.RoundRobinDispatchPolicyTest
Tests run: 9, Failures: 0, Errors: 0, Skipped: 0, Time elapsed: 2.923 sec
Running org.apache.activemq.broker.policy.SimpleDispatchPolicyTest
Tests run: 8, Failures: 0, Errors: 0, Skipped: 0, Time elapsed: 2.865 sec
Running org.apache.activemq.broker.policy.StrictOrderDispatchPolicyTest
Tests run: 8, Failures: 0, Errors: 0, Skipped: 0, Time elapsed: 2.789 sec
Running org.apache.activemq.broker.region.DestinationGCTest
Tests run: 2, Failures: 0, Errors: 0, Skipped: 0, Time elapsed: 14.572 sec
Running org.apache.activemq.broker.region.DestinationRemoveRestartTest
Tests run: 2, Failures: 0, Errors: 0, Skipped: 0, Time elapsed: 3.267 sec
Running org.apache.activemq.broker.region.QueueDuplicatesFromStoreTest
Tests run: 2, Failures: 0, Errors: 0, Skipped: 0, Time elapsed: 6.808 sec
Running org.apache.activemq.broker.region.QueueOptimizedDispatchExceptionTest
Tests run: 1, Failures: 0, Errors: 0, Skipped: 0, Time elapsed: 0.35 sec
Running org.apache.activemq.broker.region.QueuePurgeTest
Tests run: 3, Failures: 0, Errors: 0, Skipped: 0, Time elapsed: 81.618 sec
Running org.apache.activemq.broker.region.UniquePropertyMessageEvictionStrategyTest
Tests run: 1, Failures: 0, Errors: 0, Skipped: 0, Time elapsed: 11.797 sec
Running org.apache.activemq.broker.region.cursors.CursorDurableTest
Tests run: 2, Failures: 0, Errors: 0, Skipped: 0, Time elapsed: 4.194 sec
Running org.apache.activemq.broker.region.cursors.CursorQueueStoreTest
Tests run: 5, Failures: 0, Errors: 0, Skipped: 0, Time elapsed: 103.196 sec
Running org.apache.activemq.broker.region.cursors.FilePendingMessageCursorTest
Tests run: 2, Failures: 0, Errors: 0, Skipped: 0, Time elapsed: 1.771 sec
Running org.apache.activemq.broker.region.cursors.NegativeQueueTest
Tests run: 4, Failures: 0, Errors: 0, Skipped: 0, Time elapsed: 101.639 sec
Running org.apache.activemq.broker.region.cursors.OrderPendingListTest
Tests run: 9, Failures: 0, Errors: 0, Skipped: 0, Time elapsed: 0.244 sec
Running org.apache.activemq.broker.region.cursors.PrioritizedPendingListTest
Tests run: 7, Failures: 0, Errors: 0, Skipped: 0, Time elapsed: 0.327 sec
Running org.apache.activemq.broker.region.cursors.StoreBasedCursorTest
Tests run: 5, Failures: 0, Errors: 0, Skipped: 0, Time elapsed: 14.873 sec
Running org.apache.activemq.broker.region.cursors.StoreQueueCursorJDBCNoDuplicateTest
Tests run: 1, Failures: 0, Errors: 0, Skipped: 0, Time elapsed: 2.191 sec
Running org.apache.activemq.broker.region.cursors.StoreQueueCursorJournalNoDuplicateTest
Tests run: 1, Failures: 0, Errors: 0, Skipped: 0, Time elapsed: 0.547 sec
Running org.apache.activemq.broker.region.cursors.StoreQueueCursorKahaDBNoDuplicateTest
Tests run: 1, Failures: 0, Errors: 0, Skipped: 0, Time elapsed: 0.975 sec
Running org.apache.activemq.broker.region.cursors.StoreQueueCursorMemoryNoDuplicateTest
Tests run: 1, Failures: 0, Errors: 0, Skipped: 0, Time elapsed: 0.37 sec
Running org.apache.activemq.broker.region.cursors.StoreQueueCursorNoDuplicateTest
Tests run: 1, Failures: 0, Errors: 0, Skipped: 0, Time elapsed: 0.986 sec
Running org.apache.activemq.broker.region.group.MessageGroupHashBucketTest
Tests run: 2, Failures: 0, Errors: 0, Skipped: 0, Time elapsed: 0.028 sec
Running org.apache.activemq.broker.region.group.MessageGroupMapTest
Tests run: 2, Failures: 0, Errors: 0, Skipped: 0, Time elapsed: 0.029 sec
Running org.apache.activemq.broker.region.group.MessageGroupTest
Tests run: 3, Failures: 0, Errors: 0, Skipped: 0, Time elapsed: 1.121 sec
Running org.apache.activemq.broker.scheduler.CronParserTest
Tests run: 13, Failures: 0, Errors: 0, Skipped: 0, Time elapsed: 0.135 sec
Running org.apache.activemq.broker.scheduler.JmsCronSchedulerTest
Tests run: 2, Failures: 0, Errors: 0, Skipped: 0, Time elapsed: 198.396 sec
Running org.apache.activemq.broker.scheduler.JmsSchedulerTest
Tests run: 5, Failures: 0, Errors: 0, Skipped: 0, Time elapsed: 87.595 sec
Running org.apache.activemq.broker.scheduler.JobSchedulerManagementTest
Tests run: 7, Failures: 0, Errors: 0, Skipped: 0, Time elapsed: 74.922 sec
Running org.apache.activemq.broker.scheduler.JobSchedulerStoreTest
Tests run: 1, Failures: 0, Errors: 0, Skipped: 0, Time elapsed: 2.819 sec
Running org.apache.activemq.broker.scheduler.JobSchedulerTest
Tests run: 9, Failures: 0, Errors: 0, Skipped: 0, Time elapsed: 19.671 sec
Running org.apache.activemq.broker.store.DefaultStoreRecoveryBrokerTest
Tests run: 9, Failures: 0, Errors: 0, Skipped: 0, Time elapsed: 30.427 sec
Running org.apache.activemq.broker.store.RecoverExpiredMessagesTest
Tests run: 4, Failures: 0, Errors: 0, Skipped: 0, Time elapsed: 30.226 sec
Running org.apache.activemq.broker.store.TransactionStoreTest
Tests run: 1, Failures: 0, Errors: 0, Skipped: 0, Time elapsed: 0.261 sec
Running org.apache.activemq.broker.util.PluginBrokerTest
Tests run: 1, Failures: 0, Errors: 0, Skipped: 0, Time elapsed: 2.191 sec
Running org.apache.activemq.broker.util.RedeliveryPluginTest
Tests run: 1, Failures: 0, Errors: 0, Skipped: 0, Time elapsed: 0.15 sec
Running org.apache.activemq.broker.util.TimeStampingBrokerPluginTest
Tests run: 3, Failures: 0, Errors: 0, Skipped: 0, Time elapsed: 6.622 sec
Running org.apache.activemq.broker.util.TraceBrokerPathPluginTest
Tests run: 1, Failures: 0, Errors: 0, Skipped: 0, Time elapsed: 2.685 sec
Running org.apache.activemq.broker.virtual.CompositeQueueTest
Tests run: 1, Failures: 0, Errors: 0, Skipped: 0, Time elapsed: 1.122 sec
Running org.apache.activemq.broker.virtual.CompositeTopicTest
Tests run: 1, Failures: 0, Errors: 0, Skipped: 0, Time elapsed: 1.472 sec
Running org.apache.activemq.broker.virtual.FilteredQueueTest
Tests run: 1, Failures: 0, Errors: 0, Skipped: 0, Time elapsed: 2.764 sec
Running org.apache.activemq.broker.virtual.MirroredQueueCorrectMemoryUsageTest
Tests run: 1, Failures: 0, Errors: 0, Skipped: 0, Time elapsed: 6.921 sec
Running org.apache.activemq.broker.virtual.MirroredQueueTest
Tests run: 2, Failures: 0, Errors: 0, Skipped: 0, Time elapsed: 0.8 sec
Running org.apache.activemq.broker.virtual.MirroredQueueUsingVirtualTopicQueueTest
Tests run: 2, Failures: 0, Errors: 0, Skipped: 0, Time elapsed: 0.773 sec
Running org.apache.activemq.broker.virtual.VirtualTopicDLQTest
Tests run: 1, Failures: 0, Errors: 0, Skipped: 0, Time elapsed: 7.45 sec
Running org.apache.activemq.broker.virtual.VirtualTopicDisconnectSelectorTest
Tests run: 1, Failures: 0, Errors: 0, Skipped: 0, Time elapsed: 2.361 sec
Running org.apache.activemq.broker.virtual.VirtualTopicPubSubTest
Tests run: 2, Failures: 0, Errors: 0, Skipped: 0, Time elapsed: 0.948 sec
Running org.apache.activemq.broker.virtual.VirtualTopicPubSubUsingXBeanTest
Tests run: 2, Failures: 0, Errors: 0, Skipped: 0, Time elapsed: 0.785 sec
Running org.apache.activemq.broker.virtual.VirtualTopicSelectorTest
Tests run: 1, Failures: 0, Errors: 0, Skipped: 0, Time elapsed: 1.805 sec
Running org.apache.activemq.broker.virtual.VirtualTopicsAndDurableSubsTest
Tests run: 20, Failures: 0, Errors: 0, Skipped: 0, Time elapsed: 48.858 sec
Running org.apache.activemq.bugs.AMQ1687Test
Tests run: 1, Failures: 0, Errors: 0, Skipped: 0, Time elapsed: 2.586 sec
Running org.apache.activemq.bugs.AMQ1853Test
Tests run: 1, Failures: 0, Errors: 0, Skipped: 0, Time elapsed: 7.365 sec
Running org.apache.activemq.bugs.AMQ1893Test
Tests run: 1, Failures: 0, Errors: 0, Skipped: 0, Time elapsed: 18.174 sec
Running org.apache.activemq.bugs.AMQ1917Test
Tests run: 1, Failures: 0, Errors: 0, Skipped: 0, Time elapsed: 4.75 sec
Running org.apache.activemq.bugs.AMQ1936Test
Tests run: 1, Failures: 0, Errors: 0, Skipped: 0, Time elapsed: 37.858 sec
Running org.apache.activemq.bugs.AMQ2021Test
Tests run: 1, Failures: 0, Errors: 0, Skipped: 0, Time elapsed: 4.68 sec
Running org.apache.activemq.bugs.AMQ2084Test
Tests run: 2, Failures: 0, Errors: 0, Skipped: 0, Time elapsed: 8.859 sec
Running org.apache.activemq.bugs.AMQ2102Test

Results :

Tests run: 1224, Failures: 0, Errors: 0, Skipped: 0

mojoFailed org.apache.maven.plugins:maven-surefire-plugin:2.12.3(default-test)
[JENKINS] Recording test results
projectFailed org.apache.activemq:activemq-core:5.8-SNAPSHOT

Build failed in Jenkins: ActiveMQ » ActiveMQ :: Core #1087

Posted by Apache Jenkins Server <je...@builds.apache.org>.
See <https://builds.apache.org/job/ActiveMQ/org.apache.activemq$activemq-core/1087/changes>

Changes:

[dejanb] [maven-release-plugin] prepare for next development iteration

[dejanb] [maven-release-plugin] prepare release activemq-5.7.0

------------------------------------------
[...truncated 133 lines...]
Running org.apache.activemq.JmsCreateConsumerInOnMessageTest
Tests run: 1, Failures: 0, Errors: 0, Skipped: 0, Time elapsed: 0.635 sec
Running org.apache.activemq.JmsDurableQueueWildcardSendReceiveTest
Tests run: 1, Failures: 0, Errors: 0, Skipped: 0, Time elapsed: 1.736 sec
Running org.apache.activemq.JmsDurableTopicSelectorTest
Tests run: 3, Failures: 0, Errors: 0, Skipped: 0, Time elapsed: 8.802 sec
Running org.apache.activemq.JmsDurableTopicSendReceiveTest
Tests run: 2, Failures: 0, Errors: 0, Skipped: 0, Time elapsed: 3.796 sec
Running org.apache.activemq.JmsDurableTopicTransactionTest
Tests run: 14, Failures: 0, Errors: 0, Skipped: 0, Time elapsed: 20.034 sec
Running org.apache.activemq.JmsDurableTopicWildcardSendReceiveTest
Tests run: 1, Failures: 0, Errors: 0, Skipped: 0, Time elapsed: 1.713 sec
Running org.apache.activemq.JmsQueueBrowserTest
Tests run: 8, Failures: 0, Errors: 0, Skipped: 0, Time elapsed: 9.947 sec
Running org.apache.activemq.JmsQueueCompositeSendReceiveTest
Tests run: 2, Failures: 0, Errors: 0, Skipped: 0, Time elapsed: 2.033 sec
Running org.apache.activemq.JmsQueueRequestReplyTest
Tests run: 2, Failures: 0, Errors: 0, Skipped: 0, Time elapsed: 0.897 sec
Running org.apache.activemq.JmsQueueSelectorTest
Tests run: 3, Failures: 0, Errors: 0, Skipped: 0, Time elapsed: 3.796 sec
Running org.apache.activemq.JmsQueueSendReceiveTest
Tests run: 1, Failures: 0, Errors: 0, Skipped: 0, Time elapsed: 1.737 sec
Running org.apache.activemq.JmsQueueSendReceiveTwoConnectionsStartBeforeBrokerTest
Tests run: 1, Failures: 0, Errors: 0, Skipped: 0, Time elapsed: 3.44 sec
Running org.apache.activemq.JmsQueueSendReceiveTwoConnectionsTest
Tests run: 1, Failures: 0, Errors: 0, Skipped: 0, Time elapsed: 1.71 sec
Running org.apache.activemq.JmsQueueSendReceiveUsingTwoSessionsTest
Tests run: 1, Failures: 0, Errors: 0, Skipped: 0, Time elapsed: 1.746 sec
Running org.apache.activemq.JmsQueueTopicCompositeSendReceiveTest
Tests run: 1, Failures: 0, Errors: 0, Skipped: 0, Time elapsed: 1.758 sec
Running org.apache.activemq.JmsQueueTransactionTest
Tests run: 17, Failures: 0, Errors: 0, Skipped: 0, Time elapsed: 22.233 sec
Running org.apache.activemq.JmsQueueWildcardSendReceiveTest
Tests run: 4, Failures: 0, Errors: 0, Skipped: 0, Time elapsed: 1.986 sec
Running org.apache.activemq.JmsRedeliveredTest
Tests run: 18, Failures: 0, Errors: 0, Skipped: 0, Time elapsed: 13.437 sec
Running org.apache.activemq.JmsRollbackRedeliveryTest
Tests run: 9, Failures: 0, Errors: 0, Skipped: 0, Time elapsed: 11.981 sec
Running org.apache.activemq.JmsSendReceiveWithMessageExpirationTest
Tests run: 5, Failures: 0, Errors: 0, Skipped: 0, Time elapsed: 18.116 sec
Running org.apache.activemq.JmsSendWithAsyncCallbackTest
Tests run: 1, Failures: 0, Errors: 0, Skipped: 0, Time elapsed: 3.578 sec
Running org.apache.activemq.JmsSessionRecoverTest
Tests run: 6, Failures: 0, Errors: 0, Skipped: 0, Time elapsed: 6.962 sec
Running org.apache.activemq.JmsTempDestinationTest
Tests run: 8, Failures: 0, Errors: 0, Skipped: 0, Time elapsed: 38.989 sec
Running org.apache.activemq.JmsTopicCompositeSendReceiveTest
Tests run: 1, Failures: 0, Errors: 0, Skipped: 0, Time elapsed: 1.719 sec
Running org.apache.activemq.JmsTopicRedeliverTest
Tests run: 1, Failures: 0, Errors: 0, Skipped: 0, Time elapsed: 1.63 sec
Running org.apache.activemq.JmsTopicRequestReplyTest
Tests run: 2, Failures: 0, Errors: 0, Skipped: 0, Time elapsed: 1.755 sec
Running org.apache.activemq.JmsTopicSelectorTest
Tests run: 3, Failures: 0, Errors: 0, Skipped: 0, Time elapsed: 8.791 sec
Running org.apache.activemq.JmsTopicSendReceiveSubscriberTest
Tests run: 1, Failures: 0, Errors: 0, Skipped: 0, Time elapsed: 0.693 sec
Running org.apache.activemq.JmsTopicSendReceiveTest
Tests run: 1, Failures: 0, Errors: 0, Skipped: 0, Time elapsed: 0.706 sec
Running org.apache.activemq.JmsTopicSendReceiveWithTwoConnectionsTest
Tests run: 1, Failures: 0, Errors: 0, Skipped: 0, Time elapsed: 0.687 sec
Running org.apache.activemq.JmsTopicSendReceiveWithTwoConnectionsWithJMXTest
Tests run: 1, Failures: 0, Errors: 0, Skipped: 0, Time elapsed: 0.704 sec
Running org.apache.activemq.JmsTopicSendSameMessageTest
Tests run: 1, Failures: 0, Errors: 0, Skipped: 0, Time elapsed: 0.705 sec
Running org.apache.activemq.JmsTopicTransactionTest
Tests run: 14, Failures: 0, Errors: 0, Skipped: 0, Time elapsed: 21.007 sec
Running org.apache.activemq.JmsTopicWildcardSendReceiveTest
Tests run: 4, Failures: 0, Errors: 0, Skipped: 0, Time elapsed: 1.95 sec
Running org.apache.activemq.LargeStreamletTest
Tests run: 1, Failures: 0, Errors: 0, Skipped: 0, Time elapsed: 1.589 sec
Running org.apache.activemq.MessageEvictionTest
Tests run: 3, Failures: 0, Errors: 0, Skipped: 0, Time elapsed: 91.286 sec
Running org.apache.activemq.MessageListenerRedeliveryTest
Tests run: 4, Failures: 0, Errors: 0, Skipped: 0, Time elapsed: 16.942 sec
Running org.apache.activemq.MessageTransformationTest
Tests run: 2, Failures: 0, Errors: 0, Skipped: 0, Time elapsed: 0.154 sec
Running org.apache.activemq.OnePrefetchAsyncConsumerTest
Tests run: 1, Failures: 0, Errors: 0, Skipped: 0, Time elapsed: 6.577 sec
Running org.apache.activemq.OptimizedAckTest
Tests run: 3, Failures: 0, Errors: 0, Skipped: 0, Time elapsed: 14.815 sec
Running org.apache.activemq.PerDestinationStoreLimitTest
Tests run: 2, Failures: 0, Errors: 0, Skipped: 0, Time elapsed: 40.905 sec
Running org.apache.activemq.ProducerFlowControlSendFailTest
Tests run: 7, Failures: 0, Errors: 0, Skipped: 0, Time elapsed: 18.542 sec
Running org.apache.activemq.ProducerFlowControlTest
Tests run: 6, Failures: 0, Errors: 0, Skipped: 0, Time elapsed: 25.68 sec
Running org.apache.activemq.QueueConsumerPriorityTest
Tests run: 1, Failures: 0, Errors: 0, Skipped: 0, Time elapsed: 5.329 sec
Running org.apache.activemq.ReconnectWithSameClientIDTest
Tests run: 2, Failures: 0, Errors: 0, Skipped: 0, Time elapsed: 4.792 sec
Running org.apache.activemq.RedeliveryPolicyTest
Tests run: 10, Failures: 0, Errors: 0, Skipped: 0, Time elapsed: 14.803 sec
Running org.apache.activemq.RemoveDestinationTest
Tests run: 2, Failures: 0, Errors: 0, Skipped: 0, Time elapsed: 19.135 sec
Running org.apache.activemq.TimeStampTest
Tests run: 1, Failures: 0, Errors: 0, Skipped: 0, Time elapsed: 4.645 sec
Running org.apache.activemq.TransactionContextTest
Tests run: 2, Failures: 0, Errors: 0, Skipped: 0, Time elapsed: 2.206 sec
Running org.apache.activemq.ZeroPrefetchConsumerTest
Tests run: 11, Failures: 0, Errors: 0, Skipped: 0, Time elapsed: 22.768 sec
Running org.apache.activemq.advisory.ConsumerListenerTest
Tests run: 2, Failures: 0, Errors: 0, Skipped: 0, Time elapsed: 0.788 sec
Running org.apache.activemq.advisory.DestinationListenerTest
Tests run: 3, Failures: 0, Errors: 0, Skipped: 0, Time elapsed: 7.907 sec
Running org.apache.activemq.advisory.MasterSlaveTempQueueMemoryTest
Tests run: 6, Failures: 0, Errors: 0, Skipped: 0, Time elapsed: 44.686 sec
Running org.apache.activemq.advisory.ProducerListenerTest
Tests run: 2, Failures: 0, Errors: 0, Skipped: 0, Time elapsed: 0.748 sec
Running org.apache.activemq.advisory.TempDestDeleteTest
Tests run: 2, Failures: 0, Errors: 0, Skipped: 0, Time elapsed: 0.781 sec
Running org.apache.activemq.advisory.TempDestLoadTest
Tests run: 2, Failures: 0, Errors: 0, Skipped: 0, Time elapsed: 20.048 sec
Running org.apache.activemq.advisory.TempQueueMemoryTest
Tests run: 2, Failures: 0, Errors: 0, Skipped: 0, Time elapsed: 22.465 sec
Running org.apache.activemq.blob.BlobTransferPolicyUriTest
Tests run: 1, Failures: 0, Errors: 0, Skipped: 0, Time elapsed: 0.157 sec
Running org.apache.activemq.blob.FTPBlobDownloadStrategyTest
Tests run: 3, Failures: 0, Errors: 0, Skipped: 0, Time elapsed: 1.778 sec
Running org.apache.activemq.blob.FTPBlobTest
Tests run: 1, Failures: 0, Errors: 0, Skipped: 0, Time elapsed: 1.999 sec
Running org.apache.activemq.blob.FTPBlobUploadStrategyTest
Tests run: 2, Failures: 0, Errors: 0, Skipped: 0, Time elapsed: 0.951 sec
Running org.apache.activemq.blob.FilesystemBlobTest
Tests run: 1, Failures: 0, Errors: 0, Skipped: 0, Time elapsed: 1.66 sec
Running org.apache.activemq.broker.BrokerRedeliveryTest
Tests run: 1, Failures: 0, Errors: 0, Skipped: 0, Time elapsed: 8.947 sec
Running org.apache.activemq.broker.BrokerServiceTest
Tests run: 5, Failures: 0, Errors: 0, Skipped: 0, Time elapsed: 4.628 sec
Running org.apache.activemq.broker.BrokerTest
Tests run: 129, Failures: 0, Errors: 0, Skipped: 0, Time elapsed: 21.554 sec
Running org.apache.activemq.broker.ConcurrentConnectSimulationTest
Tests run: 1, Failures: 0, Errors: 0, Skipped: 0, Time elapsed: 0.565 sec
Running org.apache.activemq.broker.CreateDestinationsOnStartupViaXBeanTest
Tests run: 1, Failures: 0, Errors: 0, Skipped: 0, Time elapsed: 2.117 sec
Running org.apache.activemq.broker.DedicatedTaskRunnerBrokerTest
Tests run: 129, Failures: 0, Errors: 0, Skipped: 0, Time elapsed: 22.583 sec
Running org.apache.activemq.broker.DoubleSubscriptionTest
Tests run: 1, Failures: 0, Errors: 0, Skipped: 0, Time elapsed: 2.53 sec
Running org.apache.activemq.broker.DurablePersistentFalseRestartTest
Tests run: 1, Failures: 0, Errors: 0, Skipped: 0, Time elapsed: 6.728 sec
Running org.apache.activemq.broker.JdbcXARecoveryBrokerTest
Tests run: 16, Failures: 0, Errors: 0, Skipped: 0, Time elapsed: 140.222 sec
Running org.apache.activemq.broker.MessageExpirationTest
Tests run: 13, Failures: 0, Errors: 0, Skipped: 0, Time elapsed: 22.185 sec
Running org.apache.activemq.broker.OutOfOrderXMLTest
Tests run: 1, Failures: 0, Errors: 0, Skipped: 0, Time elapsed: 1.636 sec
Running org.apache.activemq.broker.QueueMbeanRestartTest
Tests run: 2, Failures: 0, Errors: 0, Skipped: 0, Time elapsed: 18.414 sec
Running org.apache.activemq.broker.QueueSubscriptionTest
Tests run: 8, Failures: 0, Errors: 0, Skipped: 0, Time elapsed: 4.088 sec
Running org.apache.activemq.broker.ReconnectWithJMXEnabledTest
Tests run: 1, Failures: 0, Errors: 0, Skipped: 0, Time elapsed: 4.604 sec
Running org.apache.activemq.broker.RecoveryBrokerTest
Tests run: 9, Failures: 0, Errors: 0, Skipped: 0, Time elapsed: 32.75 sec
Running org.apache.activemq.broker.RedeliveryRestartTest
Tests run: 2, Failures: 0, Errors: 0, Skipped: 0, Time elapsed: 13.239 sec
Running org.apache.activemq.broker.SpringTest
Tests run: 1, Failures: 0, Errors: 0, Skipped: 0, Time elapsed: 2.641 sec
Running org.apache.activemq.broker.TopicSubscriptionTest
Tests run: 8, Failures: 0, Errors: 0, Skipped: 0, Time elapsed: 7.091 sec
Running org.apache.activemq.broker.XARecoveryBrokerTest
Tests run: 16, Failures: 0, Errors: 0, Skipped: 0, Time elapsed: 72.043 sec
Running org.apache.activemq.broker.advisory.AdvisoryBrokerTest
Tests run: 6, Failures: 0, Errors: 0, Skipped: 0, Time elapsed: 0.816 sec
Running org.apache.activemq.broker.advisory.AdvisoryDuplexNetworkBridgeTest
Tests run: 2, Failures: 0, Errors: 0, Skipped: 0, Time elapsed: 11.444 sec
Running org.apache.activemq.broker.advisory.AdvisoryJmxTest
Tests run: 1, Failures: 0, Errors: 0, Skipped: 0, Time elapsed: 0.721 sec
Running org.apache.activemq.broker.advisory.AdvisoryNetworkBridgeTest
Tests run: 2, Failures: 0, Errors: 0, Skipped: 0, Time elapsed: 10.79 sec
Running org.apache.activemq.broker.ft.DbRestartJDBCQueueMasterSlaveLeaseQuiesceTest
Running org.apache.activemq.broker.ft.DbRestartJDBCQueueMasterSlaveLeaseTest
Tests run: 2, Failures: 0, Errors: 0, Skipped: 0, Time elapsed: 55.84 sec
Running org.apache.activemq.broker.ft.DbRestartJDBCQueueMasterSlaveTest
Running org.apache.activemq.broker.ft.JDBCQueueMasterSlaveTest
Tests run: 2, Failures: 0, Errors: 0, Skipped: 0, Time elapsed: 52.869 sec
Running org.apache.activemq.broker.ft.MasterSlaveProducerFlowControlTest
Tests run: 6, Failures: 0, Errors: 0, Skipped: 0, Time elapsed: 25.764 sec
Running org.apache.activemq.broker.ft.MasterSlaveSlaveDieTest
Tests run: 1, Failures: 0, Errors: 0, Skipped: 0, Time elapsed: 2.695 sec
Running org.apache.activemq.broker.ft.MasterSlaveSlaveShutdownTest
Tests run: 1, Failures: 0, Errors: 0, Skipped: 0, Time elapsed: 32.354 sec
Running org.apache.activemq.broker.ft.QueueMasterSlaveSingleUrlTest
Tests run: 2, Failures: 0, Errors: 0, Skipped: 0, Time elapsed: 15.297 sec
Running org.apache.activemq.broker.ft.QueueMasterSlaveTest
Tests run: 2, Failures: 0, Errors: 0, Skipped: 0, Time elapsed: 27.66 sec
Running org.apache.activemq.broker.ft.QueueMasterSlaveTestUsingSharedFileTest
Tests run: 2, Failures: 0, Errors: 0, Skipped: 0, Time elapsed: 32.016 sec
Running org.apache.activemq.broker.ft.QueueMasterSlaveUsingMasterConnectorElementCompositeQueueTest
Tests run: 2, Failures: 0, Errors: 0, Skipped: 0, Time elapsed: 40.522 sec
Running org.apache.activemq.broker.ft.QueueMasterSlaveUsingMasterConnectorElementTest
Tests run: 2, Failures: 0, Errors: 0, Skipped: 0, Time elapsed: 24.481 sec
Running org.apache.activemq.broker.ft.TopicMasterSlaveTest
Tests run: 2, Failures: 0, Errors: 0, Skipped: 0, Time elapsed: 22.233 sec
Running org.apache.activemq.broker.ft.TransactedTopicMasterSlaveTest
Tests run: 15, Failures: 0, Errors: 0, Skipped: 0, Time elapsed: 91.846 sec
Running org.apache.activemq.broker.jmx.BrokerViewSlowStoreStartupTest
Tests run: 1, Failures: 0, Errors: 0, Skipped: 0, Time elapsed: 1.232 sec
Running org.apache.activemq.broker.jmx.MBeanOperationTimeoutTest
Tests run: 1, Failures: 0, Errors: 0, Skipped: 0, Time elapsed: 33.271 sec
Running org.apache.activemq.broker.jmx.MBeanTest
Tests run: 19, Failures: 0, Errors: 0, Skipped: 0, Time elapsed: 54.92 sec
Running org.apache.activemq.broker.jmx.PurgeTest
Tests run: 5, Failures: 0, Errors: 0, Skipped: 0, Time elapsed: 104.854 sec
Running org.apache.activemq.broker.jmx.TransportConnectorMBeanTest
Tests run: 2, Failures: 0, Errors: 0, Skipped: 0, Time elapsed: 4.586 sec
Running org.apache.activemq.broker.mKahaDBXARecoveryBrokerTest
Tests run: 16, Failures: 0, Errors: 0, Skipped: 0, Time elapsed: 87.166 sec
Running org.apache.activemq.broker.message.security.MessageAuthenticationTest
Tests run: 1, Failures: 0, Errors: 0, Skipped: 0, Time elapsed: 0.679 sec
Running org.apache.activemq.broker.policy.AbortSlowConsumerTest
Tests run: 19, Failures: 0, Errors: 0, Skipped: 0, Time elapsed: 145.155 sec
Running org.apache.activemq.broker.policy.DeadLetterTest
Tests run: 4, Failures: 0, Errors: 0, Skipped: 0, Time elapsed: 2.305 sec
Running org.apache.activemq.broker.policy.DestinationCursorConfigTest
Tests run: 2, Failures: 0, Errors: 0, Skipped: 0, Time elapsed: 1.599 sec
Running org.apache.activemq.broker.policy.IndividualDeadLetterTest
Tests run: 5, Failures: 0, Errors: 0, Skipped: 0, Time elapsed: 4.516 sec
Running org.apache.activemq.broker.policy.IndividualDeadLetterViaXmlTest
Tests run: 4, Failures: 0, Errors: 0, Skipped: 0, Time elapsed: 4.602 sec
Running org.apache.activemq.broker.policy.MessageListenerDeadLetterTest
Tests run: 4, Failures: 0, Errors: 0, Skipped: 0, Time elapsed: 3.171 sec
Running org.apache.activemq.broker.policy.NoConsumerDeadLetterTest
Tests run: 5, Failures: 0, Errors: 0, Skipped: 0, Time elapsed: 2.146 sec
Running org.apache.activemq.broker.policy.NoRetryDeadLetterTest
Tests run: 4, Failures: 0, Errors: 0, Skipped: 0, Time elapsed: 0.992 sec
Running org.apache.activemq.broker.policy.PerDurableConsumerDeadLetterTest
Tests run: 4, Failures: 0, Errors: 0, Skipped: 0, Time elapsed: 2.364 sec
Running org.apache.activemq.broker.policy.PriorityNetworkDispatchPolicyTest
Tests run: 1, Failures: 0, Errors: 0, Skipped: 0, Time elapsed: 0.193 sec
Running org.apache.activemq.broker.policy.RoundRobinDispatchPolicyTest
Tests run: 9, Failures: 0, Errors: 0, Skipped: 0, Time elapsed: 4.611 sec
Running org.apache.activemq.broker.policy.SimpleDispatchPolicyTest
Tests run: 8, Failures: 0, Errors: 0, Skipped: 0, Time elapsed: 4.677 sec
Running org.apache.activemq.broker.policy.StrictOrderDispatchPolicyTest
Tests run: 8, Failures: 0, Errors: 0, Skipped: 0, Time elapsed: 5.157 sec
Running org.apache.activemq.broker.region.DestinationGCTest
Tests run: 2, Failures: 0, Errors: 0, Skipped: 0, Time elapsed: 14.736 sec
Running org.apache.activemq.broker.region.DestinationRemoveRestartTest
Tests run: 2, Failures: 0, Errors: 0, Skipped: 0, Time elapsed: 3.739 sec
Running org.apache.activemq.broker.region.QueueDuplicatesFromStoreTest

Results :

Tests run: 1068, Failures: 0, Errors: 0, Skipped: 0

mojoFailed org.apache.maven.plugins:maven-surefire-plugin:2.12.3(default-test)
[JENKINS] Recording test results
projectFailed org.apache.activemq:activemq-core:5.8-SNAPSHOT