You are viewing a plain text version of this content. The canonical link for it is here.
Posted to dev@lucene.apache.org by Apache Jenkins Server <je...@builds.apache.org> on 2012/09/17 13:15:13 UTC
[JENKINS-MAVEN] Lucene-Solr-Maven-4.x #99: POMs out of sync
Build: https://builds.apache.org/job/Lucene-Solr-Maven-4.x/99/
1 tests failed.
REGRESSION: org.apache.solr.cloud.BasicDistributedZk2Test.testDistribSearch
Error Message:
Shard still reported as live in zk
Stack Trace:
java.lang.AssertionError: Shard still reported as live in zk
at __randomizedtesting.SeedInfo.seed([5C61D1D3E58F5990:DD875FCB92D039AC]:0)
at org.junit.Assert.fail(Assert.java:93)
at org.apache.solr.cloud.AbstractFullDistribZkTestBase.waitToSeeNotLive(AbstractFullDistribZkTestBase.java:1220)
at org.apache.solr.cloud.BasicDistributedZk2Test.brindDownShardIndexSomeDocsAndRecover(BasicDistributedZk2Test.java:190)
at org.apache.solr.cloud.BasicDistributedZk2Test.doTest(BasicDistributedZk2Test.java:83)
at org.apache.solr.BaseDistributedSearchTestCase.testDistribSearch(BaseDistributedSearchTestCase.java:695)
at sun.reflect.NativeMethodAccessorImpl.invoke0(Native Method)
at sun.reflect.NativeMethodAccessorImpl.invoke(NativeMethodAccessorImpl.java:57)
at sun.reflect.DelegatingMethodAccessorImpl.invoke(DelegatingMethodAccessorImpl.java:43)
at java.lang.reflect.Method.invoke(Method.java:616)
at com.carrotsearch.randomizedtesting.RandomizedRunner.invoke(RandomizedRunner.java:1559)
at com.carrotsearch.randomizedtesting.RandomizedRunner.access$600(RandomizedRunner.java:79)
at com.carrotsearch.randomizedtesting.RandomizedRunner$6.evaluate(RandomizedRunner.java:737)
at com.carrotsearch.randomizedtesting.RandomizedRunner$7.evaluate(RandomizedRunner.java:773)
at com.carrotsearch.randomizedtesting.RandomizedRunner$8.evaluate(RandomizedRunner.java:787)
at com.carrotsearch.randomizedtesting.rules.SystemPropertiesRestoreRule$1.evaluate(SystemPropertiesRestoreRule.java:53)
at org.apache.lucene.util.TestRuleSetupTeardownChained$1.evaluate(TestRuleSetupTeardownChained.java:50)
at org.apache.lucene.util.TestRuleFieldCacheSanity$1.evaluate(TestRuleFieldCacheSanity.java:51)
at org.apache.lucene.util.AbstractBeforeAfterRule$1.evaluate(AbstractBeforeAfterRule.java:45)
at com.carrotsearch.randomizedtesting.rules.SystemPropertiesInvariantRule$1.evaluate(SystemPropertiesInvariantRule.java:55)
at org.apache.lucene.util.TestRuleThreadAndTestName$1.evaluate(TestRuleThreadAndTestName.java:48)
at org.apache.lucene.util.TestRuleIgnoreAfterMaxFailures$1.evaluate(TestRuleIgnoreAfterMaxFailures.java:70)
at org.apache.lucene.util.TestRuleMarkFailure$1.evaluate(TestRuleMarkFailure.java:48)
at com.carrotsearch.randomizedtesting.rules.StatementAdapter.evaluate(StatementAdapter.java:36)
at com.carrotsearch.randomizedtesting.ThreadLeakControl$StatementRunner.run(ThreadLeakControl.java:358)
at com.carrotsearch.randomizedtesting.ThreadLeakControl.forkTimeoutingTask(ThreadLeakControl.java:782)
at com.carrotsearch.randomizedtesting.ThreadLeakControl$3.evaluate(ThreadLeakControl.java:442)
at com.carrotsearch.randomizedtesting.RandomizedRunner.runSingleTest(RandomizedRunner.java:746)
at com.carrotsearch.randomizedtesting.RandomizedRunner$3.evaluate(RandomizedRunner.java:648)
at com.carrotsearch.randomizedtesting.RandomizedRunner$4.evaluate(RandomizedRunner.java:682)
at com.carrotsearch.randomizedtesting.RandomizedRunner$5.evaluate(RandomizedRunner.java:693)
at com.carrotsearch.randomizedtesting.rules.StatementAdapter.evaluate(StatementAdapter.java:36)
at com.carrotsearch.randomizedtesting.rules.SystemPropertiesRestoreRule$1.evaluate(SystemPropertiesRestoreRule.java:53)
at org.apache.lucene.util.AbstractBeforeAfterRule$1.evaluate(AbstractBeforeAfterRule.java:45)
at org.apache.lucene.util.TestRuleStoreClassName$1.evaluate(TestRuleStoreClassName.java:42)
at com.carrotsearch.randomizedtesting.rules.SystemPropertiesInvariantRule$1.evaluate(SystemPropertiesInvariantRule.java:55)
at com.carrotsearch.randomizedtesting.rules.NoShadowingOrOverridesOnMethodsRule$1.evaluate(NoShadowingOrOverridesOnMethodsRule.java:39)
at com.carrotsearch.randomizedtesting.rules.NoShadowingOrOverridesOnMethodsRule$1.evaluate(NoShadowingOrOverridesOnMethodsRule.java:39)
at com.carrotsearch.randomizedtesting.rules.StatementAdapter.evaluate(StatementAdapter.java:36)
at org.apache.lucene.util.TestRuleAssertionsRequired$1.evaluate(TestRuleAssertionsRequired.java:43)
at org.apache.lucene.util.TestRuleMarkFailure$1.evaluate(TestRuleMarkFailure.java:48)
at org.apache.lucene.util.TestRuleIgnoreAfterMaxFailures$1.evaluate(TestRuleIgnoreAfterMaxFailures.java:70)
at org.apache.lucene.util.TestRuleIgnoreTestSuites$1.evaluate(TestRuleIgnoreTestSuites.java:55)
at com.carrotsearch.randomizedtesting.rules.StatementAdapter.evaluate(StatementAdapter.java:36)
at com.carrotsearch.randomizedtesting.ThreadLeakControl$StatementRunner.run(ThreadLeakControl.java:358)
at java.lang.Thread.run(Thread.java:679)
Build Log:
[...truncated 4995 lines...]
[mvn] 1296 T3 oasc.SolrCore.finalize SEVERE REFCOUNT ERROR: unreferenced org.apache.solr.core.SolrCore@4ade0af9 (collection1) has a reference count of 1
[mvn] 1297 T3 oasc.CoreContainer.finalize SEVERE CoreContainer was not shutdown prior to finalize(), indicates a bug -- POSSIBLE RESOURCE LEAK!!! instance=185689407
[mvn] 1440 T1917 oasup.StatelessScriptUpdateProcessorFactory.inform SEVERE Unable to initialize scripts: Unable to evaluate script: a-file-name-that-does-not-exist.js Ignoring exception matching \Qa-file-name-that-does-not-exist.js\E
[mvn] Creating dataDir: /usr/home/hudson/hudson-slave/workspace/Lucene-Solr-Maven-4.x/maven-build/solr/core/src/test/target/test/./solrtest-TestBadConfig-1347879341867
[mvn] 1680 T3 oasc.CoreContainer.finalize SEVERE CoreContainer was not shutdown prior to finalize(), indicates a bug -- POSSIBLE RESOURCE LEAK!!! instance=260296060
[mvn] 1822 T1917 oasup.StatelessScriptUpdateProcessorFactory.inform SEVERE Unable to initialize scripts: No ScriptEngine found by name: giberish -- supported names: js, rhino, JavaScript, javascript, ECMAScript, ecmascript Ignoring exception matching \Qgiberish\E
[mvn] Tests run: 6, Failures: 0, Errors: 0, Skipped: 0, Time elapsed: 1.846 sec
[mvn] Running org.apache.solr.schema.PreAnalyzedFieldTest
[mvn] Tests run: 3, Failures: 0, Errors: 0, Skipped: 0, Time elapsed: 0.042 sec
[mvn] Running org.apache.solr.analysis.TestLuceneMatchVersion
[mvn] Creating dataDir: /usr/home/hudson/hudson-slave/workspace/Lucene-Solr-Maven-4.x/maven-build/solr/core/src/test/target/test/./solrtest-TestLuceneMatchVersion-1347879342311
[mvn] Tests run: 1, Failures: 0, Errors: 0, Skipped: 0, Time elapsed: 0.298 sec
[mvn] Running org.apache.solr.schema.IndexSchemaRuntimeFieldTest
[mvn] Creating dataDir: /usr/home/hudson/hudson-slave/workspace/Lucene-Solr-Maven-4.x/maven-build/solr/core/src/test/target/test/./solrtest-IndexSchemaRuntimeFieldTest-1347879342609
[mvn] 103 T3 oasc.CoreContainer.finalize SEVERE CoreContainer was not shutdown prior to finalize(), indicates a bug -- POSSIBLE RESOURCE LEAK!!! instance=1340727075
[mvn] Tests run: 1, Failures: 0, Errors: 0, Skipped: 0, Time elapsed: 0.57 sec
[mvn] Running org.apache.solr.search.TestRecovery
[mvn] Creating dataDir: /usr/home/hudson/hudson-slave/workspace/Lucene-Solr-Maven-4.x/maven-build/solr/core/src/test/target/test/./solrtest-TestRecovery-1347879343183
[mvn] Tests run: 10, Failures: 0, Errors: 0, Skipped: 0, Time elapsed: 6.059 sec
[mvn] Running org.apache.solr.SampleTest
[mvn] Creating dataDir: /usr/home/hudson/hudson-slave/workspace/Lucene-Solr-Maven-4.x/maven-build/solr/core/src/test/target/test/./solrtest-SampleTest-1347879349237
[mvn] Tests run: 2, Failures: 0, Errors: 0, Skipped: 0, Time elapsed: 0.209 sec
[mvn] Running org.apache.solr.update.DocumentBuilderTest
[mvn] Creating dataDir: /usr/home/hudson/hudson-slave/workspace/Lucene-Solr-Maven-4.x/maven-build/solr/core/src/test/target/test/./solrtest-DocumentBuilderTest-1347879349447
[mvn] Tests run: 11, Failures: 0, Errors: 0, Skipped: 0, Time elapsed: 0.426 sec
[mvn] Running org.apache.solr.update.DirectUpdateHandlerOptimizeTest
[mvn] Tests run: 1, Failures: 0, Errors: 0, Skipped: 0, Time elapsed: 0.52 sec
[mvn] Running org.apache.solr.search.TestSolrJ
[mvn] Tests run: 1, Failures: 0, Errors: 0, Skipped: 0, Time elapsed: 0.025 sec
[mvn] Running org.apache.solr.update.processor.ScriptEngineTest
[mvn] Tests run: 6, Failures: 0, Errors: 0, Skipped: 1, Time elapsed: 0.125 sec
[mvn] Running org.apache.solr.update.DirectUpdateHandlerTest
[mvn] Creating dataDir: /usr/home/hudson/hudson-slave/workspace/Lucene-Solr-Maven-4.x/maven-build/solr/core/src/test/target/test/./solrtest-DirectUpdateHandlerTest-1347879350551
[mvn] Creating dataDir: /usr/home/hudson/hudson-slave/workspace/Lucene-Solr-Maven-4.x/maven-build/solr/core/src/test/target/test/./solrtest-DirectUpdateHandlerTest-1347879351029
[mvn] Creating dataDir: /usr/home/hudson/hudson-slave/workspace/Lucene-Solr-Maven-4.x/maven-build/solr/core/src/test/target/test/./solrtest-DirectUpdateHandlerTest-1347879352052
[mvn] Tests run: 6, Failures: 0, Errors: 0, Skipped: 0, Time elapsed: 2.211 sec
[mvn] Running org.apache.solr.highlight.HighlighterConfigTest
[mvn] Tests run: 1, Failures: 0, Errors: 0, Skipped: 0, Time elapsed: 0.435 sec
[mvn] Running org.apache.solr.search.TestSolr4Spatial
[mvn] Creating dataDir: /usr/home/hudson/hudson-slave/workspace/Lucene-Solr-Maven-4.x/maven-build/solr/core/src/test/target/test/./solrtest-TestSolr4Spatial-1347879353202
[mvn] Tests run: 24, Failures: 0, Errors: 0, Skipped: 1, Time elapsed: 2.914 sec
[mvn] Running org.apache.solr.update.processor.FieldMutatingUpdateProcessorTest
[mvn] Creating dataDir: /usr/home/hudson/hudson-slave/workspace/Lucene-Solr-Maven-4.x/maven-build/solr/core/src/test/target/test/./solrtest-FieldMutatingUpdateProcessorTest-1347879356109
[mvn] Tests run: 26, Failures: 0, Errors: 0, Skipped: 0, Time elapsed: 0.424 sec
[mvn] Running org.apache.solr.spelling.suggest.SuggesterTSTTest
[mvn] Creating dataDir: /usr/home/hudson/hudson-slave/workspace/Lucene-Solr-Maven-4.x/maven-build/solr/core/src/test/target/test/./solrtest-SuggesterTSTTest-1347879356533
[mvn] NOTE: per solr.test.leavedatadir, dataDir will not be removed: /usr/home/hudson/hudson-slave/workspace/Lucene-Solr-Maven-4.x/maven-build/solr/core/src/test/target/test/./solrtest-SuggesterTSTTest-1347879356533
[mvn] Tests run: 4, Failures: 0, Errors: 0, Skipped: 0, Time elapsed: 0.529 sec
[mvn] Running org.apache.solr.search.TestStressRecovery
[mvn] Creating dataDir: /usr/home/hudson/hudson-slave/workspace/Lucene-Solr-Maven-4.x/maven-build/solr/core/src/test/target/test/./solrtest-TestStressRecovery-1347879357063
[mvn] 1635 T3 oasc.CoreContainer.finalize SEVERE CoreContainer was not shutdown prior to finalize(), indicates a bug -- POSSIBLE RESOURCE LEAK!!! instance=653115952
[mvn] Tests run: 1, Failures: 0, Errors: 0, Skipped: 0, Time elapsed: 8.469 sec
[mvn] Running org.apache.solr.EchoParamsTest
[mvn] Creating dataDir: /usr/home/hudson/hudson-slave/workspace/Lucene-Solr-Maven-4.x/maven-build/solr/core/src/test/target/test/./solrtest-EchoParamsTest-1347879365537
[mvn] Tests run: 1, Failures: 0, Errors: 0, Skipped: 0, Time elapsed: 0.106 sec
[mvn] Running org.apache.solr.update.UpdateParamsTest
[mvn] Tests run: 1, Failures: 0, Errors: 0, Skipped: 0, Time elapsed: 0.498 sec
[mvn] Running org.apache.solr.handler.TestCSVLoader
[mvn] Creating dataDir: /usr/home/hudson/hudson-slave/workspace/Lucene-Solr-Maven-4.x/maven-build/solr/core/src/test/target/test/./solrtest-TestCSVLoader-1347879366144
[mvn] Tests run: 5, Failures: 0, Errors: 0, Skipped: 0, Time elapsed: 0.698 sec
[mvn] Running org.apache.solr.internal.csv.writer.CSVConfigTest
[mvn] Tests run: 7, Failures: 0, Errors: 0, Skipped: 0, Time elapsed: 0.001 sec
[mvn] Running org.apache.solr.internal.csv.CSVStrategyTest
[mvn] Tests run: 5, Failures: 0, Errors: 0, Skipped: 0, Time elapsed: 0.001 sec
[mvn] Running org.apache.solr.highlight.HighlighterTest
[mvn] Creating dataDir: /usr/home/hudson/hudson-slave/workspace/Lucene-Solr-Maven-4.x/maven-build/solr/core/src/test/target/test/./solrtest-HighlighterTest-1347879366849
[mvn] Tests run: 27, Failures: 0, Errors: 0, Skipped: 0, Time elapsed: 1.5 sec
[mvn] Running org.apache.solr.schema.RequiredFieldsTest
[mvn] Creating dataDir: /usr/home/hudson/hudson-slave/workspace/Lucene-Solr-Maven-4.x/maven-build/solr/core/src/test/target/test/./solrtest-RequiredFieldsTest-1347879368347
[mvn] Tests run: 3, Failures: 0, Errors: 0, Skipped: 0, Time elapsed: 0.471 sec
[mvn] Running org.apache.solr.search.similarities.TestLMDirichletSimilarityFactory
[mvn] Creating dataDir: /usr/home/hudson/hudson-slave/workspace/Lucene-Solr-Maven-4.x/maven-build/solr/core/src/test/target/test/./solrtest-TestLMDirichletSimilarityFactory-1347879368820
[mvn] Tests run: 2, Failures: 0, Errors: 0, Skipped: 0, Time elapsed: 0.101 sec
[mvn] Running org.apache.solr.search.TestPseudoReturnFields
[mvn] Creating dataDir: /usr/home/hudson/hudson-slave/workspace/Lucene-Solr-Maven-4.x/maven-build/solr/core/src/test/target/test/./solrtest-TestPseudoReturnFields-1347879368923
[mvn] Tests run: 13, Failures: 0, Errors: 0, Skipped: 0, Time elapsed: 0.742 sec
[mvn] Running org.apache.solr.search.TestFoldingMultitermQuery
[mvn] Creating dataDir: /usr/home/hudson/hudson-slave/workspace/Lucene-Solr-Maven-4.x/maven-build/solr/core/src/test/target/test/./solrtest-TestFoldingMultitermQuery-1347879369665
[mvn] Tests run: 18, Failures: 0, Errors: 0, Skipped: 0, Time elapsed: 0.851 sec
[mvn] Running org.apache.solr.search.TestFastLRUCache
[mvn] Tests run: 7, Failures: 0, Errors: 0, Skipped: 0, Time elapsed: 0.082 sec
[mvn] Running org.apache.solr.search.TestQueryTypes
[mvn] 931 T3 oasu.ConcurrentLRUCache.finalize SEVERE ConcurrentLRUCache was not destroyed prior to finalize(), indicates a bug -- POSSIBLE RESOURCE LEAK!!!
[mvn] Tests run: 1, Failures: 0, Errors: 0, Skipped: 0, Time elapsed: 0.465 sec
[mvn] Running org.apache.solr.core.CoreContainerCoreInitFailuresTest
[mvn] 113 T2042 oasc.CoreContainer.create SEVERE Unable to create core: col_bad Ignoring exception matching \QDummyMergePolicy\E
[mvn] 163 T2042 oasc.CoreContainer.create SEVERE Unable to create core: bogus Ignoring exception matching \Qbogus_path\E
[mvn] 171 T2042 oasc.CoreContainer.reload SEVERE Unable to reload core: col_bad Ignoring exception matching \QSAX\E
[mvn] 241 T2042 oasc.CoreContainer.create SEVERE Unable to create core: bogus Ignoring exception matching \Qbogus_path\E
[mvn] Tests run: 2, Failures: 0, Errors: 0, Skipped: 0, Time elapsed: 0.256 sec
[mvn] Running org.apache.solr.cloud.LeaderElectionIntegrationTest
[mvn] Creating dataDir: /usr/home/hudson/hudson-slave/workspace/Lucene-Solr-Maven-4.x/maven-build/solr/core/src/test/target/test/./solrtest-LeaderElectionIntegrationTest-1347879371323
[mvn] 312 T3 oasc.SolrCore.finalize SEVERE REFCOUNT ERROR: unreferenced org.apache.solr.core.SolrCore@513583f1 (col_bad) has a reference count of 1
[mvn] Creating dataDir: /usr/home/hudson/hudson-slave/workspace/Lucene-Solr-Maven-4.x/maven-build/solr/core/src/test/target/test/./solrtest-LeaderElectionIntegrationTest-1347879379110
[mvn] Tests run: 2, Failures: 0, Errors: 0, Skipped: 0, Time elapsed: 22.271 sec
[mvn] Running org.apache.solr.search.similarities.TestDefaultSimilarityFactory
[mvn] Creating dataDir: /usr/home/hudson/hudson-slave/workspace/Lucene-Solr-Maven-4.x/maven-build/solr/core/src/test/target/test/./solrtest-TestDefaultSimilarityFactory-1347879393596
[mvn] Tests run: 2, Failures: 0, Errors: 0, Skipped: 0, Time elapsed: 0.114 sec
[mvn] Running org.apache.solr.handler.component.TermVectorComponentDistributedTest
[mvn] Tests run: 1, Failures: 0, Errors: 0, Skipped: 0, Time elapsed: 6.436 sec
[mvn] Running org.apache.solr.analysis.TestCharFilters
[mvn] Creating dataDir: /usr/home/hudson/hudson-slave/workspace/Lucene-Solr-Maven-4.x/maven-build/solr/core/src/test/target/test/./solrtest-TestCharFilters-1347879400149
[mvn] Tests run: 2, Failures: 0, Errors: 0, Skipped: 0, Time elapsed: 0.135 sec
[mvn] Running org.apache.solr.core.SolrCoreCheckLockOnStartupTest
[mvn] Creating dataDir: /usr/home/hudson/hudson-slave/workspace/Lucene-Solr-Maven-4.x/maven-build/solr/core/src/test/target/test/./solrtest-SolrCoreCheckLockOnStartupTest-1347879400286
[mvn] 401 T2244 oasc.SolrCore.initIndex SEVERE [collection1] Solr index directory '/usr/home/hudson/hudson-slave/workspace/Lucene-Solr-Maven-4.x/maven-build/solr/core/src/test/target/test/./solrtest-SolrCoreCheckLockOnStartupTest-1347879400286/index/' is locked. Throwing exception
[mvn] Creating dataDir: /usr/home/hudson/hudson-slave/workspace/Lucene-Solr-Maven-4.x/maven-build/solr/core/src/test/target/test/./solrtest-SolrCoreCheckLockOnStartupTest-1347879400697
[mvn] 615 T3 oasc.SolrCore.finalize SEVERE REFCOUNT ERROR: unreferenced org.apache.solr.core.SolrCore@7fb128d6 (collection1) has a reference count of 1
[mvn] 616 T3 oasc.CoreContainer.finalize SEVERE CoreContainer was not shutdown prior to finalize(), indicates a bug -- POSSIBLE RESOURCE LEAK!!! instance=1557171300
[mvn] 711 T2244 oasc.SolrCore.initIndex SEVERE [collection1] Solr index directory '/usr/home/hudson/hudson-slave/workspace/Lucene-Solr-Maven-4.x/maven-build/solr/core/src/test/target/test/./solrtest-SolrCoreCheckLockOnStartupTest-1347879400697/index/' is locked. Throwing exception
[mvn] Tests run: 2, Failures: 0, Errors: 0, Skipped: 0, Time elapsed: 0.733 sec
[mvn] Running org.apache.solr.util.TestFastWriter
[mvn] Tests run: 1, Failures: 0, Errors: 0, Skipped: 0, Time elapsed: 0.272 sec
[mvn] Running org.apache.solr.util.TimeZoneUtilsTest
[mvn] Tests run: 5, Failures: 0, Errors: 0, Skipped: 0, Time elapsed: 0.149 sec
[mvn] Running org.apache.solr.TestTrie
[mvn] 1160 T3 oasc.SolrCore.finalize SEVERE REFCOUNT ERROR: unreferenced org.apache.solr.core.SolrCore@72a94669 (collection1) has a reference count of 1
[mvn] 1161 T3 oasc.CoreContainer.finalize SEVERE CoreContainer was not shutdown prior to finalize(), indicates a bug -- POSSIBLE RESOURCE LEAK!!! instance=2145298188
[mvn] Creating dataDir: /usr/home/hudson/hudson-slave/workspace/Lucene-Solr-Maven-4.x/maven-build/solr/core/src/test/target/test/./solrtest-TestTrie-1347879401456
[mvn] Tests run: 8, Failures: 0, Errors: 0, Skipped: 0, Time elapsed: 0.86 sec
[mvn] Running org.apache.solr.cloud.ChaosMonkeyNothingIsSafeTest
[mvn] Tests run: 1, Failures: 0, Errors: 0, Skipped: 1, Time elapsed: 0.001 sec
[mvn] Running org.apache.solr.spelling.SpellPossibilityIteratorTest
[mvn] Tests run: 3, Failures: 0, Errors: 0, Skipped: 0, Time elapsed: 0.25 sec
[mvn] Running org.apache.solr.spelling.suggest.SuggesterWFSTTest
[mvn] Creating dataDir: /usr/home/hudson/hudson-slave/workspace/Lucene-Solr-Maven-4.x/maven-build/solr/core/src/test/target/test/./solrtest-SuggesterWFSTTest-1347879402557
[mvn] NOTE: per solr.test.leavedatadir, dataDir will not be removed: /usr/home/hudson/hudson-slave/workspace/Lucene-Solr-Maven-4.x/maven-build/solr/core/src/test/target/test/./solrtest-SuggesterWFSTTest-1347879402557
[mvn] Tests run: 4, Failures: 0, Errors: 0, Skipped: 0, Time elapsed: 0.751 sec
[mvn] Running org.apache.solr.update.processor.StatelessScriptUpdateProcessorFactoryTest
[mvn] Creating dataDir: /usr/home/hudson/hudson-slave/workspace/Lucene-Solr-Maven-4.x/maven-build/solr/core/src/test/target/test/./solrtest-StatelessScriptUpdateProcessorFactoryTest-1347879403315
[mvn] Tests run: 7, Failures: 0, Errors: 0, Skipped: 0, Time elapsed: 1.081 sec
[mvn] Running org.apache.solr.core.PluginInfoTest
[mvn] Tests run: 9, Failures: 0, Errors: 0, Skipped: 0, Time elapsed: 0.1 sec
[mvn] Running org.apache.solr.search.similarities.TestPerFieldSimilarity
[mvn] Creating dataDir: /usr/home/hudson/hudson-slave/workspace/Lucene-Solr-Maven-4.x/maven-build/solr/core/src/test/target/test/./solrtest-TestPerFieldSimilarity-1347879404493
[mvn] Tests run: 7, Failures: 0, Errors: 0, Skipped: 0, Time elapsed: 0.117 sec
[mvn] Running org.apache.solr.spelling.TestSuggestSpellingConverter
[mvn] Tests run: 2, Failures: 0, Errors: 0, Skipped: 0, Time elapsed: 0.031 sec
[mvn] Running org.apache.solr.search.TestLFUCache
[mvn] Creating dataDir: /usr/home/hudson/hudson-slave/workspace/Lucene-Solr-Maven-4.x/maven-build/solr/core/src/test/target/test/./solrtest-TestLFUCache-1347879404642
[mvn] {39=39, 38=38, 37=37, 36=36, 35=35, 34=34, 33=33, 32=32, 31=31, 30=30}
[mvn] Tests run: 5, Failures: 0, Errors: 0, Skipped: 0, Time elapsed: 0.442 sec
[mvn] Running org.apache.solr.core.RequestHandlersTest
[mvn] Creating dataDir: /usr/home/hudson/hudson-slave/workspace/Lucene-Solr-Maven-4.x/maven-build/solr/core/src/test/target/test/./solrtest-RequestHandlersTest-1347879405081
[mvn] Tests run: 3, Failures: 0, Errors: 0, Skipped: 0, Time elapsed: 0.55 sec
[mvn] Running org.apache.solr.request.SimpleFacetsTest
[mvn] Creating dataDir: /usr/home/hudson/hudson-slave/workspace/Lucene-Solr-Maven-4.x/maven-build/solr/core/src/test/target/test/./solrtest-SimpleFacetsTest-1347879405637
[mvn] ASYNC NEW_CORE C4 name=collection1 org.apache.solr.core.SolrCore@211eac2c
[mvn] 1842 T2275 C4 oasc.SolrException.log SEVERE org.apache.solr.common.SolrException: Specify the group.field as parameter or local parameter
[mvn] at org.apache.solr.request.SimpleFacets.getGroupedCounts(SimpleFacets.java:360)
[mvn] at org.apache.solr.request.SimpleFacets.getTermCounts(SimpleFacets.java:319)
[mvn] at org.apache.solr.request.SimpleFacets.getFacetFieldCounts(SimpleFacets.java:423)
[mvn] at org.apache.solr.request.SimpleFacets.getFacetCounts(SimpleFacets.java:206)
[mvn] at org.apache.solr.handler.component.FacetComponent.process(FacetComponent.java:87)
[mvn] at org.apache.solr.handler.component.SearchHandler.handleRequestBody(SearchHandler.java:206)
[mvn] at org.apache.solr.handler.RequestHandlerBase.handleRequest(RequestHandlerBase.java:129)
[mvn] at org.apache.solr.core.SolrCore.execute(SolrCore.java:1701)
[mvn] at org.apache.solr.util.TestHarness.query(TestHarness.java:364)
[mvn] at org.apache.solr.util.TestHarness.query(TestHarness.java:346)
[mvn] at org.apache.solr.request.SimpleFacetsTest.testSimpleGroupedFacets(SimpleFacetsTest.java:245)
[mvn] at sun.reflect.NativeMethodAccessorImpl.invoke0(Native Method)
[mvn] at sun.reflect.NativeMethodAccessorImpl.invoke(NativeMethodAccessorImpl.java:57)
[mvn] at sun.reflect.DelegatingMethodAccessorImpl.invoke(DelegatingMethodAccessorImpl.java:43)
[mvn] at java.lang.reflect.Method.invoke(Method.java:616)
[mvn] at com.carrotsearch.randomizedtesting.RandomizedRunner.invoke(RandomizedRunner.java:1559)
[mvn] at com.carrotsearch.randomizedtesting.RandomizedRunner.access$600(RandomizedRunner.java:79)
[mvn] at com.carrotsearch.randomizedtesting.RandomizedRunner$6.evaluate(RandomizedRunner.java:737)
[mvn] at com.carrotsearch.randomizedtesting.RandomizedRunner$7.evaluate(RandomizedRunner.java:773)
[mvn] at com.carrotsearch.randomizedtesting.RandomizedRunner$8.evaluate(RandomizedRunner.java:787)
[mvn] at com.carrotsearch.randomizedtesting.rules.SystemPropertiesRestoreRule$1.evaluate(SystemPropertiesRestoreRule.java:53)
[mvn] at org.apache.lucene.util.TestRuleSetupTeardownChained$1.evaluate(TestRuleSetupTeardownChained.java:50)
[mvn] at org.apache.lucene.util.TestRuleFieldCacheSanity$1.evaluate(TestRuleFieldCacheSanity.java:51)
[mvn] at org.apache.lucene.util.AbstractBeforeAfterRule$1.evaluate(AbstractBeforeAfterRule.java:45)
[mvn] at com.carrotsearch.randomizedtesting.rules.SystemPropertiesInvariantRule$1.evaluate(SystemPropertiesInvariantRule.java:55)
[mvn] at org.apache.lucene.util.TestRuleThreadAndTestName$1.evaluate(TestRuleThreadAndTestName.java:48)
[mvn] at org.apache.lucene.util.TestRuleIgnoreAfterMaxFailures$1.evaluate(TestRuleIgnoreAfterMaxFailures.java:70)
[mvn] at org.apache.lucene.util.TestRuleMarkFailure$1.evaluate(TestRuleMarkFailure.java:48)
[mvn] at com.carrotsearch.randomizedtesting.rules.StatementAdapter.evaluate(StatementAdapter.java:36)
[mvn] at com.carrotsearch.randomizedtesting.ThreadLeakControl$StatementRunner.run(ThreadLeakControl.java:358)
[mvn] at com.carrotsearch.randomizedtesting.ThreadLeakControl.forkTimeoutingTask(ThreadLeakControl.java:782)
[mvn] at com.carrotsearch.randomizedtesting.ThreadLeakControl$3.evaluate(ThreadLeakControl.java:442)
[mvn] at com.carrotsearch.randomizedtesting.RandomizedRunner.runSingleTest(RandomizedRunner.java:746)
[mvn] at com.carrotsearch.randomizedtesting.RandomizedRunner$3.evaluate(RandomizedRunner.java:648)
[mvn] at com.carrotsearch.randomizedtesting.RandomizedRunner$4.evaluate(RandomizedRunner.java:682)
[mvn] at com.carrotsearch.randomizedtesting.RandomizedRunner$5.evaluate(RandomizedRunner.java:693)
[mvn] at com.carrotsearch.randomizedtesting.rules.StatementAdapter.evaluate(StatementAdapter.java:36)
[mvn] at com.carrotsearch.randomizedtesting.rules.SystemPropertiesRestoreRule$1.evaluate(SystemPropertiesRestoreRule.java:53)
[mvn] at org.apache.lucene.util.AbstractBeforeAfterRule$1.evaluate(AbstractBeforeAfterRule.java:45)
[mvn] at org.apache.lucene.util.TestRuleStoreClassName$1.evaluate(TestRuleStoreClassName.java:42)
[mvn] at com.carrotsearch.randomizedtesting.rules.SystemPropertiesInvariantRule$1.evaluate(SystemPropertiesInvariantRule.java:55)
[mvn] at com.carrotsearch.randomizedtesting.rules.NoShadowingOrOverridesOnMethodsRule$1.evaluate(NoShadowingOrOverridesOnMethodsRule.java:39)
[mvn] at com.carrotsearch.randomizedtesting.rules.NoShadowingOrOverridesOnMethodsRule$1.evaluate(NoShadowingOrOverridesOnMethodsRule.java:39)
[mvn] at com.carrotsearch.randomizedtesting.rules.StatementAdapter.evaluate(StatementAdapter.java:36)
[mvn] at org.apache.lucene.util.TestRuleAssertionsRequired$1.evaluate(TestRuleAssertionsRequired.java:43)
[mvn] at org.apache.lucene.util.TestRuleMarkFailure$1.evaluate(TestRuleMarkFailure.java:48)
[mvn] at org.apache.lucene.util.TestRuleIgnoreAfterMaxFailures$1.evaluate(TestRuleIgnoreAfterMaxFailures.java:70)
[mvn] at org.apache.lucene.util.TestRuleIgnoreTestSuites$1.evaluate(TestRuleIgnoreTestSuites.java:55)
[mvn] at com.carrotsearch.randomizedtesting.rules.StatementAdapter.evaluate(StatementAdapter.java:36)
[mvn] at com.carrotsearch.randomizedtesting.ThreadLeakControl$StatementRunner.run(ThreadLeakControl.java:358)
[mvn] at java.lang.Thread.run(Thread.java:679)
[mvn]
[mvn] 2955 T2275 C4 oasc.SolrException.log SEVERE org.apache.solr.common.SolrException: range facet infinite loop: gap is either zero, or too small relative start/end and caused underflow: 23.0 + 0 = 23.0
[mvn] at org.apache.solr.request.SimpleFacets.getFacetRangeCounts(SimpleFacets.java:1122)
[mvn] at org.apache.solr.request.SimpleFacets.getFacetRangeCounts(SimpleFacets.java:1074)
[mvn] at org.apache.solr.request.SimpleFacets.getFacetRangeCounts(SimpleFacets.java:1018)
[mvn] at org.apache.solr.request.SimpleFacets.getFacetCounts(SimpleFacets.java:208)
[mvn] at org.apache.solr.handler.component.FacetComponent.process(FacetComponent.java:87)
[mvn] at org.apache.solr.handler.component.SearchHandler.handleRequestBody(SearchHandler.java:206)
[mvn] at org.apache.solr.handler.RequestHandlerBase.handleRequest(RequestHandlerBase.java:129)
[mvn] at org.apache.solr.core.SolrCore.execute(SolrCore.java:1701)
[mvn] at org.apache.solr.util.TestHarness.query(TestHarness.java:364)
[mvn] at org.apache.solr.util.TestHarness.query(TestHarness.java:346)
[mvn] at org.apache.solr.SolrTestCaseJ4.assertQEx(SolrTestCaseJ4.java:611)
[mvn] at org.apache.solr.request.SimpleFacetsTest.testRangeFacetInfiniteLoopDetection(SimpleFacetsTest.java:2052)
[mvn] at sun.reflect.NativeMethodAccessorImpl.invoke0(Native Method)
[mvn] at sun.reflect.NativeMethodAccessorImpl.invoke(NativeMethodAccessorImpl.java:57)
[mvn] at sun.reflect.DelegatingMethodAccessorImpl.invoke(DelegatingMethodAccessorImpl.java:43)
[mvn] at java.lang.reflect.Method.invoke(Method.java:616)
[mvn] at com.carrotsearch.randomizedtesting.RandomizedRunner.invoke(RandomizedRunner.java:1559)
[mvn] at com.carrotsearch.randomizedtesting.RandomizedRunner.access$600(RandomizedRunner.java:79)
[mvn] at com.carrotsearch.randomizedtesting.RandomizedRunner$6.evaluate(RandomizedRunner.java:737)
[mvn] at com.carrotsearch.randomizedtesting.RandomizedRunner$7.evaluate(RandomizedRunner.java:773)
[mvn] at com.carrotsearch.randomizedtesting.RandomizedRunner$8.evaluate(RandomizedRunner.java:787)
[mvn] at com.carrotsearch.randomizedtesting.rules.SystemPropertiesRestoreRule$1.evaluate(SystemPropertiesRestoreRule.java:53)
[mvn] at org.apache.lucene.util.TestRuleSetupTeardownChained$1.evaluate(TestRuleSetupTeardownChained.java:50)
[mvn] at org.apache.lucene.util.TestRuleFieldCacheSanity$1.evaluate(TestRuleFieldCacheSanity.java:51)
[mvn] at org.apache.lucene.util.AbstractBeforeAfterRule$1.evaluate(AbstractBeforeAfterRule.java:45)
[mvn] at com.carrotsearch.randomizedtesting.rules.SystemPropertiesInvariantRule$1.evaluate(SystemPropertiesInvariantRule.java:55)
[mvn] at org.apache.lucene.util.TestRuleThreadAndTestName$1.evaluate(TestRuleThreadAndTestName.java:48)
[mvn] at org.apache.lucene.util.TestRuleIgnoreAfterMaxFailures$1.evaluate(TestRuleIgnoreAfterMaxFailures.java:70)
[mvn] at org.apache.lucene.util.TestRuleMarkFailure$1.evaluate(TestRuleMarkFailure.java:48)
[mvn] at com.carrotsearch.randomizedtesting.rules.StatementAdapter.evaluate(StatementAdapter.java:36)
[mvn] at com.carrotsearch.randomizedtesting.ThreadLeakControl$StatementRunner.run(ThreadLeakControl.java:358)
[mvn] at com.carrotsearch.randomizedtesting.ThreadLeakControl.forkTimeoutingTask(ThreadLeakControl.java:782)
[mvn] at com.carrotsearch.randomizedtesting.ThreadLeakControl$3.evaluate(ThreadLeakControl.java:442)
[mvn] at com.carrotsearch.randomizedtesting.RandomizedRunner.runSingleTest(RandomizedRunner.java:746)
[mvn] at com.carrotsearch.randomizedtesting.RandomizedRunner$3.evaluate(RandomizedRunner.java:648)
[mvn] at com.carrotsearch.randomizedtesting.RandomizedRunner$4.evaluate(RandomizedRunner.java:682)
[mvn] at com.carrotsearch.randomizedtesting.RandomizedRunner$5.evaluate(RandomizedRunner.java:693)
[mvn] at com.carrotsearch.randomizedtesting.rules.StatementAdapter.evaluate(StatementAdapter.java:36)
[mvn] at com.carrotsearch.randomizedtesting.rules.SystemPropertiesRestoreRule$1.evaluate(SystemPropertiesRestoreRule.java:53)
[mvn] at org.apache.lucene.util.AbstractBeforeAfterRule$1.evaluate(AbstractBeforeAfterRule.java:45)
[mvn] at org.apache.lucene.util.TestRuleStoreClassName$1.evaluate(TestRuleStoreClassName.java:42)
[mvn] at com.carrotsearch.randomizedtesting.rules.SystemPropertiesInvariantRule$1.evaluate(SystemPropertiesInvariantRule.java:55)
[mvn] at com.carrotsearch.randomizedtesting.rules.NoShadowingOrOverridesOnMethodsRule$1.evaluate(NoShadowingOrOverridesOnMethodsRule.java:39)
[mvn] at com.carrotsearch.randomizedtesting.rules.NoShadowingOrOverridesOnMethodsRule$1.evaluate(NoShadowingOrOverridesOnMethodsRule.java:39)
[mvn] at com.carrotsearch.randomizedtesting.rules.StatementAdapter.evaluate(StatementAdapter.java:36)
[mvn] at org.apache.lucene.util.TestRuleAssertionsRequired$1.evaluate(TestRuleAssertionsRequired.java:43)
[mvn] at org.apache.lucene.util.TestRuleMarkFailure$1.evaluate(TestRuleMarkFailure.java:48)
[mvn] at org.apache.lucene.util.TestRuleIgnoreAfterMaxFailures$1.evaluate(TestRuleIgnoreAfterMaxFailures.java:70)
[mvn] at org.apache.lucene.util.TestRuleIgnoreTestSuites$1.evaluate(TestRuleIgnoreTestSuites.java:55)
[mvn] at com.carrotsearch.randomizedtesting.rules.StatementAdapter.evaluate(StatementAdapter.java:36)
[mvn] at com.carrotsearch.randomizedtesting.ThreadLeakControl$StatementRunner.run(ThreadLeakControl.java:358)
[mvn] at java.lang.Thread.run(Thread.java:679)
[mvn]
[mvn] 2956 T2275 C4 oasc.SolrException.log SEVERE org.apache.solr.common.SolrException: range facet infinite loop: gap is either zero, or too small relative start/end and caused underflow: 23.0 + 0 = 23.0
[mvn] at org.apache.solr.request.SimpleFacets.getFacetRangeCounts(SimpleFacets.java:1122)
[mvn] at org.apache.solr.request.SimpleFacets.getFacetRangeCounts(SimpleFacets.java:1074)
[mvn] at org.apache.solr.request.SimpleFacets.getFacetRangeCounts(SimpleFacets.java:1018)
[mvn] at org.apache.solr.request.SimpleFacets.getFacetCounts(SimpleFacets.java:208)
[mvn] at org.apache.solr.handler.component.FacetComponent.process(FacetComponent.java:87)
[mvn] at org.apache.solr.handler.component.SearchHandler.handleRequestBody(SearchHandler.java:206)
[mvn] at org.apache.solr.handler.RequestHandlerBase.handleRequest(RequestHandlerBase.java:129)
[mvn] at org.apache.solr.core.SolrCore.execute(SolrCore.java:1701)
[mvn] at org.apache.solr.util.TestHarness.query(TestHarness.java:364)
[mvn] at org.apache.solr.util.TestHarness.query(TestHarness.java:346)
[mvn] at org.apache.solr.SolrTestCaseJ4.assertQEx(SolrTestCaseJ4.java:611)
[mvn] at org.apache.solr.request.SimpleFacetsTest.testRangeFacetInfiniteLoopDetection(SimpleFacetsTest.java:2052)
[mvn] at sun.reflect.NativeMethodAccessorImpl.invoke0(Native Method)
[mvn] at sun.reflect.NativeMethodAccessorImpl.invoke(NativeMethodAccessorImpl.java:57)
[mvn] at sun.reflect.DelegatingMethodAccessorImpl.invoke(DelegatingMethodAccessorImpl.java:43)
[mvn] at java.lang.reflect.Method.invoke(Method.java:616)
[mvn] at com.carrotsearch.randomizedtesting.RandomizedRunner.invoke(RandomizedRunner.java:1559)
[mvn] at com.carrotsearch.randomizedtesting.RandomizedRunner.access$600(RandomizedRunner.java:79)
[mvn] at com.carrotsearch.randomizedtesting.RandomizedRunner$6.evaluate(RandomizedRunner.java:737)
[mvn] at com.carrotsearch.randomizedtesting.RandomizedRunner$7.evaluate(RandomizedRunner.java:773)
[mvn] at com.carrotsearch.randomizedtesting.RandomizedRunner$8.evaluate(RandomizedRunner.java:787)
[mvn] at com.carrotsearch.randomizedtesting.rules.SystemPropertiesRestoreRule$1.evaluate(SystemPropertiesRestoreRule.java:53)
[mvn] at org.apache.lucene.util.TestRuleSetupTeardownChained$1.evaluate(TestRuleSetupTeardownChained.java:50)
[mvn] at org.apache.lucene.util.TestRuleFieldCacheSanity$1.evaluate(TestRuleFieldCacheSanity.java:51)
[mvn] at org.apache.lucene.util.AbstractBeforeAfterRule$1.evaluate(AbstractBeforeAfterRule.java:45)
[mvn] at com.carrotsearch.randomizedtesting.rules.SystemPropertiesInvariantRule$1.evaluate(SystemPropertiesInvariantRule.java:55)
[mvn] at org.apache.lucene.util.TestRuleThreadAndTestName$1.evaluate(TestRuleThreadAndTestName.java:48)
[mvn] at org.apache.lucene.util.TestRuleIgnoreAfterMaxFailures$1.evaluate(TestRuleIgnoreAfterMaxFailures.java:70)
[mvn] at org.apache.lucene.util.TestRuleMarkFailure$1.evaluate(TestRuleMarkFailure.java:48)
[mvn] at com.carrotsearch.randomizedtesting.rules.StatementAdapter.evaluate(StatementAdapter.java:36)
[mvn] at com.carrotsearch.randomizedtesting.ThreadLeakControl$StatementRunner.run(ThreadLeakControl.java:358)
[mvn] at com.carrotsearch.randomizedtesting.ThreadLeakControl.forkTimeoutingTask(ThreadLeakControl.java:782)
[mvn] at com.carrotsearch.randomizedtesting.ThreadLeakControl$3.evaluate(ThreadLeakControl.java:442)
[mvn] at com.carrotsearch.randomizedtesting.RandomizedRunner.runSingleTest(RandomizedRunner.java:746)
[mvn] at com.carrotsearch.randomizedtesting.RandomizedRunner$3.evaluate(RandomizedRunner.java:648)
[mvn] at com.carrotsearch.randomizedtesting.RandomizedRunner$4.evaluate(RandomizedRunner.java:682)
[mvn] at com.carrotsearch.randomizedtesting.RandomizedRunner$5.evaluate(RandomizedRunner.java:693)
[mvn] at com.carrotsearch.randomizedtesting.rules.StatementAdapter.evaluate(StatementAdapter.java:36)
[mvn] at com.carrotsearch.randomizedtesting.rules.SystemPropertiesRestoreRule$1.evaluate(SystemPropertiesRestoreRule.java:53)
[mvn] at org.apache.lucene.util.AbstractBeforeAfterRule$1.evaluate(AbstractBeforeAfterRule.java:45)
[mvn] at org.apache.lucene.util.TestRuleStoreClassName$1.evaluate(TestRuleStoreClassName.java:42)
[mvn] at com.carrotsearch.randomizedtesting.rules.SystemPropertiesInvariantRule$1.evaluate(SystemPropertiesInvariantRule.java:55)
[mvn] at com.carrotsearch.randomizedtesting.rules.NoShadowingOrOverridesOnMethodsRule$1.evaluate(NoShadowingOrOverridesOnMethodsRule.java:39)
[mvn] at com.carrotsearch.randomizedtesting.rules.NoShadowingOrOverridesOnMethodsRule$1.evaluate(NoShadowingOrOverridesOnMethodsRule.java:39)
[mvn] at com.carrotsearch.randomizedtesting.rules.StatementAdapter.evaluate(StatementAdapter.java:36)
[mvn] at org.apache.lucene.util.TestRuleAssertionsRequired$1.evaluate(TestRuleAssertionsRequired.java:43)
[mvn] at org.apache.lucene.util.TestRuleMarkFailure$1.evaluate(TestRuleMarkFailure.java:48)
[mvn] at org.apache.lucene.util.TestRuleIgnoreAfterMaxFailures$1.evaluate(TestRuleIgnoreAfterMaxFailures.java:70)
[mvn] at org.apache.lucene.util.TestRuleIgnoreTestSuites$1.evaluate(TestRuleIgnoreTestSuites.java:55)
[mvn] at com.carrotsearch.randomizedtesting.rules.StatementAdapter.evaluate(StatementAdapter.java:36)
[mvn] at com.carrotsearch.randomizedtesting.ThreadLeakControl$StatementRunner.run(ThreadLeakControl.java:358)
[mvn] at java.lang.Thread.run(Thread.java:679)
[mvn]
[mvn] 2957 T2275 C4 oasc.SolrException.log SEVERE org.apache.solr.common.SolrException: range facet infinite loop: gap is either zero, or too small relative start/end and caused underflow: 23.0 + 0 = 23.0
[mvn] at org.apache.solr.request.SimpleFacets.getFacetRangeCounts(SimpleFacets.java:1122)
[mvn] at org.apache.solr.request.SimpleFacets.getFacetRangeCounts(SimpleFacets.java:1074)
[mvn] at org.apache.solr.request.SimpleFacets.getFacetRangeCounts(SimpleFacets.java:1018)
[mvn] at org.apache.solr.request.SimpleFacets.getFacetCounts(SimpleFacets.java:208)
[mvn] at org.apache.solr.handler.component.FacetComponent.process(FacetComponent.java:87)
[mvn] at org.apache.solr.handler.component.SearchHandler.handleRequestBody(SearchHandler.java:206)
[mvn] at org.apache.solr.handler.RequestHandlerBase.handleRequest(RequestHandlerBase.java:129)
[mvn] at org.apache.solr.core.SolrCore.execute(SolrCore.java:1701)
[mvn] at org.apache.solr.util.TestHarness.query(TestHarness.java:364)
[mvn] at org.apache.solr.util.TestHarness.query(TestHarness.java:346)
[mvn] at org.apache.solr.SolrTestCaseJ4.assertQEx(SolrTestCaseJ4.java:611)
[mvn] at org.apache.solr.request.SimpleFacetsTest.testRangeFacetInfiniteLoopDetection(SimpleFacetsTest.java:2052)
[mvn] at sun.reflect.NativeMethodAccessorImpl.invoke0(Native Method)
[mvn] at sun.reflect.NativeMethodAccessorImpl.invoke(NativeMethodAccessorImpl.java:57)
[mvn] at sun.reflect.DelegatingMethodAccessorImpl.invoke(DelegatingMethodAccessorImpl.java:43)
[mvn] at java.lang.reflect.Method.invoke(Method.java:616)
[mvn] at com.carrotsearch.randomizedtesting.RandomizedRunner.invoke(RandomizedRunner.java:1559)
[mvn] at com.carrotsearch.randomizedtesting.RandomizedRunner.access$600(RandomizedRunner.java:79)
[mvn] at com.carrotsearch.randomizedtesting.RandomizedRunner$6.evaluate(RandomizedRunner.java:737)
[mvn] at com.carrotsearch.randomizedtesting.RandomizedRunner$7.evaluate(RandomizedRunner.java:773)
[mvn] at com.carrotsearch.randomizedtesting.RandomizedRunner$8.evaluate(RandomizedRunner.java:787)
[mvn] at com.carrotsearch.randomizedtesting.rules.SystemPropertiesRestoreRule$1.evaluate(SystemPropertiesRestoreRule.java:53)
[mvn] at org.apache.lucene.util.TestRuleSetupTeardownChained$1.evaluate(TestRuleSetupTeardownChained.java:50)
[mvn] at org.apache.lucene.util.TestRuleFieldCacheSanity$1.evaluate(TestRuleFieldCacheSanity.java:51)
[mvn] at org.apache.lucene.util.AbstractBeforeAfterRule$1.evaluate(AbstractBeforeAfterRule.java:45)
[mvn] at com.carrotsearch.randomizedtesting.rules.SystemPropertiesInvariantRule$1.evaluate(SystemPropertiesInvariantRule.java:55)
[mvn] at org.apache.lucene.util.TestRuleThreadAndTestName$1.evaluate(TestRuleThreadAndTestName.java:48)
[mvn] at org.apache.lucene.util.TestRuleIgnoreAfterMaxFailures$1.evaluate(TestRuleIgnoreAfterMaxFailures.java:70)
[mvn] at org.apache.lucene.util.TestRuleMarkFailure$1.evaluate(TestRuleMarkFailure.java:48)
[mvn] at com.carrotsearch.randomizedtesting.rules.StatementAdapter.evaluate(StatementAdapter.java:36)
[mvn] at com.carrotsearch.randomizedtesting.ThreadLeakControl$StatementRunner.run(ThreadLeakControl.java:358)
[mvn] at com.carrotsearch.randomizedtesting.ThreadLeakControl.forkTimeoutingTask(ThreadLeakControl.java:782)
[mvn] at com.carrotsearch.randomizedtesting.ThreadLeakControl$3.evaluate(ThreadLeakControl.java:442)
[mvn] at com.carrotsearch.randomizedtesting.RandomizedRunner.runSingleTest(RandomizedRunner.java:746)
[mvn] at com.carrotsearch.randomizedtesting.RandomizedRunner$3.evaluate(RandomizedRunner.java:648)
[mvn] at com.carrotsearch.randomizedtesting.RandomizedRunner$4.evaluate(RandomizedRunner.java:682)
[mvn] at com.carrotsearch.randomizedtesting.RandomizedRunner$5.evaluate(RandomizedRunner.java:693)
[mvn] at com.carrotsearch.randomizedtesting.rules.StatementAdapter.evaluate(StatementAdapter.java:36)
[mvn] at com.carrotsearch.randomizedtesting.rules.SystemPropertiesRestoreRule$1.evaluate(SystemPropertiesRestoreRule.java:53)
[mvn] at org.apache.lucene.util.AbstractBeforeAfterRule$1.evaluate(AbstractBeforeAfterRule.java:45)
[mvn] at org.apache.lucene.util.TestRuleStoreClassName$1.evaluate(TestRuleStoreClassName.java:42)
[mvn] at com.carrotsearch.randomizedtesting.rules.SystemPropertiesInvariantRule$1.evaluate(SystemPropertiesInvariantRule.java:55)
[mvn] at com.carrotsearch.randomizedtesting.rules.NoShadowingOrOverridesOnMethodsRule$1.evaluate(NoShadowingOrOverridesOnMethodsRule.java:39)
[mvn] at com.carrotsearch.randomizedtesting.rules.NoShadowingOrOverridesOnMethodsRule$1.evaluate(NoShadowingOrOverridesOnMethodsRule.java:39)
[mvn] at com.carrotsearch.randomizedtesting.rules.StatementAdapter.evaluate(StatementAdapter.java:36)
[mvn] at org.apache.lucene.util.TestRuleAssertionsRequired$1.evaluate(TestRuleAssertionsRequired.java:43)
[mvn] at org.apache.lucene.util.TestRuleMarkFailure$1.evaluate(TestRuleMarkFailure.java:48)
[mvn] at org.apache.lucene.util.TestRuleIgnoreAfterMaxFailures$1.evaluate(TestRuleIgnoreAfterMaxFailures.java:70)
[mvn] at org.apache.lucene.util.TestRuleIgnoreTestSuites$1.evaluate(TestRuleIgnoreTestSuites.java:55)
[mvn] at com.carrotsearch.randomizedtesting.rules.StatementAdapter.evaluate(StatementAdapter.java:36)
[mvn] at com.carrotsearch.randomizedtesting.ThreadLeakControl$StatementRunner.run(ThreadLeakControl.java:358)
[mvn] at java.lang.Thread.run(Thread.java:679)
[mvn]
[mvn] 2957 T2275 C4 oasc.SolrException.log SEVERE org.apache.solr.common.SolrException: range facet infinite loop: gap is either zero, or too small relative start/end and caused underflow: 23.0 + 0 = 23.0
[mvn] at org.apache.solr.request.SimpleFacets.getFacetRangeCounts(SimpleFacets.java:1122)
[mvn] at org.apache.solr.request.SimpleFacets.getFacetRangeCounts(SimpleFacets.java:1074)
[mvn] at org.apache.solr.request.SimpleFacets.getFacetRangeCounts(SimpleFacets.java:1018)
[mvn] at org.apache.solr.request.SimpleFacets.getFacetCounts(SimpleFacets.java:208)
[mvn] at org.apache.solr.handler.component.FacetComponent.process(FacetComponent.java:87)
[mvn] at org.apache.solr.handler.component.SearchHandler.handleRequestBody(SearchHandler.java:206)
[mvn] at org.apache.solr.handler.RequestHandlerBase.handleRequest(RequestHandlerBase.java:129)
[mvn] at org.apache.solr.core.SolrCore.execute(SolrCore.java:1701)
[mvn] at org.apache.solr.util.TestHarness.query(TestHarness.java:364)
[mvn] at org.apache.solr.util.TestHarness.query(TestHarness.java:346)
[mvn] at org.apache.solr.SolrTestCaseJ4.assertQEx(SolrTestCaseJ4.java:611)
[mvn] at org.apache.solr.request.SimpleFacetsTest.testRangeFacetInfiniteLoopDetection(SimpleFacetsTest.java:2052)
[mvn] at sun.reflect.NativeMethodAccessorImpl.invoke0(Native Method)
[mvn] at sun.reflect.NativeMethodAccessorImpl.invoke(NativeMethodAccessorImpl.java:57)
[mvn] at sun.reflect.DelegatingMethodAccessorImpl.invoke(DelegatingMethodAccessorImpl.java:43)
[mvn] at java.lang.reflect.Method.invoke(Method.java:616)
[mvn] at com.carrotsearch.randomizedtesting.RandomizedRunner.invoke(RandomizedRunner.java:1559)
[mvn] at com.carrotsearch.randomizedtesting.RandomizedRunner.access$600(RandomizedRunner.java:79)
[mvn] at com.carrotsearch.randomizedtesting.RandomizedRunner$6.evaluate(RandomizedRunner.java:737)
[mvn] at com.carrotsearch.randomizedtesting.RandomizedRunner$7.evaluate(RandomizedRunner.java:773)
[mvn] at com.carrotsearch.randomizedtesting.RandomizedRunner$8.evaluate(RandomizedRunner.java:787)
[mvn] at com.carrotsearch.randomizedtesting.rules.SystemPropertiesRestoreRule$1.evaluate(SystemPropertiesRestoreRule.java:53)
[mvn] at org.apache.lucene.util.TestRuleSetupTeardownChained$1.evaluate(TestRuleSetupTeardownChained.java:50)
[mvn] at org.apache.lucene.util.TestRuleFieldCacheSanity$1.evaluate(TestRuleFieldCacheSanity.java:51)
[mvn] at org.apache.lucene.util.AbstractBeforeAfterRule$1.evaluate(AbstractBeforeAfterRule.java:45)
[mvn] at com.carrotsearch.randomizedtesting.rules.SystemPropertiesInvariantRule$1.evaluate(SystemPropertiesInvariantRule.java:55)
[mvn] at org.apache.lucene.util.TestRuleThreadAndTestName$1.evaluate(TestRuleThreadAndTestName.java:48)
[mvn] at org.apache.lucene.util.TestRuleIgnoreAfterMaxFailures$1.evaluate(TestRuleIgnoreAfterMaxFailures.java:70)
[mvn] at org.apache.lucene.util.TestRuleMarkFailure$1.evaluate(TestRuleMarkFailure.java:48)
[mvn] at com.carrotsearch.randomizedtesting.rules.StatementAdapter.evaluate(StatementAdapter.java:36)
[mvn] at com.carrotsearch.randomizedtesting.ThreadLeakControl$StatementRunner.run(ThreadLeakControl.java:358)
[mvn] at com.carrotsearch.randomizedtesting.ThreadLeakControl.forkTimeoutingTask(ThreadLeakControl.java:782)
[mvn] at com.carrotsearch.randomizedtesting.ThreadLeakControl$3.evaluate(ThreadLeakControl.java:442)
[mvn] at com.carrotsearch.randomizedtesting.RandomizedRunner.runSingleTest(RandomizedRunner.java:746)
[mvn] at com.carrotsearch.randomizedtesting.RandomizedRunner$3.evaluate(RandomizedRunner.java:648)
[mvn] at com.carrotsearch.randomizedtesting.RandomizedRunner$4.evaluate(RandomizedRunner.java:682)
[mvn] at com.carrotsearch.randomizedtesting.RandomizedRunner$5.evaluate(RandomizedRunner.java:693)
[mvn] at com.carrotsearch.randomizedtesting.rules.StatementAdapter.evaluate(StatementAdapter.java:36)
[mvn] at com.carrotsearch.randomizedtesting.rules.SystemPropertiesRestoreRule$1.evaluate(SystemPropertiesRestoreRule.java:53)
[mvn] at org.apache.lucene.util.AbstractBeforeAfterRule$1.evaluate(AbstractBeforeAfterRule.java:45)
[mvn] at org.apache.lucene.util.TestRuleStoreClassName$1.evaluate(TestRuleStoreClassName.java:42)
[mvn] at com.carrotsearch.randomizedtesting.rules.SystemPropertiesInvariantRule$1.evaluate(SystemPropertiesInvariantRule.java:55)
[mvn] at com.carrotsearch.randomizedtesting.rules.NoShadowingOrOverridesOnMethodsRule$1.evaluate(NoShadowingOrOverridesOnMethodsRule.java:39)
[mvn] at com.carrotsearch.randomizedtesting.rules.NoShadowingOrOverridesOnMethodsRule$1.evaluate(NoShadowingOrOverridesOnMethodsRule.java:39)
[mvn] at com.carrotsearch.randomizedtesting.rules.StatementAdapter.evaluate(StatementAdapter.java:36)
[mvn] at org.apache.lucene.util.TestRuleAssertionsRequired$1.evaluate(TestRuleAssertionsRequired.java:43)
[mvn] at org.apache.lucene.util.TestRuleMarkFailure$1.evaluate(TestRuleMarkFailure.java:48)
[mvn] at org.apache.lucene.util.TestRuleIgnoreAfterMaxFailures$1.evaluate(TestRuleIgnoreAfterMaxFailures.java:70)
[mvn] at org.apache.lucene.util.TestRuleIgnoreTestSuites$1.evaluate(TestRuleIgnoreTestSuites.java:55)
[mvn] at com.carrotsearch.randomizedtesting.rules.StatementAdapter.evaluate(StatementAdapter.java:36)
[mvn] at com.carrotsearch.randomizedtesting.ThreadLeakControl$StatementRunner.run(ThreadLeakControl.java:358)
[mvn] at java.lang.Thread.run(Thread.java:679)
[mvn]
[mvn] 2958 T2275 C4 oasc.SolrException.log SEVERE org.apache.solr.common.SolrException: range facet infinite loop: gap is either zero, or too small relative start/end and caused underflow: 23 + 0 = 23
[mvn] at org.apache.solr.request.SimpleFacets.getFacetRangeCounts(SimpleFacets.java:1122)
[mvn] at org.apache.solr.request.SimpleFacets.getFacetRangeCounts(SimpleFacets.java:1074)
[mvn] at org.apache.solr.request.SimpleFacets.getFacetRangeCounts(SimpleFacets.java:1018)
[mvn] at org.apache.solr.request.SimpleFacets.getFacetCounts(SimpleFacets.java:208)
[mvn] at org.apache.solr.handler.component.FacetComponent.process(FacetComponent.java:87)
[mvn] at org.apache.solr.handler.component.SearchHandler.handleRequestBody(SearchHandler.java:206)
[mvn] at org.apache.solr.handler.RequestHandlerBase.handleRequest(RequestHandlerBase.java:129)
[mvn] at org.apache.solr.core.SolrCore.execute(SolrCore.java:1701)
[mvn] at org.apache.solr.util.TestHarness.query(TestHarness.java:364)
[mvn] at org.apache.solr.util.TestHarness.query(TestHarness.java:346)
[mvn] at org.apache.solr.SolrTestCaseJ4.assertQEx(SolrTestCaseJ4.java:611)
[mvn] at org.apache.solr.request.SimpleFacetsTest.testRangeFacetInfiniteLoopDetection(SimpleFacetsTest.java:2052)
[mvn] at sun.reflect.NativeMethodAccessorImpl.invoke0(Native Method)
[mvn] at sun.reflect.NativeMethodAccessorImpl.invoke(NativeMethodAccessorImpl.java:57)
[mvn] at sun.reflect.DelegatingMethodAccessorImpl.invoke(DelegatingMethodAccessorImpl.java:43)
[mvn] at java.lang.reflect.Method.invoke(Method.java:616)
[mvn] at com.carrotsearch.randomizedtesting.RandomizedRunner.invoke(RandomizedRunner.java:1559)
[mvn] at com.carrotsearch.randomizedtesting.RandomizedRunner.access$600(RandomizedRunner.java:79)
[mvn] at com.carrotsearch.randomizedtesting.RandomizedRunner$6.evaluate(RandomizedRunner.java:737)
[mvn] at com.carrotsearch.randomizedtesting.RandomizedRunner$7.evaluate(RandomizedRunner.java:773)
[mvn] at com.carrotsearch.randomizedtesting.RandomizedRunner$8.evaluate(RandomizedRunner.java:787)
[mvn] at com.carrotsearch.randomizedtesting.rules.SystemPropertiesRestoreRule$1.evaluate(SystemPropertiesRestoreRule.java:53)
[mvn] at org.apache.lucene.util.TestRuleSetupTeardownChained$1.evaluate(TestRuleSetupTeardownChained.java:50)
[mvn] at org.apache.lucene.util.TestRuleFieldCacheSanity$1.evaluate(TestRuleFieldCacheSanity.java:51)
[mvn] at org.apache.lucene.util.AbstractBeforeAfterRule$1.evaluate(AbstractBeforeAfterRule.java:45)
[mvn] at com.carrotsearch.randomizedtesting.rules.SystemPropertiesInvariantRule$1.evaluate(SystemPropertiesInvariantRule.java:55)
[mvn] at org.apache.lucene.util.TestRuleThreadAndTestName$1.evaluate(TestRuleThreadAndTestName.java:48)
[mvn] at org.apache.lucene.util.TestRuleIgnoreAfterMaxFailures$1.evaluate(TestRuleIgnoreAfterMaxFailures.java:70)
[mvn] at org.apache.lucene.util.TestRuleMarkFailure$1.evaluate(TestRuleMarkFailure.java:48)
[mvn] at com.carrotsearch.randomizedtesting.rules.StatementAdapter.evaluate(StatementAdapter.java:36)
[mvn] at com.carrotsearch.randomizedtesting.ThreadLeakControl$StatementRunner.run(ThreadLeakControl.java:358)
[mvn] at com.carrotsearch.randomizedtesting.ThreadLeakControl.forkTimeoutingTask(ThreadLeakControl.java:782)
[mvn] at com.carrotsearch.randomizedtesting.ThreadLeakControl$3.evaluate(ThreadLeakControl.java:442)
[mvn] at com.carrotsearch.randomizedtesting.RandomizedRunner.runSingleTest(RandomizedRunner.java:746)
[mvn] at com.carrotsearch.randomizedtesting.RandomizedRunner$3.evaluate(RandomizedRunner.java:648)
[mvn] at com.carrotsearch.randomizedtesting.RandomizedRunner$4.evaluate(RandomizedRunner.java:682)
[mvn] at com.carrotsearch.randomizedtesting.RandomizedRunner$5.evaluate(RandomizedRunner.java:693)
[mvn] at com.carrotsearch.randomizedtesting.rules.StatementAdapter.evaluate(StatementAdapter.java:36)
[mvn] at com.carrotsearch.randomizedtesting.rules.SystemPropertiesRestoreRule$1.evaluate(SystemPropertiesRestoreRule.java:53)
[mvn] at org.apache.lucene.util.AbstractBeforeAfterRule$1.evaluate(AbstractBeforeAfterRule.java:45)
[mvn] at org.apache.lucene.util.TestRuleStoreClassName$1.evaluate(TestRuleStoreClassName.java:42)
[mvn] at com.carrotsearch.randomizedtesting.rules.SystemPropertiesInvariantRule$1.evaluate(SystemPropertiesInvariantRule.java:55)
[mvn] at com.carrotsearch.randomizedtesting.rules.NoShadowingOrOverridesOnMethodsRule$1.evaluate(NoShadowingOrOverridesOnMethodsRule.java:39)
[mvn] at com.carrotsearch.randomizedtesting.rules.NoShadowingOrOverridesOnMethodsRule$1.evaluate(NoShadowingOrOverridesOnMethodsRule.java:39)
[mvn] at com.carrotsearch.randomizedtesting.rules.StatementAdapter.evaluate(StatementAdapter.java:36)
[mvn] at org.apache.lucene.util.TestRuleAssertionsRequired$1.evaluate(TestRuleAssertionsRequired.java:43)
[mvn] at org.apache.lucene.util.TestRuleMarkFailure$1.evaluate(TestRuleMarkFailure.java:48)
[mvn] at org.apache.lucene.util.TestRuleIgnoreAfterMaxFailures$1.evaluate(TestRuleIgnoreAfterMaxFailures.java:70)
[mvn] at org.apache.lucene.util.TestRuleIgnoreTestSuites$1.evaluate(TestRuleIgnoreTestSuites.java:55)
[mvn] at com.carrotsearch.randomizedtesting.rules.StatementAdapter.evaluate(StatementAdapter.java:36)
[mvn] at com.carrotsearch.randomizedtesting.ThreadLeakControl$StatementRunner.run(ThreadLeakControl.java:358)
[mvn] at java.lang.Thread.run(Thread.java:679)
[mvn]
[mvn] 2959 T2275 C4 oasc.SolrException.log SEVERE org.apache.solr.common.SolrException: range facet infinite loop: gap is either zero, or too small relative start/end and caused underflow: 23 + 0 = 23
[mvn] at org.apache.solr.request.SimpleFacets.getFacetRangeCounts(SimpleFacets.java:1122)
[mvn] at org.apache.solr.request.SimpleFacets.getFacetRangeCounts(SimpleFacets.java:1074)
[mvn] at org.apache.solr.request.SimpleFacets.getFacetRangeCounts(SimpleFacets.java:1018)
[mvn] at org.apache.solr.request.SimpleFacets.getFacetCounts(SimpleFacets.java:208)
[mvn] at org.apache.solr.handler.component.FacetComponent.process(FacetComponent.java:87)
[mvn] at org.apache.solr.handler.component.SearchHandler.handleRequestBody(SearchHandler.java:206)
[mvn] at org.apache.solr.handler.RequestHandlerBase.handleRequest(RequestHandlerBase.java:129)
[mvn] at org.apache.solr.core.SolrCore.execute(SolrCore.java:1701)
[mvn] at org.apache.solr.util.TestHarness.query(TestHarness.java:364)
[mvn] at org.apache.solr.util.TestHarness.query(TestHarness.java:346)
[mvn] at org.apache.solr.SolrTestCaseJ4.assertQEx(SolrTestCaseJ4.java:611)
[mvn] at org.apache.solr.request.SimpleFacetsTest.testRangeFacetInfiniteLoopDetection(SimpleFacetsTest.java:2052)
[mvn] at sun.reflect.NativeMethodAccessorImpl.invoke0(Native Method)
[mvn] at sun.reflect.NativeMethodAccessorImpl.invoke(NativeMethodAccessorImpl.java:57)
[mvn] at sun.reflect.DelegatingMethodAccessorImpl.invoke(DelegatingMethodAccessorImpl.java:43)
[mvn] at java.lang.reflect.Method.invoke(Method.java:616)
[mvn] at com.carrotsearch.randomizedtesting.RandomizedRunner.invoke(RandomizedRunner.java:1559)
[mvn] at com.carrotsearch.randomizedtesting.RandomizedRunner.access$600(RandomizedRunner.java:79)
[mvn] at com.carrotsearch.randomizedtesting.RandomizedRunner$6.evaluate(RandomizedRunner.java:737)
[mvn] at com.carrotsearch.randomizedtesting.RandomizedRunner$7.evaluate(RandomizedRunner.java:773)
[mvn] at com.carrotsearch.randomizedtesting.RandomizedRunner$8.evaluate(RandomizedRunner.java:787)
[mvn] at com.carrotsearch.randomizedtesting.rules.SystemPropertiesRestoreRule$1.evaluate(SystemPropertiesRestoreRule.java:53)
[mvn] at org.apache.lucene.util.TestRuleSetupTeardownChained$1.evaluate(TestRuleSetupTeardownChained.java:50)
[mvn] at org.apache.lucene.util.TestRuleFieldCacheSanity$1.evaluate(TestRuleFieldCacheSanity.java:51)
[mvn] at org.apache.lucene.util.AbstractBeforeAfterRule$1.evaluate(AbstractBeforeAfterRule.java:45)
[mvn] at com.carrotsearch.randomizedtesting.rules.SystemPropertiesInvariantRule$1.evaluate(SystemPropertiesInvariantRule.java:55)
[mvn] at org.apache.lucene.util.TestRuleThreadAndTestName$1.evaluate(TestRuleThreadAndTestName.java:48)
[mvn] at org.apache.lucene.util.TestRuleIgnoreAfterMaxFailures$1.evaluate(TestRuleIgnoreAfterMaxFailures.java:70)
[mvn] at org.apache.lucene.util.TestRuleMarkFailure$1.evaluate(TestRuleMarkFailure.java:48)
[mvn] at com.carrotsearch.randomizedtesting.rules.StatementAdapter.evaluate(StatementAdapter.java:36)
[mvn] at com.carrotsearch.randomizedtesting.ThreadLeakControl$StatementRunner.run(ThreadLeakControl.java:358)
[mvn] at com.carrotsearch.randomizedtesting.ThreadLeakControl.forkTimeoutingTask(ThreadLeakControl.java:782)
[mvn] at com.carrotsearch.randomizedtesting.ThreadLeakControl$3.evaluate(ThreadLeakControl.java:442)
[mvn] at com.carrotsearch.randomizedtesting.RandomizedRunner.runSingleTest(RandomizedRunner.java:746)
[mvn] at com.carrotsearch.randomizedtesting.RandomizedRunner$3.evaluate(RandomizedRunner.java:648)
[mvn] at com.carrotsearch.randomizedtesting.RandomizedRunner$4.evaluate(RandomizedRunner.java:682)
[mvn] at com.carrotsearch.randomizedtesting.RandomizedRunner$5.evaluate(RandomizedRunner.java:693)
[mvn] at com.carrotsearch.randomizedtesting.rules.StatementAdapter.evaluate(StatementAdapter.java:36)
[mvn] at com.carrotsearch.randomizedtesting.rules.SystemPropertiesRestoreRule$1.evaluate(SystemPropertiesRestoreRule.java:53)
[mvn] at org.apache.lucene.util.AbstractBeforeAfterRule$1.evaluate(AbstractBeforeAfterRule.java:45)
[mvn] at org.apache.lucene.util.TestRuleStoreClassName$1.evaluate(TestRuleStoreClassName.java:42)
[mvn] at com.carrotsearch.randomizedtesting.rules.SystemPropertiesInvariantRule$1.evaluate(SystemPropertiesInvariantRule.java:55)
[mvn] at com.carrotsearch.randomizedtesting.rules.NoShadowingOrOverridesOnMethodsRule$1.evaluate(NoShadowingOrOverridesOnMethodsRule.java:39)
[mvn] at com.carrotsearch.randomizedtesting.rules.NoShadowingOrOverridesOnMethodsRule$1.evaluate(NoShadowingOrOverridesOnMethodsRule.java:39)
[mvn] at com.carrotsearch.randomizedtesting.rules.StatementAdapter.evaluate(StatementAdapter.java:36)
[mvn] at org.apache.lucene.util.TestRuleAssertionsRequired$1.evaluate(TestRuleAssertionsRequired.java:43)
[mvn] at org.apache.lucene.util.TestRuleMarkFailure$1.evaluate(TestRuleMarkFailure.java:48)
[mvn] at org.apache.lucene.util.TestRuleIgnoreAfterMaxFailures$1.evaluate(TestRuleIgnoreAfterMaxFailures.java:70)
[mvn] at org.apache.lucene.util.TestRuleIgnoreTestSuites$1.evaluate(TestRuleIgnoreTestSuites.java:55)
[mvn] at com.carrotsearch.randomizedtesting.rules.StatementAdapter.evaluate(StatementAdapter.java:36)
[mvn] at com.carrotsearch.randomizedtesting.ThreadLeakControl$StatementRunner.run(ThreadLeakControl.java:358)
[mvn] at java.lang.Thread.run(Thread.java:679)
[mvn]
[mvn] 2959 T2275 C4 oasc.SolrException.log SEVERE org.apache.solr.common.SolrException: date facet infinite loop: gap is effectively zero
[mvn] at org.apache.solr.request.SimpleFacets.getFacetDateCounts(SimpleFacets.java:928)
[mvn] at org.apache.solr.request.SimpleFacets.getFacetDateCounts(SimpleFacets.java:837)
[mvn] at org.apache.solr.request.SimpleFacets.getFacetCounts(SimpleFacets.java:207)
[mvn] at org.apache.solr.handler.component.FacetComponent.process(FacetComponent.java:87)
[mvn] at org.apache.solr.handler.component.SearchHandler.handleRequestBody(SearchHandler.java:206)
[mvn] at org.apache.solr.handler.RequestHandlerBase.handleRequest(RequestHandlerBase.java:129)
[mvn] at org.apache.solr.core.SolrCore.execute(SolrCore.java:1701)
[mvn] at org.apache.solr.util.TestHarness.query(TestHarness.java:364)
[mvn] at org.apache.solr.util.TestHarness.query(TestHarness.java:346)
[mvn] at org.apache.solr.SolrTestCaseJ4.assertQEx(SolrTestCaseJ4.java:611)
[mvn] at org.apache.solr.request.SimpleFacetsTest.testRangeFacetInfiniteLoopDetection(SimpleFacetsTest.java:2063)
[mvn] at sun.reflect.NativeMethodAccessorImpl.invoke0(Native Method)
[mvn] at sun.reflect.NativeMethodAccessorImpl.invoke(NativeMethodAccessorImpl.java:57)
[mvn] at sun.reflect.DelegatingMethodAccessorImpl.invoke(DelegatingMethodAccessorImpl.java:43)
[mvn] at java.lang.reflect.Method.invoke(Method.java:616)
[mvn] at com.carrotsearch.randomizedtesting.RandomizedRunner.invoke(RandomizedRunner.java:1559)
[mvn] at com.carrotsearch.randomizedtesting.RandomizedRunner.access$600(RandomizedRunner.java:79)
[mvn] at com.carrotsearch.randomizedtesting.RandomizedRunner$6.evaluate(RandomizedRunner.java:737)
[mvn] at com.carrotsearch.randomizedtesting.RandomizedRunner$7.evaluate(RandomizedRunner.java:773)
[mvn] at com.carrotsearch.randomizedtesting.RandomizedRunner$8.evaluate(RandomizedRunner.java:787)
[mvn] at com.carrotsearch.randomizedtesting.rules.SystemPropertiesRestoreRule$1.evaluate(SystemPropertiesRestoreRule.java:53)
[mvn] at org.apache.lucene.util.TestRuleSetupTeardownChained$1.evaluate(TestRuleSetupTeardownChained.java:50)
[mvn] at org.apache.lucene.util.TestRuleFieldCacheSanity$1.evaluate(TestRuleFieldCacheSanity.java:51)
[mvn] at org.apache.lucene.util.AbstractBeforeAfterRule$1.evaluate(AbstractBeforeAfterRule.java:45)
[mvn] at com.carrotsearch.randomizedtesting.rules.SystemPropertiesInvariantRule$1.evaluate(SystemPropertiesInvariantRule.java:55)
[mvn] at org.apache.lucene.util.TestRuleThreadAndTestName$1.evaluate(TestRuleThreadAndTestName.java:48)
[mvn] at org.apache.lucene.util.TestRuleIgnoreAfterMaxFailures$1.evaluate(TestRuleIgnoreAfterMaxFailures.java:70)
[mvn] at org.apache.lucene.util.TestRuleMarkFailure$1.evaluate(TestRuleMarkFailure.java:48)
[mvn] at com.carrotsearch.randomizedtesting.rules.StatementAdapter.evaluate(StatementAdapter.java:36)
[mvn] at com.carrotsearch.randomizedtesting.ThreadLeakControl$StatementRunner.run(ThreadLeakControl.java:358)
[mvn] at com.carrotsearch.randomizedtesting.ThreadLeakControl.forkTimeoutingTask(ThreadLeakControl.java:782)
[mvn] at com.carrotsearch.randomizedtesting.ThreadLeakControl$3.evaluate(ThreadLeakControl.java:442)
[mvn] at com.carrotsearch.randomizedtesting.RandomizedRunner.runSingleTest(RandomizedRunner.java:746)
[mvn] at com.carrotsearch.randomizedtesting.RandomizedRunner$3.evaluate(RandomizedRunner.java:648)
[mvn] at com.carrotsearch.randomizedtesting.RandomizedRunner$4.evaluate(RandomizedRunner.java:682)
[mvn] at com.carrotsearch.randomizedtesting.RandomizedRunner$5.evaluate(RandomizedRunner.java:693)
[mvn] at com.carrotsearch.randomizedtesting.rules.StatementAdapter.evaluate(StatementAdapter.java:36)
[mvn] at com.carrotsearch.randomizedtesting.rules.SystemPropertiesRestoreRule$1.evaluate(SystemPropertiesRestoreRule.java:53)
[mvn] at org.apache.lucene.util.AbstractBeforeAfterRule$1.evaluate(AbstractBeforeAfterRule.java:45)
[mvn] at org.apache.lucene.util.TestRuleStoreClassName$1.evaluate(TestRuleStoreClassName.java:42)
[mvn] at com.carrotsearch.randomizedtesting.rules.SystemPropertiesInvariantRule$1.evaluate(SystemPropertiesInvariantRule.java:55)
[mvn] at com.carrotsearch.randomizedtesting.rules.NoShadowingOrOverridesOnMethodsRule$1.evaluate(NoShadowingOrOverridesOnMethodsRule.java:39)
[mvn] at com.carrotsearch.randomizedtesting.rules.NoShadowingOrOverridesOnMethodsRule$1.evaluate(NoShadowingOrOverridesOnMethodsRule.java:39)
[mvn] at com.carrotsearch.randomizedtesting.rules.StatementAdapter.evaluate(StatementAdapter.java:36)
[mvn] at org.apache.lucene.util.TestRuleAssertionsRequired$1.evaluate(TestRuleAssertionsRequired.java:43)
[mvn] at org.apache.lucene.util.TestRuleMarkFailure$1.evaluate(TestRuleMarkFailure.java:48)
[mvn] at org.apache.lucene.util.TestRuleIgnoreAfterMaxFailures$1.evaluate(TestRuleIgnoreAfterMaxFailures.java:70)
[mvn] at org.apache.lucene.util.TestRuleIgnoreTestSuites$1.evaluate(TestRuleIgnoreTestSuites.java:55)
[mvn] at com.carrotsearch.randomizedtesting.rules.StatementAdapter.evaluate(StatementAdapter.java:36)
[mvn] at com.carrotsearch.randomizedtesting.ThreadLeakControl$StatementRunner.run(ThreadLeakControl.java:358)
[mvn] at java.lang.Thread.run(Thread.java:679)
[mvn]
[mvn] 2960 T2275 C4 oasc.SolrException.log SEVERE org.apache.solr.common.SolrException: range facet infinite loop: gap is either zero, or too small relative start/end and caused underflow: Mon Sep 17 07:56:48 BRT 2012 + +0DAYS = Mon Sep 17 07:56:48 BRT 2012
[mvn] at org.apache.solr.request.SimpleFacets.getFacetRangeCounts(SimpleFacets.java:1122)
[mvn] at org.apache.solr.request.SimpleFacets.getFacetRangeCounts(SimpleFacets.java:1074)
[mvn] at org.apache.solr.request.SimpleFacets.getFacetRangeCounts(SimpleFacets.java:1018)
[mvn] at org.apache.solr.request.SimpleFacets.getFacetCounts(SimpleFacets.java:208)
[mvn] at org.apache.solr.handler.component.FacetComponent.process(FacetComponent.java:87)
[mvn] at org.apache.solr.handler.component.SearchHandler.handleRequestBody(SearchHandler.java:206)
[mvn] at org.apache.solr.handler.RequestHandlerBase.handleRequest(RequestHandlerBase.java:129)
[mvn] at org.apache.solr.core.SolrCore.execute(SolrCore.java:1701)
[mvn] at org.apache.solr.util.TestHarness.query(TestHarness.java:364)
[mvn] at org.apache.solr.util.TestHarness.query(TestHarness.java:346)
[mvn] at org.apache.solr.SolrTestCaseJ4.assertQEx(SolrTestCaseJ4.java:611)
[mvn] at org.apache.solr.request.SimpleFacetsTest.testRangeFacetInfiniteLoopDetection(SimpleFacetsTest.java:2063)
[mvn] at sun.reflect.NativeMethodAccessorImpl.invoke0(Native Method)
[mvn] at sun.reflect.NativeMethodAccessorImpl.invoke(NativeMethodAccessorImpl.java:57)
[mvn] at sun.reflect.DelegatingMethodAccessorImpl.invoke(DelegatingMethodAccessorImpl.java:43)
[mvn] at java.lang.reflect.Method.invoke(Method.java:616)
[mvn] at com.carrotsearch.randomizedtesting.RandomizedRunner.invoke(RandomizedRunner.java:1559)
[mvn] at com.carrotsearch.randomizedtesting.RandomizedRunner.access$600(RandomizedRunner.java:79)
[mvn] at com.carrotsearch.randomizedtesting.RandomizedRunner$6.evaluate(RandomizedRunner.java:737)
[mvn] at com.carrotsearch.randomizedtesting.RandomizedRunner$7.evaluate(RandomizedRunner.java:773)
[mvn] at com.carrotsearch.randomizedtesting.RandomizedRunner$8.evaluate(RandomizedRunner.java:787)
[mvn] at com.carrotsearch.randomizedtesting.rules.SystemPropertiesRestoreRule$1.evaluate(SystemPropertiesRestoreRule.java:53)
[mvn] at org.apache.lucene.util.TestRuleSetupTeardownChained$1.evaluate(TestRuleSetupTeardownChained.java:50)
[mvn] at org.apache.lucene.util.TestRuleFieldCacheSanity$1.evaluate(TestRuleFieldCacheSanity.java:51)
[mvn] at org.apache.lucene.util.AbstractBeforeAfterRule$1.evaluate(AbstractBeforeAfterRule.java:45)
[mvn] at com.carrotsearch.randomizedtesting.rules.SystemPropertiesInvariantRule$1.evaluate(SystemPropertiesInvariantRule.java:55)
[mvn] at org.apache.lucene.util.TestRuleThreadAndTestName$1.evaluate(TestRuleThreadAndTestName.java:48)
[mvn] at org.apache.lucene.util.TestRuleIgnoreAfterMaxFailures$1.evaluate(TestRuleIgnoreAfterMaxFailures.java:70)
[mvn] at org.apache.lucene.util.TestRuleMarkFailure$1.evaluate(TestRuleMarkFailure.java:48)
[mvn] at com.carrotsearch.randomizedtesting.rules.StatementAdapter.evaluate(StatementAdapter.java:36)
[mvn] at com.carrotsearch.randomizedtesting.ThreadLeakControl$StatementRunner.run(ThreadLeakControl.java:358)
[mvn] at com.carrotsearch.randomizedtesting.ThreadLeakControl.forkTimeoutingTask(ThreadLeakControl.java:782)
[mvn] at com.carrotsearch.randomizedtesting.ThreadLeakControl$3.evaluate(ThreadLeakControl.java:442)
[mvn] at com.carrotsearch.randomizedtesting.RandomizedRunner.runSingleTest(RandomizedRunner.java:746)
[mvn] at com.carrotsearch.randomizedtesting.RandomizedRunner$3.evaluate(RandomizedRunner.java:648)
[mvn] at com.carrotsearch.randomizedtesting.RandomizedRunner$4.evaluate(RandomizedRunner.java:682)
[mvn] at com.carrotsearch.randomizedtesting.RandomizedRunner$5.evaluate(RandomizedRunner.java:693)
[mvn] at com.carrotsearch.randomizedtesting.rules.StatementAdapter.evaluate(StatementAdapter.java:36)
[mvn] at com.carrotsearch.randomizedtesting.rules.SystemPropertiesRestoreRule$1.evaluate(SystemPropertiesRestoreRule.java:53)
[mvn] at org.apache.lucene.util.AbstractBeforeAfterRule$1.evaluate(AbstractBeforeAfterRule.java:45)
[mvn] at org.apache.lucene.util.TestRuleStoreClassName$1.evaluate(TestRuleStoreClassName.java:42)
[mvn] at com.carrotsearch.randomizedtesting.rules.SystemPropertiesInvariantRule$1.evaluate(SystemPropertiesInvariantRule.java:55)
[mvn] at com.carrotsearch.randomizedtesting.rules.NoShadowingOrOverridesOnMethodsRule$1.evaluate(NoShadowingOrOverridesOnMethodsRule.java:39)
[mvn] at com.carrotsearch.randomizedtesting.rules.NoShadowingOrOverridesOnMethodsRule$1.evaluate(NoShadowingOrOverridesOnMethodsRule.java:39)
[mvn] at com.carrotsearch.randomizedtesting.rules.StatementAdapter.evaluate(StatementAdapter.java:36)
[mvn] at org.apache.lucene.util.TestRuleAssertionsRequired$1.evaluate(TestRuleAssertionsRequired.java:43)
[mvn] at org.apache.lucene.util.TestRuleMarkFailure$1.evaluate(TestRuleMarkFailure.java:48)
[mvn] at org.apache.lucene.util.TestRuleIgnoreAfterMaxFailures$1.evaluate(TestRuleIgnoreAfterMaxFailures.java:70)
[mvn] at org.apache.lucene.util.TestRuleIgnoreTestSuites$1.evaluate(TestRuleIgnoreTestSuites.java:55)
[mvn] at com.carrotsearch.randomizedtesting.rules.StatementAdapter.evaluate(StatementAdapter.java:36)
[mvn] at com.carrotsearch.randomizedtesting.ThreadLeakControl$StatementRunner.run(ThreadLeakControl.java:358)
[mvn] at java.lang.Thread.run(Thread.java:679)
[mvn]
[mvn] 2961 T2275 C4 oasc.SolrException.log SEVERE org.apache.solr.common.SolrException: date facet infinite loop: gap is effectively zero
[mvn] at org.apache.solr.request.SimpleFacets.getFacetDateCounts(SimpleFacets.java:928)
[mvn] at org.apache.solr.request.SimpleFacets.getFacetDateCounts(SimpleFacets.java:837)
[mvn] at org.apache.solr.request.SimpleFacets.getFacetCounts(SimpleFacets.java:207)
[mvn] at org.apache.solr.handler.component.FacetComponent.process(FacetComponent.java:87)
[mvn] at org.apache.solr.handler.component.SearchHandler.handleRequestBody(SearchHandler.java:206)
[mvn] at org.apache.solr.handler.RequestHandlerBase.handleRequest(RequestHandlerBase.java:129)
[mvn] at org.apache.solr.core.SolrCore.execute(SolrCore.java:1701)
[mvn] at org.apache.solr.util.TestHarness.query(TestHarness.java:364)
[mvn] at org.apache.solr.util.TestHarness.query(TestHarness.java:346)
[mvn] at org.apache.solr.SolrTestCaseJ4.assertQEx(SolrTestCaseJ4.java:611)
[mvn] at org.apache.solr.request.SimpleFacetsTest.testRangeFacetInfiniteLoopDetection(SimpleFacetsTest.java:2063)
[mvn] at sun.reflect.NativeMethodAccessorImpl.invoke0(Native Method)
[mvn] at sun.reflect.NativeMethodAccessorImpl.invoke(NativeMethodAccessorImpl.java:57)
[mvn] at sun.reflect.DelegatingMethodAccessorImpl.invoke(DelegatingMethodAccessorImpl.java:43)
[mvn] at java.lang.reflect.Method.invoke(Method.java:616)
[mvn] at com.carrotsearch.randomizedtesting.RandomizedRunner.invoke(RandomizedRunner.java:1559)
[mvn] at com.carrotsearch.randomizedtesting.RandomizedRunner.access$600(RandomizedRunner.java:79)
[mvn] at com.carrotsearch.randomizedtesting.RandomizedRunner$6.evaluate(RandomizedRunner.java:737)
[mvn] at com.carrotsearch.randomizedtesting.RandomizedRunner$7.evaluate(RandomizedRunner.java:773)
[mvn] at com.carrotsearch.randomizedtesting.RandomizedRunner$8.evaluate(RandomizedRunner.java:787)
[mvn] at com.carrotsearch.randomizedtesting.rules.SystemPropertiesRestoreRule$1.evaluate(SystemPropertiesRestoreRule.java:53)
[mvn] at org.apache.lucene.util.TestRuleSetupTeardownChained$1.evaluate(TestRuleSetupTeardownChained.java:50)
[mvn] at org.apache.lucene.util.TestRuleFieldCacheSanity$1.evaluate(TestRuleFieldCacheSanity.java:51)
[mvn] at org.apache.lucene.util.AbstractBeforeAfterRule$1.evaluate(AbstractBeforeAfterRule.java:45)
[mvn] at com.carrotsearch.randomizedtesting.rules.SystemPropertiesInvariantRule$1.evaluate(SystemPropertiesInvariantRule.java:55)
[mvn] at org.apache.lucene.util.TestRuleThreadAndTestName$1.evaluate(TestRuleThreadAndTestName.java:48)
[mvn] at org.apache.lucene.util.TestRuleIgnoreAfterMaxFailures$1.evaluate(TestRuleIgnoreAfterMaxFailures.java:70)
[mvn] at org.apache.lucene.util.TestRuleMarkFailure$1.evaluate(TestRuleMarkFailure.java:48)
[mvn] at com.carrotsearch.randomizedtesting.rules.StatementAdapter.evaluate(StatementAdapter.java:36)
[mvn] at com.carrotsearch.randomizedtesting.ThreadLeakControl$StatementRunner.run(ThreadLeakControl.java:358)
[mvn] at com.carrotsearch.randomizedtesting.ThreadLeakControl.forkTimeoutingTask(ThreadLeakControl.java:782)
[mvn] at com.carrotsearch.randomizedtesting.ThreadLeakControl$3.evaluate(ThreadLeakControl.java:442)
[mvn] at com.carrotsearch.randomizedtesting.RandomizedRunner.runSingleTest(RandomizedRunner.java:746)
[mvn] at com.carrotsearch.randomizedtesting.RandomizedRunner$3.evaluate(RandomizedRunner.java:648)
[mvn] at com.carrotsearch.randomizedtesting.RandomizedRunner$4.evaluate(RandomizedRunner.java:682)
[mvn] at com.carrotsearch.randomizedtesting.RandomizedRunner$5.evaluate(RandomizedRunner.java:693)
[mvn] at com.carrotsearch.randomizedtesting.rules.StatementAdapter.evaluate(StatementAdapter.java:36)
[mvn] at com.carrotsearch.randomizedtesting.rules.SystemPropertiesRestoreRule$1.evaluate(SystemPropertiesRestoreRule.java:53)
[mvn] at org.apache.lucene.util.AbstractBeforeAfterRule$1.evaluate(AbstractBeforeAfterRule.java:45)
[mvn] at org.apache.lucene.util.TestRuleStoreClassName$1.evaluate(TestRuleStoreClassName.java:42)
[mvn] at com.carrotsearch.randomizedtesting.rules.SystemPropertiesInvariantRule$1.evaluate(SystemPropertiesInvariantRule.java:55)
[mvn] at com.carrotsearch.randomizedtesting.rules.NoShadowingOrOverridesOnMethodsRule$1.evaluate(NoShadowingOrOverridesOnMethodsRule.java:39)
[mvn] at com.carrotsearch.randomizedtesting.rules.NoShadowingOrOverridesOnMethodsRule$1.evaluate(NoShadowingOrOverridesOnMethodsRule.java:39)
[mvn] at com.carrotsearch.randomizedtesting.rules.StatementAdapter.evaluate(StatementAdapter.java:36)
[mvn] at org.apache.lucene.util.TestRuleAssertionsRequired$1.evaluate(TestRuleAssertionsRequired.java:43)
[mvn] at org.apache.lucene.util.TestRuleMarkFailure$1.evaluate(TestRuleMarkFailure.java:48)
[mvn] at org.apache.lucene.util.TestRuleIgnoreAfterMaxFailures$1.evaluate(TestRuleIgnoreAfterMaxFailures.java:70)
[mvn] at org.apache.lucene.util.TestRuleIgnoreTestSuites$1.evaluate(TestRuleIgnoreTestSuites.java:55)
[mvn] at com.carrotsearch.randomizedtesting.rules.StatementAdapter.evaluate(StatementAdapter.java:36)
[mvn] at com.carrotsearch.randomizedtesting.ThreadLeakControl$StatementRunner.run(ThreadLeakControl.java:358)
[mvn] at java.lang.Thread.run(Thread.java:679)
[mvn]
[mvn] 2962 T2275 C4 oasc.SolrException.log SEVERE org.apache.solr.common.SolrException: range facet infinite loop: gap is either zero, or too small relative start/end and caused underflow: Mon Sep 17 07:56:48 BRT 2012 + +0DAYS = Mon Sep 17 07:56:48 BRT 2012
[mvn] at org.apache.solr.request.SimpleFacets.getFacetRangeCounts(SimpleFacets.java:1122)
[mvn] at org.apache.solr.request.SimpleFacets.getFacetRangeCounts(SimpleFacets.java:1074)
[mvn] at org.apache.solr.request.SimpleFacets.getFacetRangeCounts(SimpleFacets.java:1018)
[mvn] at org.apache.solr.request.SimpleFacets.getFacetCounts(SimpleFacets.java:208)
[mvn] at org.apache.solr.handler.component.FacetComponent.process(FacetComponent.java:87)
[mvn] at org.apache.solr.handler.component.SearchHandler.handleRequestBody(SearchHandler.java:206)
[mvn] at org.apache.solr.handler.RequestHandlerBase.handleRequest(RequestHandlerBase.java:129)
[mvn] at org.apache.solr.core.SolrCore.execute(SolrCore.java:1701)
[mvn] at org.apache.solr.util.TestHarness.query(TestHarness.java:364)
[mvn] at org.apache.solr.util.TestHarness.query(TestHarness.java:346)
[mvn] at org.apache.solr.SolrTestCaseJ4.assertQEx(SolrTestCaseJ4.java:611)
[mvn] at org.apache.solr.request.SimpleFacetsTest.testRangeFacetInfiniteLoopDetection(SimpleFacetsTest.java:2063)
[mvn] at sun.reflect.NativeMethodAccessorImpl.invoke0(Native Method)
[mvn] at sun.reflect.NativeMethodAccessorImpl.invoke(NativeMethodAccessorImpl.java:57)
[mvn] at sun.reflect.DelegatingMethodAccessorImpl.invoke(DelegatingMethodAccessorImpl.java:43)
[mvn] at java.lang.reflect.Method.invoke(Method.java:616)
[mvn] at com.carrotsearch.randomizedtesting.RandomizedRunner.invoke(RandomizedRunner.java:1559)
[mvn] at com.carrotsearch.randomizedtesting.RandomizedRunner.access$600(RandomizedRunner.java:79)
[mvn] at com.carrotsearch.randomizedtesting.RandomizedRunner$6.evaluate(RandomizedRunner.java:737)
[mvn] at com.carrotsearch.randomizedtesting.RandomizedRunner$7.evaluate(RandomizedRunner.java:773)
[mvn] at com.carrotsearch.randomizedtesting.RandomizedRunner$8.evaluate(RandomizedRunner.java:787)
[mvn] at com.carrotsearch.randomizedtesting.rules.SystemPropertiesRestoreRule$1.evaluate(SystemPropertiesRestoreRule.java:53)
[mvn] at org.apache.lucene.util.TestRuleSetupTeardownChained$1.evaluate(TestRuleSetupTeardownChained.java:50)
[mvn] at org.apache.lucene.util.TestRuleFieldCacheSanity$1.evaluate(TestRuleFieldCacheSanity.java:51)
[mvn] at org.apache.lucene.util.AbstractBeforeAfterRule$1.evaluate(AbstractBeforeAfterRule.java:45)
[mvn] at com.carrotsearch.randomizedtesting.rules.SystemPropertiesInvariantRule$1.evaluate(SystemPropertiesInvariantRule.java:55)
[mvn] at org.apache.lucene.util.TestRuleThreadAndTestName$1.evaluate(TestRuleThreadAndTestName.java:48)
[mvn] at org.apache.lucene.util.TestRuleIgnoreAfterMaxFailures$1.evaluate(TestRuleIgnoreAfterMaxFailures.java:70)
[mvn] at org.apache.lucene.util.TestRuleMarkFailure$1.evaluate(TestRuleMarkFailure.java:48)
[mvn] at com.carrotsearch.randomizedtesting.rules.StatementAdapter.evaluate(StatementAdapter.java:36)
[mvn] at com.carrotsearch.randomizedtesting.ThreadLeakControl$StatementRunner.run(ThreadLeakControl.java:358)
[mvn] at com.carrotsearch.randomizedtesting.ThreadLeakControl.forkTimeoutingTask(ThreadLeakControl.java:782)
[mvn] at com.carrotsearch.randomizedtesting.ThreadLeakControl$3.evaluate(ThreadLeakControl.java:442)
[mvn] at com.carrotsearch.randomizedtesting.RandomizedRunner.runSingleTest(RandomizedRunner.java:746)
[mvn] at com.carrotsearch.randomizedtesting.RandomizedRunner$3.evaluate(RandomizedRunner.java:648)
[mvn] at com.carrotsearch.randomizedtesting.RandomizedRunner$4.evaluate(RandomizedRunner.java:682)
[mvn] at com.carrotsearch.randomizedtesting.RandomizedRunner$5.evaluate(RandomizedRunner.java:693)
[mvn] at com.carrotsearch.randomizedtesting.rules.StatementAdapter.evaluate(StatementAdapter.java:36)
[mvn] at com.carrotsearch.randomizedtesting.rules.SystemPropertiesRestoreRule$1.evaluate(SystemPropertiesRestoreRule.java:53)
[mvn] at org.apache.lucene.util.AbstractBeforeAfterRule$1.evaluate(AbstractBeforeAfterRule.java:45)
[mvn] at org.apache.lucene.util.TestRuleStoreClassName$1.evaluate(TestRuleStoreClassName.java:42)
[mvn] at com.carrotsearch.randomizedtesting.rules.SystemPropertiesInvariantRule$1.evaluate(SystemPropertiesInvariantRule.java:55)
[mvn] at com.carrotsearch.randomizedtesting.rules.NoShadowingOrOverridesOnMethodsRule$1.evaluate(NoShadowingOrOverridesOnMethodsRule.java:39)
[mvn] at com.carrotsearch.randomizedtesting.rules.NoShadowingOrOverridesOnMethodsRule$1.evaluate(NoShadowingOrOverridesOnMethodsRule.java:39)
[mvn] at com.carrotsearch.randomizedtesting.rules.StatementAdapter.evaluate(StatementAdapter.java:36)
[mvn] at org.apache.lucene.util.TestRuleAssertionsRequired$1.evaluate(TestRuleAssertionsRequired.java:43)
[mvn] at org.apache.lucene.util.TestRuleMarkFailure$1.evaluate(TestRuleMarkFailure.java:48)
[mvn] at org.apache.lucene.util.TestRuleIgnoreAfterMaxFailures$1.evaluate(TestRuleIgnoreAfterMaxFailures.java:70)
[mvn] at org.apache.lucene.util.TestRuleIgnoreTestSuites$1.evaluate(TestRuleIgnoreTestSuites.java:55)
[mvn] at com.carrotsearch.randomizedtesting.rules.StatementAdapter.evaluate(StatementAdapter.java:36)
[mvn] at com.carrotsearch.randomizedtesting.ThreadLeakControl$StatementRunner.run(ThreadLeakControl.java:358)
[mvn] at java.lang.Thread.run(Thread.java:679)
[mvn]
[mvn] 2962 T2275 C4 oasc.SolrException.log SEVERE org.apache.solr.common.SolrException: range facet infinite loop: gap is either zero, or too small relative start/end and caused underflow: 9.9999998E10 + 2160 = 9.9999998E10
[mvn] at org.apache.solr.request.SimpleFacets.getFacetRangeCounts(SimpleFacets.java:1122)
[mvn] at org.apache.solr.request.SimpleFacets.getFacetRangeCounts(SimpleFacets.java:1074)
[mvn] at org.apache.solr.request.SimpleFacets.getFacetRangeCounts(SimpleFacets.java:1018)
[mvn] at org.apache.solr.request.SimpleFacets.getFacetCounts(SimpleFacets.java:208)
[mvn] at org.apache.solr.handler.component.FacetComponent.process(FacetComponent.java:87)
[mvn] at org.apache.solr.handler.component.SearchHandler.handleRequestBody(SearchHandler.java:206)
[mvn] at org.apache.solr.handler.RequestHandlerBase.handleRequest(RequestHandlerBase.java:129)
[mvn] at org.apache.solr.core.SolrCore.execute(SolrCore.java:1701)
[mvn] at org.apache.solr.util.TestHarness.query(TestHarness.java:364)
[mvn] at org.apache.solr.util.TestHarness.query(TestHarness.java:346)
[mvn] at org.apache.solr.SolrTestCaseJ4.assertQEx(SolrTestCaseJ4.java:611)
[mvn] at org.apache.solr.request.SimpleFacetsTest.testRangeFacetInfiniteLoopDetection(SimpleFacetsTest.java:2075)
[mvn] at sun.reflect.NativeMethodAccessorImpl.invoke0(Native Method)
[mvn] at sun.reflect.NativeMethodAccessorImpl.invoke(NativeMethodAccessorImpl.java:57)
[mvn] at sun.reflect.DelegatingMethodAccessorImpl.invoke(DelegatingMethodAccessorImpl.java:43)
[mvn] at java.lang.reflect.Method.invoke(Method.java:616)
[mvn] at com.carrotsearch.randomizedtesting.RandomizedRunner.invoke(RandomizedRunner.java:1559)
[mvn] at com.carrotsearch.randomizedtesting.RandomizedRunner.access$600(RandomizedRunner.java:79)
[mvn] at com.carrotsearch.randomizedtesting.RandomizedRunner$6.evaluate(RandomizedRunner.java:737)
[mvn] at com.carrotsearch.randomizedtesting.RandomizedRunner$7.evaluate(RandomizedRunner.java:773)
[mvn] at com.carrotsearch.randomizedtesting.RandomizedRunner$8.evaluate(RandomizedRunner.java:787)
[mvn] at com.carrotsearch.randomizedtesting.rules.SystemPropertiesRestoreRule$1.evaluate(SystemPropertiesRestoreRule.java:53)
[mvn] at org.apache.lucene.util.TestRuleSetupTeardownChained$1.evaluate(TestRuleSetupTeardownChained.java:50)
[mvn] at org.apache.lucene.util.TestRuleFieldCacheSanity$1.evaluate(TestRuleFieldCacheSanity.java:51)
[mvn] at org.apache.lucene.util.AbstractBeforeAfterRule$1.evaluate(AbstractBeforeAfterRule.java:45)
[mvn] at com.carrotsearch.randomizedtesting.rules.SystemPropertiesInvariantRule$1.evaluate(SystemPropertiesInvariantRule.java:55)
[mvn] at org.apache.lucene.util.TestRuleThreadAndTestName$1.evaluate(TestRuleThreadAndTestName.java:48)
[mvn] at org.apache.lucene.util.TestRuleIgnoreAfterMaxFailures$1.evaluate(TestRuleIgnoreAfterMaxFailures.java:70)
[mvn] at org.apache.lucene.util.TestRuleMarkFailure$1.evaluate(TestRuleMarkFailure.java:48)
[mvn] at com.carrotsearch.randomizedtesting.rules.StatementAdapter.evaluate(StatementAdapter.java:36)
[mvn] at com.carrotsearch.randomizedtesting.ThreadLeakControl$StatementRunner.run(ThreadLeakControl.java:358)
[mvn] at com.carrotsearch.randomizedtesting.ThreadLeakControl.forkTimeoutingTask(ThreadLeakControl.java:782)
[mvn] at com.carrotsearch.randomizedtesting.ThreadLeakControl$3.evaluate(ThreadLeakControl.java:442)
[mvn] at com.carrotsearch.randomizedtesting.RandomizedRunner.runSingleTest(RandomizedRunner.java:746)
[mvn] at com.carrotsearch.randomizedtesting.RandomizedRunner$3.evaluate(RandomizedRunner.java:648)
[mvn] at com.carrotsearch.randomizedtesting.RandomizedRunner$4.evaluate(RandomizedRunner.java:682)
[mvn] at com.carrotsearch.randomizedtesting.RandomizedRunner$5.evaluate(RandomizedRunner.java:693)
[mvn] at com.carrotsearch.randomizedtesting.rules.StatementAdapter.evaluate(StatementAdapter.java:36)
[mvn] at com.carrotsearch.randomizedtesting.rules.SystemPropertiesRestoreRule$1.evaluate(SystemPropertiesRestoreRule.java:53)
[mvn] at org.apache.lucene.util.AbstractBeforeAfterRule$1.evaluate(AbstractBeforeAfterRule.java:45)
[mvn] at org.apache.lucene.util.TestRuleStoreClassName$1.evaluate(TestRuleStoreClassName.java:42)
[mvn] at com.carrotsearch.randomizedtesting.rules.SystemPropertiesInvariantRule$1.evaluate(SystemPropertiesInvariantRule.java:55)
[mvn] at com.carrotsearch.randomizedtesting.rules.NoShadowingOrOverridesOnMethodsRule$1.evaluate(NoShadowingOrOverridesOnMethodsRule.java:39)
[mvn] at com.carrotsearch.randomizedtesting.rules.NoShadowingOrOverridesOnMethodsRule$1.evaluate(NoShadowingOrOverridesOnMethodsRule.java:39)
[mvn] at com.carrotsearch.randomizedtesting.rules.StatementAdapter.evaluate(StatementAdapter.java:36)
[mvn] at org.apache.lucene.util.TestRuleAssertionsRequired$1.evaluate(TestRuleAssertionsRequired.java:43)
[mvn] at org.apache.lucene.util.TestRuleMarkFailure$1.evaluate(TestRuleMarkFailure.java:48)
[mvn] at org.apache.lucene.util.TestRuleIgnoreAfterMaxFailures$1.evaluate(TestRuleIgnoreAfterMaxFailures.java:70)
[mvn] at org.apache.lucene.util.TestRuleIgnoreTestSuites$1.evaluate(TestRuleIgnoreTestSuites.java:55)
[mvn] at com.carrotsearch.randomizedtesting.rules.StatementAdapter.evaluate(StatementAdapter.java:36)
[mvn] at com.carrotsearch.randomizedtesting.ThreadLeakControl$StatementRunner.run(ThreadLeakControl.java:358)
[mvn] at java.lang.Thread.run(Thread.java:679)
[mvn]
[mvn] 2963 T2275 C4 oasc.SolrException.log SEVERE org.apache.solr.common.SolrException: range facet infinite loop: gap is either zero, or too small relative start/end and caused underflow: 9.9999998E10 + 2160 = 9.9999998E10
[mvn] at org.apache.solr.request.SimpleFacets.getFacetRangeCounts(SimpleFacets.java:1122)
[mvn] at org.apache.solr.request.SimpleFacets.getFacetRangeCounts(SimpleFacets.java:1074)
[mvn] at org.apache.solr.request.SimpleFacets.getFacetRangeCounts(SimpleFacets.java:1018)
[mvn] at org.apache.solr.request.SimpleFacets.getFacetCounts(SimpleFacets.java:208)
[mvn] at org.apache.solr.handler.component.FacetComponent.process(FacetComponent.java:87)
[mvn] at org.apache.solr.handler.component.SearchHandler.handleRequestBody(SearchHandler.java:206)
[mvn] at org.apache.solr.handler.RequestHandlerBase.handleRequest(RequestHandlerBase.java:129)
[mvn] at org.apache.solr.core.SolrCore.execute(SolrCore.java:1701)
[mvn] at org.apache.solr.util.TestHarness.query(TestHarness.java:364)
[mvn] at org.apache.solr.util.TestHarness.query(TestHarness.java:346)
[mvn] at org.apache.solr.SolrTestCaseJ4.assertQEx(SolrTestCaseJ4.java:611)
[mvn] at org.apache.solr.request.SimpleFacetsTest.testRangeFacetInfiniteLoopDetection(SimpleFacetsTest.java:2075)
[mvn] at sun.reflect.NativeMethodAccessorImpl.invoke0(Native Method)
[mvn] at sun.reflect.NativeMethodAccessorImpl.invoke(NativeMethodAccessorImpl.java:57)
[mvn] at sun.reflect.DelegatingMethodAccessorImpl.invoke(DelegatingMethodAccessorImpl.java:43)
[mvn] at java.lang.reflect.Method.invoke(Method.java:616)
[mvn] at com.carrotsearch.randomizedtesting.RandomizedRunner.invoke(RandomizedRunner.java:1559)
[mvn] at com.carrotsearch.randomizedtesting.RandomizedRunner.access$600(RandomizedRunner.java:79)
[mvn] at com.carrotsearch.randomizedtesting.RandomizedRunner$6.evaluate(RandomizedRunner.java:737)
[mvn] at com.carrotsearch.randomizedtesting.RandomizedRunner$7.evaluate(RandomizedRunner.java:773)
[mvn] at com.carrotsearch.randomizedtesting.RandomizedRunner$8.evaluate(RandomizedRunner.java:787)
[mvn] at com.carrotsearch.randomizedtesting.rules.SystemPropertiesRestoreRule$1.evaluate(SystemPropertiesRestoreRule.java:53)
[mvn] at org.apache.lucene.util.TestRuleSetupTeardownChained$1.evaluate(TestRuleSetupTeardownChained.java:50)
[mvn] at org.apache.lucene.util.TestRuleFieldCacheSanity$1.evaluate(TestRuleFieldCacheSanity.java:51)
[mvn] at org.apache.lucene.util.AbstractBeforeAfterRule$1.evaluate(AbstractBeforeAfterRule.java:45)
[mvn] at com.carrotsearch.randomizedtesting.rules.SystemPropertiesInvariantRule$1.evaluate(SystemPropertiesInvariantRule.java:55)
[mvn] at org.apache.lucene.util.TestRuleThreadAndTestName$1.evaluate(TestRuleThreadAndTestName.java:48)
[mvn] at org.apache.lucene.util.TestRuleIgnoreAfterMaxFailures$1.evaluate(TestRuleIgnoreAfterMaxFailures.java:70)
[mvn] at org.apache.lucene.util.TestRuleMarkFailure$1.evaluate(TestRuleMarkFailure.java:48)
[mvn] at com.carrotsearch.randomizedtesting.rules.StatementAdapter.evaluate(StatementAdapter.java:36)
[mvn] at com.carrotsearch.randomizedtesting.ThreadLeakControl$StatementRunner.run(ThreadLeakControl.java:358)
[mvn] at com.carrotsearch.randomizedtesting.ThreadLeakControl.forkTimeoutingTask(ThreadLeakControl.java:782)
[mvn] at com.carrotsearch.randomizedtesting.ThreadLeakControl$3.evaluate(ThreadLeakControl.java:442)
[mvn] at com.carrotsearch.randomizedtesting.RandomizedRunner.runSingleTest(RandomizedRunner.java:746)
[mvn] at com.carrotsearch.randomizedtesting.RandomizedRunner$3.evaluate(RandomizedRunner.java:648)
[mvn] at com.carrotsearch.randomizedtesting.RandomizedRunner$4.evaluate(RandomizedRunner.java:682)
[mvn] at com.carrotsearch.randomizedtesting.RandomizedRunner$5.evaluate(RandomizedRunner.java:693)
[mvn] at com.carrotsearch.randomizedtesting.rules.StatementAdapter.evaluate(StatementAdapter.java:36)
[mvn] at com.carrotsearch.randomizedtesting.rules.SystemPropertiesRestoreRule$1.evaluate(SystemPropertiesRestoreRule.java:53)
[mvn] at org.apache.lucene.util.AbstractBeforeAfterRule$1.evaluate(AbstractBeforeAfterRule.java:45)
[mvn] at org.apache.lucene.util.TestRuleStoreClassName$1.evaluate(TestRuleStoreClassName.java:42)
[mvn] at com.carrotsearch.randomizedtesting.rules.SystemPropertiesInvariantRule$1.evaluate(SystemPropertiesInvariantRule.java:55)
[mvn] at com.carrotsearch.randomizedtesting.rules.NoShadowingOrOverridesOnMethodsRule$1.evaluate(NoShadowingOrOverridesOnMethodsRule.java:39)
[mvn] at com.carrotsearch.randomizedtesting.rules.NoShadowingOrOverridesOnMethodsRule$1.evaluate(NoShadowingOrOverridesOnMethodsRule.java:39)
[mvn] at com.carrotsearch.randomizedtesting.rules.StatementAdapter.evaluate(StatementAdapter.java:36)
[mvn] at org.apache.lucene.util.TestRuleAssertionsRequired$1.evaluate(TestRuleAssertionsRequired.java:43)
[mvn] at org.apache.lucene.util.TestRuleMarkFailure$1.evaluate(TestRuleMarkFailure.java:48)
[mvn] at org.apache.lucene.util.TestRuleIgnoreAfterMaxFailures$1.evaluate(TestRuleIgnoreAfterMaxFailures.java:70)
[mvn] at org.apache.lucene.util.TestRuleIgnoreTestSuites$1.evaluate(TestRuleIgnoreTestSuites.java:55)
[mvn] at com.carrotsearch.randomizedtesting.rules.StatementAdapter.evaluate(StatementAdapter.java:36)
[mvn] at com.carrotsearch.randomizedtesting.ThreadLeakControl$StatementRunner.run(ThreadLeakControl.java:358)
[mvn] at java.lang.Thread.run(Thread.java:679)
[mvn]
[mvn] 2964 T2275 C4 oasc.SolrException.log SEVERE org.apache.solr.common.SolrException: range facet infinite loop: gap is either zero, or too small relative start/end and caused underflow: 9.9E12 + 0.0003 = 9.9E12
[mvn] at org.apache.solr.request.SimpleFacets.getFacetRangeCounts(SimpleFacets.java:1122)
[mvn] at org.apache.solr.request.SimpleFacets.getFacetRangeCounts(SimpleFacets.java:1074)
[mvn] at org.apache.solr.request.SimpleFacets.getFacetRangeCounts(SimpleFacets.java:1018)
[mvn] at org.apache.solr.request.SimpleFacets.getFacetCounts(SimpleFacets.java:208)
[mvn] at org.apache.solr.handler.component.FacetComponent.process(FacetComponent.java:87)
[mvn] at org.apache.solr.handler.component.SearchHandler.handleRequestBody(SearchHandler.java:206)
[mvn] at org.apache.solr.handler.RequestHandlerBase.handleRequest(RequestHandlerBase.java:129)
[mvn] at org.apache.solr.core.SolrCore.execute(SolrCore.java:1701)
[mvn] at org.apache.solr.util.TestHarness.query(TestHarness.java:364)
[mvn] at org.apache.solr.util.TestHarness.query(TestHarness.java:346)
[mvn] at org.apache.solr.SolrTestCaseJ4.assertQEx(SolrTestCaseJ4.java:611)
[mvn] at org.apache.solr.request.SimpleFacetsTest.testRangeFacetInfiniteLoopDetection(SimpleFacetsTest.java:2086)
[mvn] at sun.reflect.NativeMethodAccessorImpl.invoke0(Native Method)
[mvn] at sun.reflect.NativeMethodAccessorImpl.invoke(NativeMethodAccessorImpl.java:57)
[mvn] at sun.reflect.DelegatingMethodAccessorImpl.invoke(DelegatingMethodAccessorImpl.java:43)
[mvn] at java.lang.reflect.Method.invoke(Method.java:616)
[mvn] at com.carrotsearch.randomizedtesting.RandomizedRunner.invoke(RandomizedRunner.java:1559)
[mvn] at com.carrotsearch.randomizedtesting.RandomizedRunner.access$600(RandomizedRunner.java:79)
[mvn] at com.carrotsearch.randomizedtesting.RandomizedRunner$6.evaluate(RandomizedRunner.java:737)
[mvn] at com.carrotsearch.randomizedtesting.RandomizedRunner$7.evaluate(RandomizedRunner.java:773)
[mvn] at com.carrotsearch.randomizedtesting.RandomizedRunner$8.evaluate(RandomizedRunner.java:787)
[mvn] at com.carrotsearch.randomizedtesting.rules.SystemPropertiesRestoreRule$1.evaluate(SystemPropertiesRestoreRule.java:53)
[mvn] at org.apache.lucene.util.TestRuleSetupTeardownChained$1.evaluate(TestRuleSetupTeardownChained.java:50)
[mvn] at org.apache.lucene.util.TestRuleFieldCacheSanity$1.evaluate(TestRuleFieldCacheSanity.java:51)
[mvn] at org.apache.lucene.util.AbstractBeforeAfterRule$1.evaluate(AbstractBeforeAfterRule.java:45)
[mvn] at com.carrotsearch.randomizedtesting.rules.SystemPropertiesInvariantRule$1.evaluate(SystemPropertiesInvariantRule.java:55)
[mvn] at org.apache.lucene.util.TestRuleThreadAndTestName$1.evaluate(TestRuleThreadAndTestName.java:48)
[mvn] at org.apache.lucene.util.TestRuleIgnoreAfterMaxFailures$1.evaluate(TestRuleIgnoreAfterMaxFailures.java:70)
[mvn] at org.apache.lucene.util.TestRuleMarkFailure$1.evaluate(TestRuleMarkFailure.java:48)
[mvn] at com.carrotsearch.randomizedtesting.rules.StatementAdapter.evaluate(StatementAdapter.java:36)
[mvn] at com.carrotsearch.randomizedtesting.ThreadLeakControl$StatementRunner.run(ThreadLeakControl.java:358)
[mvn] at com.carrotsearch.randomizedtesting.ThreadLeakControl.forkTimeoutingTask(ThreadLeakControl.java:782)
[mvn] at com.carrotsearch.randomizedtesting.ThreadLeakControl$3.evaluate(ThreadLeakControl.java:442)
[mvn] at com.carrotsearch.randomizedtesting.RandomizedRunner.runSingleTest(RandomizedRunner.java:746)
[mvn] at com.carrotsearch.randomizedtesting.RandomizedRunner$3.evaluate(RandomizedRunner.java:648)
[mvn] at com.carrotsearch.randomizedtesting.RandomizedRunner$4.evaluate(RandomizedRunner.java:682)
[mvn] at com.carrotsearch.randomizedtesting.RandomizedRunner$5.evaluate(RandomizedRunner.java:693)
[mvn] at com.carrotsearch.randomizedtesting.rules.StatementAdapter.evaluate(StatementAdapter.java:36)
[mvn] at com.carrotsearch.randomizedtesting.rules.SystemPropertiesRestoreRule$1.evaluate(SystemPropertiesRestoreRule.java:53)
[mvn] at org.apache.lucene.util.AbstractBeforeAfterRule$1.evaluate(AbstractBeforeAfterRule.java:45)
[mvn] at org.apache.lucene.util.TestRuleStoreClassName$1.evaluate(TestRuleStoreClassName.java:42)
[mvn] at com.carrotsearch.randomizedtesting.rules.SystemPropertiesInvariantRule$1.evaluate(SystemPropertiesInvariantRule.java:55)
[mvn] at com.carrotsearch.randomizedtesting.rules.NoShadowingOrOverridesOnMethodsRule$1.evaluate(NoShadowingOrOverridesOnMethodsRule.java:39)
[mvn] at com.carrotsearch.randomizedtesting.rules.NoShadowingOrOverridesOnMethodsRule$1.evaluate(NoShadowingOrOverridesOnMethodsRule.java:39)
[mvn] at com.carrotsearch.randomizedtesting.rules.StatementAdapter.evaluate(StatementAdapter.java:36)
[mvn] at org.apache.lucene.util.TestRuleAssertionsRequired$1.evaluate(TestRuleAssertionsRequired.java:43)
[mvn] at org.apache.lucene.util.TestRuleMarkFailure$1.evaluate(TestRuleMarkFailure.java:48)
[mvn] at org.apache.lucene.util.TestRuleIgnoreAfterMaxFailures$1.evaluate(TestRuleIgnoreAfterMaxFailures.java:70)
[mvn] at org.apache.lucene.util.TestRuleIgnoreTestSuites$1.evaluate(TestRuleIgnoreTestSuites.java:55)
[mvn] at com.carrotsearch.randomizedtesting.rules.StatementAdapter.evaluate(StatementAdapter.java:36)
[mvn] at com.carrotsearch.randomizedtesting.ThreadLeakControl$StatementRunner.run(ThreadLeakControl.java:358)
[mvn] at java.lang.Thread.run(Thread.java:679)
[mvn]
[mvn] 2964 T2275 C4 oasc.SolrException.log SEVERE org.apache.solr.common.SolrException: range facet infinite loop: gap is either zero, or too small relative start/end and caused underflow: 9.9E12 + 0.0003 = 9.9E12
[mvn] at org.apache.solr.request.SimpleFacets.getFacetRangeCounts(SimpleFacets.java:1122)
[mvn] at org.apache.solr.request.SimpleFacets.getFacetRangeCounts(SimpleFacets.java:1074)
[mvn] at org.apache.solr.request.SimpleFacets.getFacetRangeCounts(SimpleFacets.java:1018)
[mvn] at org.apache.solr.request.SimpleFacets.getFacetCounts(SimpleFacets.java:208)
[mvn] at org.apache.solr.handler.component.FacetComponent.process(FacetComponent.java:87)
[mvn] at org.apache.solr.handler.component.SearchHandler.handleRequestBody(SearchHandler.java:206)
[mvn] at org.apache.solr.handler.RequestHandlerBase.handleRequest(RequestHandlerBase.java:129)
[mvn] at org.apache.solr.core.SolrCore.execute(SolrCore.java:1701)
[mvn] at org.apache.solr.util.TestHarness.query(TestHarness.java:364)
[mvn] at org.apache.solr.util.TestHarness.query(TestHarness.java:346)
[mvn] at org.apache.solr.SolrTestCaseJ4.assertQEx(SolrTestCaseJ4.java:611)
[mvn] at org.apache.solr.request.SimpleFacetsTest.testRangeFacetInfiniteLoopDetection(SimpleFacetsTest.java:2086)
[mvn] at sun.reflect.NativeMethodAccessorImpl.invoke0(Native Method)
[mvn] at sun.reflect.NativeMethodAccessorImpl.invoke(NativeMethodAccessorImpl.java:57)
[mvn] at sun.reflect.DelegatingMethodAccessorImpl.invoke(DelegatingMethodAccessorImpl.java:43)
[mvn] at java.lang.reflect.Method.invoke(Method.java:616)
[mvn] at com.carrotsearch.randomizedtesting.RandomizedRunner.invoke(RandomizedRunner.java:1559)
[mvn] at com.carrotsearch.randomizedtesting.RandomizedRunner.access$600(RandomizedRunner.java:79)
[mvn] at com.carrotsearch.randomizedtesting.RandomizedRunner$6.evaluate(RandomizedRunner.java:737)
[mvn] at com.carrotsearch.randomizedtesting.RandomizedRunner$7.evaluate(RandomizedRunner.java:773)
[mvn] at com.carrotsearch.randomizedtesting.RandomizedRunner$8.evaluate(RandomizedRunner.java:787)
[mvn] at com.carrotsearch.randomizedtesting.rules.SystemPropertiesRestoreRule$1.evaluate(SystemPropertiesRestoreRule.java:53)
[mvn] at org.apache.lucene.util.TestRuleSetupTeardownChained$1.evaluate(TestRuleSetupTeardownChained.java:50)
[mvn] at org.apache.lucene.util.TestRuleFieldCacheSanity$1.evaluate(TestRuleFieldCacheSanity.java:51)
[mvn] at org.apache.lucene.util.AbstractBeforeAfterRule$1.evaluate(AbstractBeforeAfterRule.java:45)
[mvn] at com.carrotsearch.randomizedtesting.rules.SystemPropertiesInvariantRule$1.evaluate(SystemPropertiesInvariantRule.java:55)
[mvn] at org.apache.lucene.util.TestRuleThreadAndTestName$1.evaluate(TestRuleThreadAndTestName.java:48)
[mvn] at org.apache.lucene.util.TestRuleIgnoreAfterMaxFailures$1.evaluate(TestRuleIgnoreAfterMaxFailures.java:70)
[mvn] at org.apache.lucene.util.TestRuleMarkFailure$1.evaluate(TestRuleMarkFailure.java:48)
[mvn] at com.carrotsearch.randomizedtesting.rules.StatementAdapter.evaluate(StatementAdapter.java:36)
[mvn] at com.carrotsearch.randomizedtesting.ThreadLeakControl$StatementRunner.run(ThreadLeakControl.java:358)
[mvn] at com.carrotsearch.randomizedtesting.ThreadLeakControl.forkTimeoutingTask(ThreadLeakControl.java:782)
[mvn] at com.carrotsearch.randomizedtesting.ThreadLeakControl$3.evaluate(ThreadLeakControl.java:442)
[mvn] at com.carrotsearch.randomizedtesting.RandomizedRunner.runSingleTest(RandomizedRunner.java:746)
[mvn] at com.carrotsearch.randomizedtesting.RandomizedRunner$3.evaluate(RandomizedRunner.java:648)
[mvn] at com.carrotsearch.randomizedtesting.RandomizedRunner$4.evaluate(RandomizedRunner.java:682)
[mvn] at com.carrotsearch.randomizedtesting.RandomizedRunner$5.evaluate(RandomizedRunner.java:693)
[mvn] at com.carrotsearch.randomizedtesting.rules.StatementAdapter.evaluate(StatementAdapter.java:36)
[mvn] at com.carrotsearch.randomizedtesting.rules.SystemPropertiesRestoreRule$1.evaluate(SystemPropertiesRestoreRule.java:53)
[mvn] at org.apache.lucene.util.AbstractBeforeAfterRule$1.evaluate(AbstractBeforeAfterRule.java:45)
[mvn] at org.apache.lucene.util.TestRuleStoreClassName$1.evaluate(TestRuleStoreClassName.java:42)
[mvn] at com.carrotsearch.randomizedtesting.rules.SystemPropertiesInvariantRule$1.evaluate(SystemPropertiesInvariantRule.java:55)
[mvn] at com.carrotsearch.randomizedtesting.rules.NoShadowingOrOverridesOnMethodsRule$1.evaluate(NoShadowingOrOverridesOnMethodsRule.java:39)
[mvn] at com.carrotsearch.randomizedtesting.rules.NoShadowingOrOverridesOnMethodsRule$1.evaluate(NoShadowingOrOverridesOnMethodsRule.java:39)
[mvn] at com.carrotsearch.randomizedtesting.rules.StatementAdapter.evaluate(StatementAdapter.java:36)
[mvn] at org.apache.lucene.util.TestRuleAssertionsRequired$1.evaluate(TestRuleAssertionsRequired.java:43)
[mvn] at org.apache.lucene.util.TestRuleMarkFailure$1.evaluate(TestRuleMarkFailure.java:48)
[mvn] at org.apache.lucene.util.TestRuleIgnoreAfterMaxFailures$1.evaluate(TestRuleIgnoreAfterMaxFailures.java:70)
[mvn] at org.apache.lucene.util.TestRuleIgnoreTestSuites$1.evaluate(TestRuleIgnoreTestSuites.java:55)
[mvn] at com.carrotsearch.randomizedtesting.rules.StatementAdapter.evaluate(StatementAdapter.java:36)
[mvn] at com.carrotsearch.randomizedtesting.ThreadLeakControl$StatementRunner.run(ThreadLeakControl.java:358)
[mvn] at java.lang.Thread.run(Thread.java:679)
[mvn]
[mvn] Tests run: 32, Failures: 0, Errors: 0, Skipped: 0, Time elapsed: 3.321 sec
[mvn] Running org.apache.solr.analysis.TestCollationKeyRangeQueries
[mvn] Creating dataDir: /usr/home/hudson/hudson-slave/workspace/Lucene-Solr-Maven-4.x/maven-build/solr/core/src/test/target/test/./solrtest-TestCollationKeyRangeQueries-1347879408949
[mvn] Tests run: 3, Failures: 0, Errors: 0, Skipped: 0, Time elapsed: 0.133 sec
[mvn] Running org.apache.solr.util.TestUtils
[mvn] Tests run: 3, Failures: 0, Errors: 0, Skipped: 0, Time elapsed: 0.04 sec
[mvn] Running org.apache.solr.core.TestXIncludeConfig
[mvn] Tests run: 1, Failures: 0, Errors: 0, Skipped: 0, Time elapsed: 0.288 sec
[mvn] Running org.apache.solr.spelling.WordBreakSolrSpellCheckerTest
[mvn] Creating dataDir: /usr/home/hudson/hudson-slave/workspace/Lucene-Solr-Maven-4.x/maven-build/solr/core/src/test/target/test/./solrtest-WordBreakSolrSpellCheckerTest-1347879409414
[mvn] Tests run: 3, Failures: 0, Errors: 0, Skipped: 0, Time elapsed: 1.134 sec
[mvn] Running org.apache.solr.response.TestPHPSerializedResponseWriter
[mvn] Creating dataDir: /usr/home/hudson/hudson-slave/workspace/Lucene-Solr-Maven-4.x/maven-build/solr/core/src/test/target/test/./solrtest-TestPHPSerializedResponseWriter-1347879410556
[mvn] Tests run: 2, Failures: 0, Errors: 0, Skipped: 0, Time elapsed: 0.542 sec
[mvn] Running org.apache.solr.internal.csv.writer.CSVWriterTest
[mvn] Tests run: 2, Failures: 0, Errors: 0, Skipped: 0, Time elapsed: 0.001 sec
[mvn] Running org.apache.solr.search.TestElisionMultitermQuery
[mvn] Creating dataDir: /usr/home/hudson/hudson-slave/workspace/Lucene-Solr-Maven-4.x/maven-build/solr/core/src/test/target/test/./solrtest-TestElisionMultitermQuery-1347879411098
[mvn] Tests run: 1, Failures: 0, Errors: 0, Skipped: 0, Time elapsed: 0.243 sec
[mvn] Running org.apache.solr.TestJoin
[mvn] Creating dataDir: /usr/home/hudson/hudson-slave/workspace/Lucene-Solr-Maven-4.x/maven-build/solr/core/src/test/target/test/./solrtest-TestJoin-1347879411342
[mvn] Tests run: 2, Failures: 0, Errors: 0, Skipped: 0, Time elapsed: 4.395 sec
[mvn] Running org.apache.solr.TestPluginEnable
[mvn] Creating dataDir: /usr/home/hudson/hudson-slave/workspace/Lucene-Solr-Maven-4.x/maven-build/solr/core/src/test/target/test/./solrtest-TestPluginEnable-1347879415734
[mvn] Tests run: 1, Failures: 0, Errors: 0, Skipped: 0, Time elapsed: 0.075 sec
[mvn] Running org.apache.solr.search.function.distance.DistanceFunctionTest
[mvn] Creating dataDir: /usr/home/hudson/hudson-slave/workspace/Lucene-Solr-Maven-4.x/maven-build/solr/core/src/test/target/test/./solrtest-DistanceFunctionTest-1347879415811
[mvn] Tests run: 3, Failures: 0, Errors: 0, Skipped: 0, Time elapsed: 0.423 sec
[mvn] Running org.apache.solr.DisMaxRequestHandlerTest
[mvn] Creating dataDir: /usr/home/hudson/hudson-slave/workspace/Lucene-Solr-Maven-4.x/maven-build/solr/core/src/test/target/test/./solrtest-DisMaxRequestHandlerTest-1347879416234
[mvn] Tests run: 2, Failures: 0, Errors: 0, Skipped: 0, Time elapsed: 0.399 sec
[mvn] Running org.apache.solr.SolrInfoMBeanTest
[mvn] Creating dataDir: /usr/home/hudson/hudson-slave/workspace/Lucene-Solr-Maven-4.x/maven-build/solr/core/src/test/target/test/./solrtest-SolrInfoMBeanTest-1347879416634
[mvn] Tests run: 1, Failures: 0, Errors: 0, Skipped: 0, Time elapsed: 0.374 sec
[mvn] Running org.apache.solr.request.TestBinaryResponseWriter
[mvn] Tests run: 2, Failures: 0, Errors: 0, Skipped: 0, Time elapsed: 0.823 sec
[mvn] Running org.apache.solr.internal.csv.CSVUtilsTest
[mvn] Tests run: 14, Failures: 0, Errors: 0, Skipped: 0, Time elapsed: 0.002 sec
[mvn] Running org.apache.solr.internal.csv.CharBufferTest
[mvn] Tests run: 13, Failures: 0, Errors: 0, Skipped: 0, Time elapsed: 0.002 sec
[mvn] Running org.apache.solr.handler.component.TermVectorComponentTest
[mvn] Creating dataDir: /usr/home/hudson/hudson-slave/workspace/Lucene-Solr-Maven-4.x/maven-build/solr/core/src/test/target/test/./solrtest-TermVectorComponentTest-1347879417839
[mvn] Tests run: 3, Failures: 0, Errors: 0, Skipped: 0, Time elapsed: 0.414 sec
[mvn] Running org.apache.solr.util.SimplePostToolTest
[mvn] Entering crawl at level 0 (1 links total, 1 new)
[mvn] POSTed web resource http://example.com (depth: 0)
[mvn] Entering crawl at level 1 (2 links total, 2 new)
[mvn] POSTed web resource http://example.com/page2 (depth: 1)
[mvn] POSTed web resource http://example.com/page1 (depth: 1)
[mvn] Entering crawl at level 2 (2 links total, 2 new)
[mvn] SimplePostTool: WARNING: The URL http://example.com/disallowed returned a HTTP result status of 403
[mvn] POSTed web resource http://example.com/page1/foo (depth: 2)
[mvn] Entering crawl at level 3 (1 links total, 1 new)
[mvn] POSTed web resource http://example.com/page1/foo/bar (depth: 3)
[mvn] Entering crawl at level 0 (1 links total, 1 new)
[mvn] POSTed web resource http://example.com (depth: 0)
[mvn] Entering crawl at level 1 (2 links total, 2 new)
[mvn] POSTed web resource http://example.com/page2 (depth: 1)
[mvn] POSTed web resource http://example.com/page1 (depth: 1)
[mvn] Entering crawl at level 0 (1 links total, 1 new)
[mvn] POSTed web resource http://example.com (depth: 0)
[mvn] Entering crawl at level 1 (2 links total, 2 new)
[mvn] POSTed web resource http://example.com/page2 (depth: 1)
[mvn] POSTed web resource http://example.com/page1 (depth: 1)
[mvn] Entering crawl at level 2 (2 links total, 2 new)
[mvn] POSTed web resource http://example.com/disallowed (depth: 2)
[mvn] POSTed web resource http://example.com/page1/foo (depth: 2)
[mvn] Entering crawl at level 3 (1 links total, 1 new)
[mvn] POSTed web resource http://example.com/page1/foo/bar (depth: 3)
[mvn] Indexing directory /usr/home/hudson/hudson-slave/workspace/Lucene-Solr-Maven-4.x/maven-build/solr/core/src/test/target/test-classes/exampledocs (2 files, depth=0)
[mvn] POSTing file example.html (text/html)
[mvn] POSTing file example.txt (text/plain)
[mvn] Tests run: 11, Failures: 0, Errors: 0, Skipped: 0, Time elapsed: 0.404 sec
[mvn] Running org.apache.solr.search.TestIndexSearcher
[mvn] Creating dataDir: /usr/home/hudson/hudson-slave/workspace/Lucene-Solr-Maven-4.x/maven-build/solr/core/src/test/target/test/./solrtest-TestIndexSearcher-1347879418658
[mvn] Tests run: 2, Failures: 0, Errors: 0, Skipped: 0, Time elapsed: 1.167 sec
[mvn] Running org.apache.solr.cloud.ChaosMonkeySafeLeaderTest
[mvn] Tests run: 1, Failures: 0, Errors: 0, Skipped: 1, Time elapsed: 0 sec
[mvn] Running org.apache.solr.spelling.suggest.SuggesterTest
[mvn] Creating dataDir: /usr/home/hudson/hudson-slave/workspace/Lucene-Solr-Maven-4.x/maven-build/solr/core/src/test/target/test/./solrtest-SuggesterTest-1347879419830
[mvn] NOTE: per solr.test.leavedatadir, dataDir will not be removed: /usr/home/hudson/hudson-slave/workspace/Lucene-Solr-Maven-4.x/maven-build/solr/core/src/test/target/test/./solrtest-SuggesterTest-1347879419830
[mvn] Tests run: 4, Failures: 0, Errors: 0, Skipped: 0, Time elapsed: 0.963 sec
[mvn] Running org.apache.solr.ConvertedLegacyTest
[mvn] Creating dataDir: /usr/home/hudson/hudson-slave/workspace/Lucene-Solr-Maven-4.x/maven-build/solr/core/src/test/target/test/./solrtest-ConvertedLegacyTest-1347879420795
[mvn] Tests run: 1, Failures: 0, Errors: 0, Skipped: 0, Time elapsed: 1.727 sec
[mvn] Running org.apache.solr.schema.PrimitiveFieldTypeTest
[mvn] Tests run: 1, Failures: 0, Errors: 0, Skipped: 0, Time elapsed: 0.538 sec
[mvn] Running org.apache.solr.core.TestSolrDeletionPolicy1
[mvn] Creating dataDir: /usr/home/hudson/hudson-slave/workspace/Lucene-Solr-Maven-4.x/maven-build/solr/core/src/test/target/test/./solrtest-TestSolrDeletionPolicy1-1347879423060
[mvn] Tests run: 3, Failures: 0, Errors: 0, Skipped: 0, Time elapsed: 0.62 sec
[mvn] Running org.apache.solr.schema.BadIndexSchemaTest
[mvn] Creating dataDir: /usr/home/hudson/hudson-slave/workspace/Lucene-Solr-Maven-4.x/maven-build/solr/core/src/test/target/test/./solrtest-BadIndexSchemaTest-1347879423682
[mvn] Creating dataDir: /usr/home/hudson/hudson-slave/workspace/Lucene-Solr-Maven-4.x/maven-build/solr/core/src/test/target/test/./solrtest-BadIndexSchemaTest-1347879423740
[mvn] Creating dataDir: /usr/home/hudson/hudson-slave/workspace/Lucene-Solr-Maven-4.x/maven-build/solr/core/src/test/target/test/./solrtest-BadIndexSchemaTest-1347879423801
[mvn] 204 T2370 oasc.SolrCore.initCodec SEVERE FieldType 'pulsing1' is configured with a postings format, but the codec does not support it: class org.apache.solr.core.SolrCore$3
[mvn] Creating dataDir: /usr/home/hudson/hudson-slave/workspace/Lucene-Solr-Maven-4.x/maven-build/solr/core/src/test/target/test/./solrtest-BadIndexSchemaTest-1347879423888
[mvn] 232 T3 oasc.CoreContainer.finalize SEVERE CoreContainer was not shutdown prior to finalize(), indicates a bug -- POSSIBLE RESOURCE LEAK!!! instance=98577544
[mvn] 233 T3 oasc.SolrCore.finalize SEVERE REFCOUNT ERROR: unreferenced org.apache.solr.core.SolrCore@408b97bb (collection1) has a reference count of 1
[mvn] 287 T2370 oass.IndexSchema.readSchema SEVERE FieldType 'sim1' is configured with a similarity, but the global similarity does not support it: class org.apache.solr.search.similarities.DefaultSimilarityFactory
[mvn] Creating dataDir: /usr/home/hudson/hudson-slave/workspace/Lucene-Solr-Maven-4.x/maven-build/solr/core/src/test/target/test/./solrtest-BadIndexSchemaTest-1347879423971
[mvn] Creating dataDir: /usr/home/hudson/hudson-slave/workspace/Lucene-Solr-Maven-4.x/maven-build/solr/core/src/test/target/test/./solrtest-BadIndexSchemaTest-1347879424047
[mvn] 441 T2370 oass.IndexSchema.readSchema SEVERE uniqueKey field (id) can not be the dest of a copyField (src=XXX)
[mvn] Creating dataDir: /usr/home/hudson/hudson-slave/workspace/Lucene-Solr-Maven-4.x/maven-build/solr/core/src/test/target/test/./solrtest-BadIndexSchemaTest-1347879424122
[mvn] 516 T2370 oass.IndexSchema.readSchema SEVERE uniqueKey field (null) can not be configured with a default value (XXX)
[mvn] Creating dataDir: /usr/home/hudson/hudson-slave/workspace/Lucene-Solr-Maven-4.x/maven-build/solr/core/src/test/target/test/./solrtest-BadIndexSchemaTest-1347879424197
[mvn] 591 T2370 oass.IndexSchema.readSchema SEVERE uniqueKey field (null) can not be configured to be multivalued
[mvn] Creating dataDir: /usr/home/hudson/hudson-slave/workspace/Lucene-Solr-Maven-4.x/maven-build/solr/core/src/test/target/test/./solrtest-BadIndexSchemaTest-1347879424275
[mvn] Creating dataDir: /usr/home/hudson/hudson-slave/workspace/Lucene-Solr-Maven-4.x/maven-build/solr/core/src/test/target/test/./solrtest-BadIndexSchemaTest-1347879424331
[mvn] Creating dataDir: /usr/home/hudson/hudson-slave/workspace/Lucene-Solr-Maven-4.x/maven-build/solr/core/src/test/target/test/./solrtest-BadIndexSchemaTest-1347879424388
[mvn] Creating dataDir: /usr/home/hudson/hudson-slave/workspace/Lucene-Solr-Maven-4.x/maven-build/solr/core/src/test/target/test/./solrtest-BadIndexSchemaTest-1347879424441
[mvn] Creating dataDir: /usr/home/hudson/hudson-slave/workspace/Lucene-Solr-Maven-4.x/maven-build/solr/core/src/test/target/test/./solrtest-BadIndexSchemaTest-1347879424490
[mvn] Creating dataDir: /usr/home/hudson/hudson-slave/workspace/Lucene-Solr-Maven-4.x/maven-build/solr/core/src/test/target/test/./solrtest-BadIndexSchemaTest-1347879424539
[mvn] Creating dataDir: /usr/home/hudson/hudson-slave/workspace/Lucene-Solr-Maven-4.x/maven-build/solr/core/src/test/target/test/./solrtest-BadIndexSchemaTest-1347879424588
[mvn] Creating dataDir: /usr/home/hudson/hudson-slave/workspace/Lucene-Solr-Maven-4.x/maven-build/solr/core/src/test/target/test/./solrtest-BadIndexSchemaTest-1347879424639
[mvn] Creating dataDir: /usr/home/hudson/hudson-slave/workspace/Lucene-Solr-Maven-4.x/maven-build/solr/core/src/test/target/test/./solrtest-BadIndexSchemaTest-1347879424692
[mvn] Creating dataDir: /usr/home/hudson/hudson-slave/workspace/Lucene-Solr-Maven-4.x/maven-build/solr/core/src/test/target/test/./solrtest-BadIndexSchemaTest-1347879424743
[mvn] Tests run: 10, Failures: 0, Errors: 0, Skipped: 0, Time elapsed: 1.125 sec
[mvn] Running org.apache.solr.BasicFunctionalityTest
[mvn] Creating dataDir: /usr/home/hudson/hudson-slave/workspace/Lucene-Solr-Maven-4.x/maven-build/solr/core/src/test/target/test/./solrtest-BasicFunctionalityTest-1347879424807
[mvn] Tests run: 23, Failures: 0, Errors: 0, Skipped: 1, Time elapsed: 1.048 sec
[mvn] Running org.apache.solr.handler.admin.LukeRequestHandlerTest
[mvn] Tests run: 4, Failures: 0, Errors: 0, Skipped: 0, Time elapsed: 1.875 sec
[mvn] Running org.apache.solr.schema.TestOmitPositions
[mvn] Creating dataDir: /usr/home/hudson/hudson-slave/workspace/Lucene-Solr-Maven-4.x/maven-build/solr/core/src/test/target/test/./solrtest-TestOmitPositions-1347879427733
[mvn] Tests run: 2, Failures: 0, Errors: 0, Skipped: 0, Time elapsed: 0.521 sec
[mvn] Running org.apache.solr.core.TestCodecSupport
[mvn] Creating dataDir: /usr/home/hudson/hudson-slave/workspace/Lucene-Solr-Maven-4.x/maven-build/solr/core/src/test/target/test/./solrtest-TestCodecSupport-1347879428255
[mvn] Tests run: 3, Failures: 0, Errors: 0, Skipped: 0, Time elapsed: 0.096 sec
[mvn] Running org.apache.solr.OutputWriterTest
[mvn] Creating dataDir: /usr/home/hudson/hudson-slave/workspace/Lucene-Solr-Maven-4.x/maven-build/solr/core/src/test/target/test/./solrtest-OutputWriterTest-1347879428354
[mvn] Tests run: 5, Failures: 0, Errors: 0, Skipped: 0, Time elapsed: 0.264 sec
[mvn] Running org.apache.solr.schema.UUIDFieldTest
[mvn] Tests run: 1, Failures: 0, Errors: 0, Skipped: 0, Time elapsed: 0.024 sec
[mvn] Running org.apache.solr.handler.component.StatsComponentTest
[mvn] ASYNC NEW_CORE C5 name=collection1 org.apache.solr.core.SolrCore@7e3df14a
[mvn] 804 T2392 C5 oasc.SolrException.log SEVERE org.apache.solr.common.SolrException: Stats can only facet on single-valued fields, not: foo_ss
[mvn] at org.apache.solr.handler.component.SimpleStats.getFieldCacheStats(StatsComponent.java:261)
[mvn] at org.apache.solr.handler.component.SimpleStats.getStatsFields(StatsComponent.java:227)
[mvn] at org.apache.solr.handler.component.SimpleStats.getStatsCounts(StatsComponent.java:201)
[mvn] at org.apache.solr.handler.component.StatsComponent.process(StatsComponent.java:70)
[mvn] at org.apache.solr.handler.component.SearchHandler.handleRequestBody(SearchHandler.java:206)
[mvn] at org.apache.solr.handler.RequestHandlerBase.handleRequest(RequestHandlerBase.java:129)
[mvn] at org.apache.solr.core.SolrCore.execute(SolrCore.java:1701)
[mvn] at org.apache.solr.util.TestHarness.query(TestHarness.java:364)
[mvn] at org.apache.solr.util.TestHarness.query(TestHarness.java:346)
[mvn] at org.apache.solr.util.AbstractSolrTestCase.assertQEx(AbstractSolrTestCase.java:290)
[mvn] at org.apache.solr.handler.component.StatsComponentTest.testStatsFacetMultivaluedErrorHandling(StatsComponentTest.java:363)
[mvn] at sun.reflect.NativeMethodAccessorImpl.invoke0(Native Method)
[mvn] at sun.reflect.NativeMethodAccessorImpl.invoke(NativeMethodAccessorImpl.java:57)
[mvn] at sun.reflect.DelegatingMethodAccessorImpl.invoke(DelegatingMethodAccessorImpl.java:43)
[mvn] at java.lang.reflect.Method.invoke(Method.java:616)
[mvn] at com.carrotsearch.randomizedtesting.RandomizedRunner.invoke(RandomizedRunner.java:1559)
[mvn] at com.carrotsearch.randomizedtesting.RandomizedRunner.access$600(RandomizedRunner.java:79)
[mvn] at com.carrotsearch.randomizedtesting.RandomizedRunner$6.evaluate(RandomizedRunner.java:737)
[mvn] at com.carrotsearch.randomizedtesting.RandomizedRunner$7.evaluate(RandomizedRunner.java:773)
[mvn] at com.carrotsearch.randomizedtesting.RandomizedRunner$8.evaluate(RandomizedRunner.java:787)
[mvn] at com.carrotsearch.randomizedtesting.rules.SystemPropertiesRestoreRule$1.evaluate(SystemPropertiesRestoreRule.java:53)
[mvn] at org.apache.lucene.util.TestRuleSetupTeardownChained$1.evaluate(TestRuleSetupTeardownChained.java:50)
[mvn] at org.apache.lucene.util.TestRuleFieldCacheSanity$1.evaluate(TestRuleFieldCacheSanity.java:51)
[mvn] at org.apache.lucene.util.AbstractBeforeAfterRule$1.evaluate(AbstractBeforeAfterRule.java:45)
[mvn] at com.carrotsearch.randomizedtesting.rules.SystemPropertiesInvariantRule$1.evaluate(SystemPropertiesInvariantRule.java:55)
[mvn] at org.apache.lucene.util.TestRuleThreadAndTestName$1.evaluate(TestRuleThreadAndTestName.java:48)
[mvn] at org.apache.lucene.util.TestRuleIgnoreAfterMaxFailures$1.evaluate(TestRuleIgnoreAfterMaxFailures.java:70)
[mvn] at org.apache.lucene.util.TestRuleMarkFailure$1.evaluate(TestRuleMarkFailure.java:48)
[mvn] at com.carrotsearch.randomizedtesting.rules.StatementAdapter.evaluate(StatementAdapter.java:36)
[mvn] at com.carrotsearch.randomizedtesting.ThreadLeakControl$StatementRunner.run(ThreadLeakControl.java:358)
[mvn] at com.carrotsearch.randomizedtesting.ThreadLeakControl.forkTimeoutingTask(ThreadLeakControl.java:782)
[mvn] at com.carrotsearch.randomizedtesting.ThreadLeakControl$3.evaluate(ThreadLeakControl.java:442)
[mvn] at com.carrotsearch.randomizedtesting.RandomizedRunner.runSingleTest(RandomizedRunner.java:746)
[mvn] at com.carrotsearch.randomizedtesting.RandomizedRunner$3.evaluate(RandomizedRunner.java:648)
[mvn] at com.carrotsearch.randomizedtesting.RandomizedRunner$4.evaluate(RandomizedRunner.java:682)
[mvn] at com.carrotsearch.randomizedtesting.RandomizedRunner$5.evaluate(RandomizedRunner.java:693)
[mvn] at com.carrotsearch.randomizedtesting.rules.StatementAdapter.evaluate(StatementAdapter.java:36)
[mvn] at com.carrotsearch.randomizedtesting.rules.SystemPropertiesRestoreRule$1.evaluate(SystemPropertiesRestoreRule.java:53)
[mvn] at org.apache.lucene.util.AbstractBeforeAfterRule$1.evaluate(AbstractBeforeAfterRule.java:45)
[mvn] at org.apache.lucene.util.TestRuleStoreClassName$1.evaluate(TestRuleStoreClassName.java:42)
[mvn] at com.carrotsearch.randomizedtesting.rules.SystemPropertiesInvariantRule$1.evaluate(SystemPropertiesInvariantRule.java:55)
[mvn] at com.carrotsearch.randomizedtesting.rules.NoShadowingOrOverridesOnMethodsRule$1.evaluate(NoShadowingOrOverridesOnMethodsRule.java:39)
[mvn] at com.carrotsearch.randomizedtesting.rules.NoShadowingOrOverridesOnMethodsRule$1.evaluate(NoShadowingOrOverridesOnMethodsRule.java:39)
[mvn] at com.carrotsearch.randomizedtesting.rules.StatementAdapter.evaluate(StatementAdapter.java:36)
[mvn] at org.apache.lucene.util.TestRuleAssertionsRequired$1.evaluate(TestRuleAssertionsRequired.java:43)
[mvn] at org.apache.lucene.util.TestRuleMarkFailure$1.evaluate(TestRuleMarkFailure.java:48)
[mvn] at org.apache.lucene.util.TestRuleIgnoreAfterMaxFailures$1.evaluate(TestRuleIgnoreAfterMaxFailures.java:70)
[mvn] at org.apache.lucene.util.TestRuleIgnoreTestSuites$1.evaluate(TestRuleIgnoreTestSuites.java:55)
[mvn] at com.carrotsearch.randomizedtesting.rules.StatementAdapter.evaluate(StatementAdapter.java:36)
[mvn] at com.carrotsearch.randomizedtesting.ThreadLeakControl$StatementRunner.run(ThreadLeakControl.java:358)
[mvn] at java.lang.Thread.run(Thread.java:679)
[mvn]
[mvn] Tests run: 7, Failures: 0, Errors: 0, Skipped: 0, Time elapsed: 3.517 sec
[mvn] Running org.apache.solr.schema.IndexSchemaTest
[mvn] Creating dataDir: /usr/home/hudson/hudson-slave/workspace/Lucene-Solr-Maven-4.x/maven-build/solr/core/src/test/target/test/./solrtest-IndexSchemaTest-1347879432161
[mvn] Tests run: 3, Failures: 0, Errors: 0, Skipped: 0, Time elapsed: 0.517 sec
[mvn] Running org.apache.solr.core.TestArbitraryIndexDir
[mvn] Tests run: 1, Failures: 0, Errors: 0, Skipped: 0, Time elapsed: 0.634 sec
[mvn] Running org.apache.solr.request.TestWriterPerf
[mvn] Tests run: 1, Failures: 0, Errors: 0, Skipped: 0, Time elapsed: 1.048 sec
[mvn] Running org.apache.solr.search.similarities.TestLMJelinekMercerSimilarityFactory
[mvn] Creating dataDir: /usr/home/hudson/hudson-slave/workspace/Lucene-Solr-Maven-4.x/maven-build/solr/core/src/test/target/test/./solrtest-TestLMJelinekMercerSimilarityFactory-1347879434364
[mvn] Tests run: 2, Failures: 0, Errors: 0, Skipped: 0, Time elapsed: 0.099 sec
[mvn] Running org.apache.solr.spelling.suggest.TestPhraseSuggestions
[mvn] Creating dataDir: /usr/home/hudson/hudson-slave/workspace/Lucene-Solr-Maven-4.x/maven-build/solr/core/src/test/target/test/./solrtest-TestPhraseSuggestions-1347879434463
[mvn] Tests run: 1, Failures: 0, Errors: 0, Skipped: 0, Time elapsed: 0.098 sec
[mvn] Running org.apache.solr.handler.component.DebugComponentTest
[mvn] Creating dataDir: /usr/home/hudson/hudson-slave/workspace/Lucene-Solr-Maven-4.x/maven-build/solr/core/src/test/target/test/./solrtest-DebugComponentTest-1347879434563
[mvn] Tests run: 2, Failures: 0, Errors: 0, Skipped: 0, Time elapsed: 0.544 sec
[mvn] Running org.apache.solr.core.TestCoreContainer
[mvn] Creating dataDir: /usr/home/hudson/hudson-slave/workspace/Lucene-Solr-Maven-4.x/maven-build/solr/core/src/test/target/test/./solrtest-TestCoreContainer-1347879435112
[mvn] Tests run: 3, Failures: 0, Errors: 0, Skipped: 0, Time elapsed: 2.682 sec
[mvn] Running org.apache.solr.schema.TestCollationField
[mvn] Creating dataDir: /usr/home/hudson/hudson-slave/workspace/Lucene-Solr-Maven-4.x/maven-build/solr/core/src/test/target/test/./solrtest-TestCollationField-1347879437808
[mvn] Tests run: 8, Failures: 0, Errors: 0, Skipped: 0, Time elapsed: 0.298 sec
[mvn] Running org.apache.solr.update.SolrIndexConfigTest
[mvn] Tests run: 2, Failures: 0, Errors: 0, Skipped: 0, Time elapsed: 0.421 sec
[mvn] Running org.apache.solr.core.SolrCoreTest
[mvn] Creating dataDir: /usr/home/hudson/hudson-slave/workspace/Lucene-Solr-Maven-4.x/maven-build/solr/core/src/test/target/test/./solrtest-SolrCoreTest-1347879438514
[mvn] Creating dataDir: /usr/home/hudson/hudson-slave/workspace/Lucene-Solr-Maven-4.x/maven-build/solr/core/src/test/target/test/./solrtest-SolrCoreTest-1347879439972
[mvn] Creating dataDir: /usr/home/hudson/hudson-slave/workspace/Lucene-Solr-Maven-4.x/maven-build/solr/core/src/test/target/test/./solrtest-SolrCoreTest-1347879440353
[mvn] Creating dataDir: /usr/home/hudson/hudson-slave/workspace/Lucene-Solr-Maven-4.x/maven-build/solr/core/src/test/target/test/./solrtest-SolrCoreTest-1347879440702
[mvn] Creating dataDir: /usr/home/hudson/hudson-slave/workspace/Lucene-Solr-Maven-4.x/maven-build/solr/core/src/test/target/test/./solrtest-SolrCoreTest-1347879441039
[mvn] Creating dataDir: /usr/home/hudson/hudson-slave/workspace/Lucene-Solr-Maven-4.x/maven-build/solr/core/src/test/target/test/./solrtest-SolrCoreTest-1347879441363
[mvn] Tests run: 6, Failures: 0, Errors: 0, Skipped: 0, Time elapsed: 3.27 sec
[mvn] Running org.apache.solr.analysis.TestReversedWildcardFilterFactory
[mvn] Creating dataDir: /usr/home/hudson/hudson-slave/workspace/Lucene-Solr-Maven-4.x/maven-build/solr/core/src/test/target/test/./solrtest-TestReversedWildcardFilterFactory-1347879441784
[mvn] Tests run: 4, Failures: 0, Errors: 0, Skipped: 0, Time elapsed: 0.402 sec
[mvn] Running org.apache.solr.cloud.ZkSolrClientTest
[mvn] Tests run: 4, Failures: 0, Errors: 0, Skipped: 0, Time elapsed: 8.124 sec
[mvn] Running org.apache.solr.update.processor.UniqFieldsUpdateProcessorFactoryTest
[mvn] Creating dataDir: /usr/home/hudson/hudson-slave/workspace/Lucene-Solr-Maven-4.x/maven-build/solr/core/src/test/target/test/./solrtest-UniqFieldsUpdateProcessorFactoryTest-1347879450313
[mvn] Tests run: 1, Failures: 0, Errors: 0, Skipped: 0, Time elapsed: 0.481 sec
[mvn] Running org.apache.solr.AnalysisAfterCoreReloadTest
[mvn] Tests run: 1, Failures: 0, Errors: 0, Skipped: 0, Time elapsed: 1.591 sec
[mvn] Running org.apache.solr.handler.component.TermsComponentTest
[mvn] Creating dataDir: /usr/home/hudson/hudson-slave/workspace/Lucene-Solr-Maven-4.x/maven-build/solr/core/src/test/target/test/./solrtest-TermsComponentTest-1347879452391
[mvn] Tests run: 13, Failures: 0, Errors: 0, Skipped: 0, Time elapsed: 0.694 sec
[mvn] Running org.apache.solr.util.SolrPluginUtilsTest
[mvn] Creating dataDir: /usr/home/hudson/hudson-slave/workspace/Lucene-Solr-Maven-4.x/maven-build/solr/core/src/test/target/test/./solrtest-SolrPluginUtilsTest-1347879453083
[mvn] Tests run: 7, Failures: 0, Errors: 0, Skipped: 0, Time elapsed: 0.532 sec
[mvn] Running org.apache.solr.handler.BinaryUpdateRequestHandlerTest
[mvn] Creating dataDir: /usr/home/hudson/hudson-slave/workspace/Lucene-Solr-Maven-4.x/maven-build/solr/core/src/test/target/test/./solrtest-BinaryUpdateRequestHandlerTest-1347879453615
[mvn] null
[mvn] Tests run: 1, Failures: 0, Errors: 0, Skipped: 0, Time elapsed: 0.491 sec
[mvn] Running org.apache.solr.search.TestSearchPerf
[mvn] Tests run: 1, Failures: 0, Errors: 0, Skipped: 0, Time elapsed: 0.264 sec
[mvn] Running org.apache.solr.request.TestRemoteStreaming
[mvn] Creating dataDir: /usr/home/hudson/hudson-slave/workspace/Lucene-Solr-Maven-4.x/maven-build/solr/core/src/test/target/test/./solrtest-TestRemoteStreaming-1347879454373
[mvn] Tests run: 4, Failures: 0, Errors: 0, Skipped: 0, Time elapsed: 0.654 sec
[mvn] Running org.apache.solr.handler.CSVRequestHandlerTest
[mvn] Creating dataDir: /usr/home/hudson/hudson-slave/workspace/Lucene-Solr-Maven-4.x/maven-build/solr/core/src/test/target/test/./solrtest-CSVRequestHandlerTest-1347879455027
[mvn] Tests run: 1, Failures: 0, Errors: 0, Skipped: 0, Time elapsed: 0.489 sec
[mvn] Running org.apache.solr.core.TestPropInjectDefaults
[mvn] Creating dataDir: /usr/home/hudson/hudson-slave/workspace/Lucene-Solr-Maven-4.x/maven-build/solr/core/src/test/target/test/./solrtest-TestPropInjectDefaults-1347879455517
[mvn] Tests run: 2, Failures: 0, Errors: 0, Skipped: 0, Time elapsed: 0.387 sec
[mvn] Running org.apache.solr.internal.csv.writer.CSVConfigGuesserTest
[mvn] Tests run: 3, Failures: 0, Errors: 0, Skipped: 0, Time elapsed: 0.001 sec
[mvn] Running org.apache.solr.cloud.LeaderElectionTest
[mvn] Creating dataDir: /usr/home/hudson/hudson-slave/workspace/Lucene-Solr-Maven-4.x/maven-build/solr/core/src/test/target/test/./solrtest-LeaderElectionTest-1347879455909
[mvn] 9061 T2668 oasc.LeaderElectionTest$ClientThread.run SEVERE setup failed org.apache.zookeeper.KeeperException$SessionExpiredException: KeeperErrorCode = Session expired for /collections/collection1/leader_elect/shard1/election
[mvn] at org.apache.zookeeper.KeeperException.create(KeeperException.java:118)
[mvn] at org.apache.zookeeper.KeeperException.create(KeeperException.java:42)
[mvn] at org.apache.zookeeper.ZooKeeper.exists(ZooKeeper.java:815)
[mvn] at org.apache.solr.common.cloud.SolrZkClient$4.execute(SolrZkClient.java:232)
[mvn] at org.apache.solr.common.cloud.SolrZkClient$4.execute(SolrZkClient.java:229)
[mvn] at org.apache.solr.common.cloud.ZkCmdExecutor.retryOperation(ZkCmdExecutor.java:67)
[mvn] at org.apache.solr.common.cloud.SolrZkClient.exists(SolrZkClient.java:229)
[mvn] at org.apache.solr.common.cloud.ZkCmdExecutor.ensureExists(ZkCmdExecutor.java:94)
[mvn] at org.apache.solr.common.cloud.ZkCmdExecutor.ensureExists(ZkCmdExecutor.java:88)
[mvn] at org.apache.solr.cloud.LeaderElector.setup(LeaderElector.java:291)
[mvn] at org.apache.solr.cloud.LeaderElectionTest$ClientThread.setupOnConnect(LeaderElectionTest.java:116)
[mvn] at org.apache.solr.cloud.LeaderElectionTest$ClientThread.run(LeaderElectionTest.java:125)
[mvn] at java.util.concurrent.Executors$RunnableAdapter.call(Executors.java:471)
[mvn] at java.util.concurrent.FutureTask$Sync.innerRun(FutureTask.java:334)
[mvn] at java.util.concurrent.FutureTask.run(FutureTask.java:166)
[mvn] at java.util.concurrent.ScheduledThreadPoolExecutor$ScheduledFutureTask.access$101(ScheduledThreadPoolExecutor.java:165)
[mvn] at java.util.concurrent.ScheduledThreadPoolExecutor$ScheduledFutureTask.run(ScheduledThreadPoolExecutor.java:266)
[mvn] at java.util.concurrent.ThreadPoolExecutor.runWorker(ThreadPoolExecutor.java:1110)
[mvn] at java.util.concurrent.ThreadPoolExecutor$Worker.run(ThreadPoolExecutor.java:603)
[mvn] at java.lang.Thread.run(Thread.java:679)
[mvn]
[mvn] 9113 T2645 oasc.LeaderElectionTest$ClientThread.run SEVERE setup failed org.apache.zookeeper.KeeperException$SessionExpiredException: KeeperErrorCode = Session expired for /collections/collection1/leader_elect/shard1/election
[mvn] at org.apache.zookeeper.KeeperException.create(KeeperException.java:118)
[mvn] at org.apache.zookeeper.KeeperException.create(KeeperException.java:42)
[mvn] at org.apache.zookeeper.ZooKeeper.exists(ZooKeeper.java:815)
[mvn] at org.apache.solr.common.cloud.SolrZkClient$4.execute(SolrZkClient.java:232)
[mvn] at org.apache.solr.common.cloud.SolrZkClient$4.execute(SolrZkClient.java:229)
[mvn] at org.apache.solr.common.cloud.ZkCmdExecutor.retryOperation(ZkCmdExecutor.java:67)
[mvn] at org.apache.solr.common.cloud.SolrZkClient.exists(SolrZkClient.java:229)
[mvn] at org.apache.solr.common.cloud.ZkCmdExecutor.ensureExists(ZkCmdExecutor.java:94)
[mvn] at org.apache.solr.common.cloud.ZkCmdExecutor.ensureExists(ZkCmdExecutor.java:88)
[mvn] at org.apache.solr.cloud.LeaderElector.setup(LeaderElector.java:291)
[mvn] at org.apache.solr.cloud.LeaderElectionTest$ClientThread.setupOnConnect(LeaderElectionTest.java:116)
[mvn] at org.apache.solr.cloud.LeaderElectionTest$ClientThread.run(LeaderElectionTest.java:125)
[mvn] at java.util.concurrent.Executors$RunnableAdapter.call(Executors.java:471)
[mvn] at java.util.concurrent.FutureTask$Sync.innerRun(FutureTask.java:334)
[mvn] at java.util.concurrent.FutureTask.run(FutureTask.java:166)
[mvn] at java.util.concurrent.ScheduledThreadPoolExecutor$ScheduledFutureTask.access$101(ScheduledThreadPoolExecutor.java:165)
[mvn] at java.util.concurrent.ScheduledThreadPoolExecutor$ScheduledFutureTask.run(ScheduledThreadPoolExecutor.java:266)
[mvn] at java.util.concurrent.ThreadPoolExecutor.runWorker(ThreadPoolExecutor.java:1110)
[mvn] at java.util.concurrent.ThreadPoolExecutor$Worker.run(ThreadPoolExecutor.java:603)
[mvn] at java.lang.Thread.run(Thread.java:679)
[mvn]
[mvn] 9353 T2664 oasc.LeaderElectionTest$ClientThread.run SEVERE setup failed org.apache.zookeeper.KeeperException$SessionExpiredException: KeeperErrorCode = Session expired for /collections/collection1/leader_elect/shard1/election
[mvn] at org.apache.zookeeper.KeeperException.create(KeeperException.java:118)
[mvn] at org.apache.zookeeper.KeeperException.create(KeeperException.java:42)
[mvn] at org.apache.zookeeper.ZooKeeper.exists(ZooKeeper.java:815)
[mvn] at org.apache.solr.common.cloud.SolrZkClient$4.execute(SolrZkClient.java:232)
[mvn] at org.apache.solr.common.cloud.SolrZkClient$4.execute(SolrZkClient.java:229)
[mvn] at org.apache.solr.common.cloud.ZkCmdExecutor.retryOperation(ZkCmdExecutor.java:67)
[mvn] at org.apache.solr.common.cloud.SolrZkClient.exists(SolrZkClient.java:229)
[mvn] at org.apache.solr.common.cloud.ZkCmdExecutor.ensureExists(ZkCmdExecutor.java:94)
[mvn] at org.apache.solr.common.cloud.ZkCmdExecutor.ensureExists(ZkCmdExecutor.java:88)
[mvn] at org.apache.solr.cloud.LeaderElector.setup(LeaderElector.java:291)
[mvn] at org.apache.solr.cloud.LeaderElectionTest$ClientThread.setupOnConnect(LeaderElectionTest.java:116)
[mvn] at org.apache.solr.cloud.LeaderElectionTest$ClientThread.run(LeaderElectionTest.java:125)
[mvn] at java.util.concurrent.Executors$RunnableAdapter.call(Executors.java:471)
[mvn] at java.util.concurrent.FutureTask$Sync.innerRun(FutureTask.java:334)
[mvn] at java.util.concurrent.FutureTask.run(FutureTask.java:166)
[mvn] at java.util.concurrent.ScheduledThreadPoolExecutor$ScheduledFutureTask.access$101(ScheduledThreadPoolExecutor.java:165)
[mvn] at java.util.concurrent.ScheduledThreadPoolExecutor$ScheduledFutureTask.run(ScheduledThreadPoolExecutor.java:266)
[mvn] at java.util.concurrent.ThreadPoolExecutor.runWorker(ThreadPoolExecutor.java:1110)
[mvn] at java.util.concurrent.ThreadPoolExecutor$Worker.run(ThreadPoolExecutor.java:603)
[mvn] at java.lang.Thread.run(Thread.java:679)
[mvn]
[mvn] 12862 T2668 oasc.LeaderElectionTest$ClientThread.run SEVERE setup failed org.apache.zookeeper.KeeperException$SessionExpiredException: KeeperErrorCode = Session expired for /collections/collection1/leader_elect/shard1/election
[mvn] at org.apache.zookeeper.KeeperException.create(KeeperException.java:118)
[mvn] at org.apache.zookeeper.KeeperException.create(KeeperException.java:42)
[mvn] at org.apache.zookeeper.ZooKeeper.exists(ZooKeeper.java:815)
[mvn] at org.apache.solr.common.cloud.SolrZkClient$4.execute(SolrZkClient.java:232)
[mvn] at org.apache.solr.common.cloud.SolrZkClient$4.execute(SolrZkClient.java:229)
[mvn] at org.apache.solr.common.cloud.ZkCmdExecutor.retryOperation(ZkCmdExecutor.java:67)
[mvn] at org.apache.solr.common.cloud.SolrZkClient.exists(SolrZkClient.java:229)
[mvn] at org.apache.solr.common.cloud.ZkCmdExecutor.ensureExists(ZkCmdExecutor.java:94)
[mvn] at org.apache.solr.common.cloud.ZkCmdExecutor.ensureExists(ZkCmdExecutor.java:88)
[mvn] at org.apache.solr.cloud.LeaderElector.setup(LeaderElector.java:291)
[mvn] at org.apache.solr.cloud.LeaderElectionTest$ClientThread.setupOnConnect(LeaderElectionTest.java:116)
[mvn] at org.apache.solr.cloud.LeaderElectionTest$ClientThread.run(LeaderElectionTest.java:125)
[mvn] at java.util.concurrent.Executors$RunnableAdapter.call(Executors.java:471)
[mvn] at java.util.concurrent.FutureTask$Sync.innerRun(FutureTask.java:334)
[mvn] at java.util.concurrent.FutureTask.run(FutureTask.java:166)
[mvn] at java.util.concurrent.ScheduledThreadPoolExecutor$ScheduledFutureTask.access$101(ScheduledThreadPoolExecutor.java:165)
[mvn] at java.util.concurrent.ScheduledThreadPoolExecutor$ScheduledFutureTask.run(ScheduledThreadPoolExecutor.java:266)
[mvn] at java.util.concurrent.ThreadPoolExecutor.runWorker(ThreadPoolExecutor.java:1110)
[mvn] at java.util.concurrent.ThreadPoolExecutor$Worker.run(ThreadPoolExecutor.java:603)
[mvn] at java.lang.Thread.run(Thread.java:679)
[mvn]
[mvn] Tests run: 4, Failures: 0, Errors: 0, Skipped: 0, Time elapsed: 13.431 sec
[mvn] Running org.apache.solr.search.TestDocSet
[mvn] Tests run: 2, Failures: 0, Errors: 0, Skipped: 0, Time elapsed: 0.66 sec
[mvn] Running org.apache.solr.cloud.BasicDistributedZk2Test
[mvn] Creating dataDir: /usr/home/hudson/hudson-slave/workspace/Lucene-Solr-Maven-4.x/maven-build/solr/core/src/test/target/test/./solrtest-BasicDistributedZk2Test-1347879470011
[mvn] 45748 T2756 oasc.SolrException.log SEVERE Sync Failed
[mvn] ASYNC NEW_CORE C6 name=collection1 org.apache.solr.core.SolrCore@465a033a url=http://127.0.0.1:42142/solr/collection1 node=127.0.0.1:42142_solr
[mvn] 120771 T2795 C6 P42142 oasc.SolrException.log SEVERE Error while trying to recover. core=collection1:org.apache.solr.client.solrj.SolrServerException: IOException occured when talking to server at: http://127.0.0.1:42134/solr
[mvn] at org.apache.solr.client.solrj.impl.HttpSolrServer.request(HttpSolrServer.java:414)
[mvn] at org.apache.solr.client.solrj.impl.HttpSolrServer.request(HttpSolrServer.java:182)
[mvn] at org.apache.solr.cloud.RecoveryStrategy.sendPrepRecoveryCmd(RecoveryStrategy.java:199)
[mvn] at org.apache.solr.cloud.RecoveryStrategy.doRecovery(RecoveryStrategy.java:388)
[mvn] at org.apache.solr.cloud.RecoveryStrategy.run(RecoveryStrategy.java:220)
[mvn] Caused by: org.apache.http.conn.ConnectTimeoutException: Connect to 127.0.0.1:42134 timed out
[mvn] at org.apache.http.conn.scheme.PlainSocketFactory.connectSocket(PlainSocketFactory.java:125)
[mvn] at org.apache.http.impl.conn.DefaultClientConnectionOperator.openConnection(DefaultClientConnectionOperator.java:148)
[mvn] at org.apache.http.impl.conn.AbstractPoolEntry.open(AbstractPoolEntry.java:150)
[mvn] at org.apache.http.impl.conn.AbstractPooledConnAdapter.open(AbstractPooledConnAdapter.java:121)
[mvn] at org.apache.http.impl.client.DefaultRequestDirector.tryConnect(DefaultRequestDirector.java:575)
[mvn] at org.apache.http.impl.client.DefaultRequestDirector.execute(DefaultRequestDirector.java:425)
[mvn] at org.apache.http.impl.client.AbstractHttpClient.execute(AbstractHttpClient.java:820)
[mvn] at org.apache.http.impl.client.AbstractHttpClient.execute(AbstractHttpClient.java:754)
[mvn] at org.apache.http.impl.client.AbstractHttpClient.execute(AbstractHttpClient.java:732)
[mvn] at org.apache.solr.client.solrj.impl.HttpSolrServer.request(HttpSolrServer.java:353)
[mvn] ... 4 more
[mvn]
[mvn] 120772 T2795 C6 P42142 oasc.RecoveryStrategy.doRecovery SEVERE Recovery failed - trying again... core=collection1
[mvn] 167786 T2795 C6 P42142 oasc.SolrException.log SEVERE Error while trying to recover. core=collection1:org.apache.solr.client.solrj.SolrServerException: IOException occured when talking to server at: http://127.0.0.1:42134/solr
[mvn] at org.apache.solr.client.solrj.impl.HttpSolrServer.request(HttpSolrServer.java:414)
[mvn] at org.apache.solr.client.solrj.impl.HttpSolrServer.request(HttpSolrServer.java:182)
[mvn] at org.apache.solr.cloud.RecoveryStrategy.sendPrepRecoveryCmd(RecoveryStrategy.java:199)
[mvn] at org.apache.solr.cloud.RecoveryStrategy.doRecovery(RecoveryStrategy.java:388)
[mvn] at org.apache.solr.cloud.RecoveryStrategy.run(RecoveryStrategy.java:220)
[mvn] Caused by: org.apache.http.conn.ConnectTimeoutException: Connect to 127.0.0.1:42134 timed out
[mvn] at org.apache.http.conn.scheme.PlainSocketFactory.connectSocket(PlainSocketFactory.java:125)
[mvn] at org.apache.http.impl.conn.DefaultClientConnectionOperator.openConnection(DefaultClientConnectionOperator.java:148)
[mvn] at org.apache.http.impl.conn.AbstractPoolEntry.open(AbstractPoolEntry.java:150)
[mvn] at org.apache.http.impl.conn.AbstractPooledConnAdapter.open(AbstractPooledConnAdapter.java:121)
[mvn] at org.apache.http.impl.client.DefaultRequestDirector.tryConnect(DefaultRequestDirector.java:575)
[mvn] at org.apache.http.impl.client.DefaultRequestDirector.execute(DefaultRequestDirector.java:425)
[mvn] at org.apache.http.impl.client.AbstractHttpClient.execute(AbstractHttpClient.java:820)
[mvn] at org.apache.http.impl.client.AbstractHttpClient.execute(AbstractHttpClient.java:754)
[mvn] at org.apache.http.impl.client.AbstractHttpClient.execute(AbstractHttpClient.java:732)
[mvn] at org.apache.solr.client.solrj.impl.HttpSolrServer.request(HttpSolrServer.java:353)
[mvn] ... 4 more
[mvn]
[mvn] 167786 T2795 C6 P42142 oasc.RecoveryStrategy.doRecovery SEVERE Recovery failed - trying again... core=collection1
[mvn] 216801 T2795 C6 P42142 oasc.SolrException.log SEVERE Error while trying to recover. core=collection1:org.apache.solr.client.solrj.SolrServerException: IOException occured when talking to server at: http://127.0.0.1:42134/solr
[mvn] at org.apache.solr.client.solrj.impl.HttpSolrServer.request(HttpSolrServer.java:414)
[mvn] at org.apache.solr.client.solrj.impl.HttpSolrServer.request(HttpSolrServer.java:182)
[mvn] at org.apache.solr.cloud.RecoveryStrategy.sendPrepRecoveryCmd(RecoveryStrategy.java:199)
[mvn] at org.apache.solr.cloud.RecoveryStrategy.doRecovery(RecoveryStrategy.java:388)
[mvn] at org.apache.solr.cloud.RecoveryStrategy.run(RecoveryStrategy.java:220)
[mvn] Caused by: org.apache.http.conn.ConnectTimeoutException: Connect to 127.0.0.1:42134 timed out
[mvn] at org.apache.http.conn.scheme.PlainSocketFactory.connectSocket(PlainSocketFactory.java:125)
[mvn] at org.apache.http.impl.conn.DefaultClientConnectionOperator.openConnection(DefaultClientConnectionOperator.java:148)
[mvn] at org.apache.http.impl.conn.AbstractPoolEntry.open(AbstractPoolEntry.java:150)
[mvn] at org.apache.http.impl.conn.AbstractPooledConnAdapter.open(AbstractPooledConnAdapter.java:121)
[mvn] at org.apache.http.impl.client.DefaultRequestDirector.tryConnect(DefaultRequestDirector.java:575)
[mvn] at org.apache.http.impl.client.DefaultRequestDirector.execute(DefaultRequestDirector.java:425)
[mvn] at org.apache.http.impl.client.AbstractHttpClient.execute(AbstractHttpClient.java:820)
[mvn] at org.apache.http.impl.client.AbstractHttpClient.execute(AbstractHttpClient.java:754)
[mvn] at org.apache.http.impl.client.AbstractHttpClient.execute(AbstractHttpClient.java:732)
[mvn] at org.apache.solr.client.solrj.impl.HttpSolrServer.request(HttpSolrServer.java:353)
[mvn] ... 4 more
[mvn]
[mvn] 216801 T2795 C6 P42142 oasc.RecoveryStrategy.doRecovery SEVERE Recovery failed - trying again... core=collection1
[mvn] / (2)
[mvn] DATA:
[mvn]
[mvn] /solr (6)
[mvn] /solr/configs (1)
[mvn] /solr/configs/conf1 (9)
[mvn] /solr/configs/conf1/mapping-ISOLatin1Accent.txt (0)
[mvn] DATA: ...supressed...
[mvn] /solr/configs/conf1/currency.xml (0)
[mvn] DATA: ...supressed...
[mvn] /solr/configs/conf1/protwords.txt (0)
[mvn] DATA: ...supressed...
[mvn] /solr/configs/conf1/synonyms.txt (0)
[mvn] DATA: ...supressed...
[mvn] /solr/configs/conf1/old_synonyms.txt (0)
[mvn] DATA: ...supressed...
[mvn] /solr/configs/conf1/solrconfig.xml (0)
[mvn] DATA: ...supressed...
[mvn] /solr/configs/conf1/stopwords.txt (0)
[mvn] DATA: ...supressed...
[mvn] /solr/configs/conf1/open-exchange-rates.json (0)
[mvn] DATA:
[mvn] {
[mvn] "disclaimer": "This data is collected from various providers and provided free of charge for informational purposes only, with no guarantee whatsoever of accuracy, validity, availability or fitness for any purpose; use at your own risk. Other than that - have fun, and please share/watch/fork if you think data like this should be free!",
[mvn] "license": "Data collected from various providers with public-facing APIs; copyright may apply; not for resale; no warranties given.",
[mvn] "timestamp": 1332070464,
[mvn] "base": "USD",
[mvn] "rates": {
[mvn] "AED": 3.6732,
[mvn] "AFN": 48.299999,
[mvn] "ALL": 105.919998,
[mvn] "AMD": 388.890015,
[mvn] "ANG": 1.79,
[mvn] "AOA": 94.769997,
[mvn] "ARS": 4.35,
[mvn] "AUD": 0.943931,
[mvn] "AWG": 1.7899,
[mvn] "AZN": 0.7863,
[mvn] "BAM": 1.48775,
[mvn] "BBD": 2,
[mvn] "BDT": 82,
[mvn] "BGN": 1.4962,
[mvn] "BHD": 0.37703,
[mvn] "BIF": 1304.170044,
[mvn] "BMD": 1,
[mvn] "BND": 1.2575,
[mvn] "BOB": 6.91,
[mvn] "BRL": 1.8003,
[mvn] "BSD": 1,
[mvn] "BTN": 50.185001,
[mvn] "BWP": 7.2307,
[mvn] "BYR": 8150,
[mvn] "BZD": 1.9135,
[mvn] "CAD": 0.9921,
[mvn] "CDF": 917.276917,
[mvn] "CHF": 0.9164,
[mvn] "CLF": 0.02146,
[mvn] "CLP": 482.75,
[mvn] "CNY": 6.3239,
[mvn] "COP": 1760,
[mvn] "CRC": 507.600006,
[mvn] "CUP": 1,
[mvn] "CVE": 84.190002,
[mvn] "CZK": 18.606001,
[mvn] "DJF": 179.490005,
[mvn] "DKK": 5.64424,
[mvn] "DOP": 39.025002,
[mvn] "DZD": 74.544998,
[mvn] "EGP": 6.0385,
[mvn] "ETB": 17.720449,
[mvn] "EUR": 0.758956,
[mvn] "FJD": 1.7734,
[mvn] "FKP": 0.6316,
[mvn] "GBP": 0.631373,
[mvn] "GEL": 1.6469,
[mvn] "GHS": 1.7455,
[mvn] "GIP": 0.63165,
[mvn] "GMD": 31.5,
[mvn] "GNF": 7100,
[mvn] "GTQ": 7.6975,
[mvn] "GYD": 203.699997,
[mvn] "HKD": 7.76306,
[mvn] "HNL": 19.055,
[mvn] "HRK": 5.7333,
[mvn] "HTG": 41,
[mvn] "HUF": 219.850006,
[mvn] "IDR": 9118,
[mvn] "IEP": 0.5978,
[mvn] "ILS": 3.7542,
[mvn] "INR": 50.165001,
[mvn] "IQD": 1165.5,
[mvn] "IRR": 12308,
[mvn] "ISK": 127.440002,
[mvn] "JMD": 86.699997,
[mvn] "JOD": 0.7095,
[mvn] "JPY": 83.445,
[mvn] "KES": 83.18,
[mvn] "KGS": 46.699402,
[mvn] "KHR": 4010.300049,
[mvn] "KMF": 373.424255,
[mvn] "KPW": 900,
[mvn] "KRW": 1125.849976,
[mvn] "KWD": 0.27925,
[mvn] "KZT": 147.690002,
[mvn] "LAK": 7993.799805,
[mvn] "LBP": 1504,
[mvn] "LKR": 125.224998,
[mvn] "LRD": 73.459999,
[mvn] "LSL": 7.5768,
[mvn] "LTL": 2.6219,
[mvn] "LVL": 0.5291,
[mvn] "LYD": 1.2572,
[mvn] "MAD": 8.4611,
[mvn] "MDL": 11.89,
[mvn] "MGA": 2155,
[mvn] "MKD": 46.705002,
[mvn] "MMK": 6.51,
[mvn] "MNT": 1322.5,
[mvn] "MOP": 7.9958,
[mvn] "MRO": 293,
[mvn] "MUR": 29.110001,
[mvn] "MVR": 15.36,
[mvn] "MWK": 165.206207,
[mvn] "MXN": 12.6745,
[mvn] "MYR": 3.0575,
[mvn] "MZN": 27.200001,
[mvn] "NAD": 7.58,
[mvn] "NGN": 157.600006,
[mvn] "NIO": 23.215,
[mvn] "NOK": 5.73163,
[mvn] "NPR": 80.620003,
[mvn] "NZD": 1.212269,
[mvn] "OMR": 0.38485,
[mvn] "PAB": 1,
[mvn] "PEN": 2.674,
[mvn] "PGK": 2.0627,
[mvn] "PHP": 43.02,
[mvn] "PKR": 90.800003,
[mvn] "PLN": 3.1285,
[mvn] "PYG": 4245,
[mvn] "QAR": 3.6415,
[mvn] "RON": 3.3256,
[mvn] "RSD": 84.100502,
[mvn] "RUB": 29.2342,
[mvn] "RWF": 606.717468,
[mvn] "SAR": 3.7505,
[mvn] "SBD": 7.075973,
[mvn] "SCR": 14.0447,
[mvn] "SDG": 2.6765,
[mvn] "SEK": 6.74525,
[mvn] "SGD": 1.258,
[mvn] "SHP": 0.63165,
[mvn] "SLL": 4364.5,
[mvn] "SOS": 1629,
[mvn] "SRD": 3.2875,
[mvn] "STD": 18650,
[mvn] "SVC": 8.7475,
[mvn] "SYP": 57.450001,
[mvn] "SZL": 7.5752,
[mvn] "THB": 30.700001,
[mvn] "TJS": 4.7588,
[mvn] "TMT": 2.85,
[mvn] "TND": 1.5178,
[mvn] "TOP": 1.693601,
[mvn] "TRY": 1.796,
[mvn] "TTD": 6.40015,
[mvn] "TWD": 29.532,
[mvn] "TZS": 1595,
[mvn] "UAH": 8.029,
[mvn] "UGX": 2481.699951,
[mvn] "USD": 1,
[mvn] "UYU": 19.469999,
[mvn] "UZS": 1835.75,
[mvn] "VEF": 4.295,
[mvn] "VND": 20820,
[mvn] "VUV": 90.199997,
[mvn] "WST": 2.247475,
[mvn] "XAF": 497.898987,
[mvn] "XCD": 2.7,
[mvn] "XDR": 0.652794,
[mvn] "XOF": 498.399994,
[mvn] "XPF": 90.639999,
[mvn] "YER": 216.005005,
[mvn] "ZAR": 7.5688,
[mvn] "ZMK": 5271.5,
[mvn] "ZWD": 378.700012,
[mvn] "ZWL": 322.355011
[mvn] }
[mvn] }
[mvn] /solr/configs/conf1/schema.xml (0)
[mvn] DATA: ...supressed...
[mvn] /solr/live_nodes (4)
[mvn] /solr/live_nodes/127.0.0.1:42142_solr (0)
[mvn] /solr/live_nodes/127.0.0.1:42132_solr (0)
[mvn] /solr/live_nodes/127.0.0.1:42130_solr (0)
[mvn] /solr/live_nodes/127.0.0.1:42137_solr (0)
[mvn] /solr/overseer (3)
[mvn] DATA:
[mvn]
[mvn] /solr/overseer/queue (0)
[mvn] DATA:
[mvn]
[mvn] /solr/overseer/queue-work (0)
[mvn] DATA:
[mvn]
[mvn] /solr/overseer/collection-queue-work (0)
[mvn] DATA:
[mvn]
[mvn] /solr/overseer_elect (2)
[mvn] /solr/overseer_elect/election (4)
[mvn] /solr/overseer_elect/election/88334628946903046-127.0.0.1:42142_solr-n_0000000004 (0)
[mvn] /solr/overseer_elect/election/88334628946903042-127.0.0.1:42130_solr-n_0000000000 (0)
[mvn] /solr/overseer_elect/election/88334628946903045-127.0.0.1:42137_solr-n_0000000003 (0)
[mvn] /solr/overseer_elect/election/88334628946903043-127.0.0.1:42132_solr-n_0000000001 (0)
[mvn] /solr/overseer_elect/leader (0)
[mvn] DATA:
[mvn] {"id":"88334628946903042-127.0.0.1:42130_solr-n_0000000000"}
[mvn] /solr/collections (2)
[mvn] /solr/collections/collection1 (3)
[mvn] DATA:
[mvn] {"configName":"conf1"}
[mvn] /solr/collections/collection1/shards (0)
[mvn] /solr/collections/collection1/leader_elect (2)
[mvn] /solr/collections/collection1/leader_elect/shard1 (1)
[mvn] /solr/collections/collection1/leader_elect/shard1/election (2)
[mvn] /solr/collections/collection1/leader_elect/shard1/election/88334628946903045-127.0.0.1:42137_solr_collection1-n_0000000001 (0)
[mvn] /solr/collections/collection1/leader_elect/shard1/election/88334628946903043-127.0.0.1:42132_solr_collection1-n_0000000000 (0)
[mvn] /solr/collections/collection1/leader_elect/shard2 (1)
[mvn] /solr/collections/collection1/leader_elect/shard2/election (1)
[mvn] /solr/collections/collection1/leader_elect/shard2/election/88334628946903046-127.0.0.1:42142_solr_collection1-n_0000000004 (0)
[mvn] /solr/collections/collection1/leaders (1)
[mvn] /solr/collections/collection1/leaders/shard1 (0)
[mvn] DATA:
[mvn] {
[mvn] "core":"collection1",
[mvn] "node_name":"127.0.0.1:42132_solr",
[mvn] "base_url":"http://127.0.0.1:42132/solr"}
[mvn] /solr/collections/control_collection (3)
[mvn] DATA:
[mvn] {"configName":"conf1"}
[mvn] /solr/collections/control_collection/shards (0)
[mvn] /solr/collections/control_collection/leader_elect (1)
[mvn] /solr/collections/control_collection/leader_elect/control_shard (1)
[mvn] /solr/collections/control_collection/leader_elect/control_shard/election (1)
[mvn] /solr/collections/control_collection/leader_elect/control_shard/election/88334628946903042-127.0.0.1:42130_solr_collection1-n_0000000000 (0)
[mvn] /solr/collections/control_collection/leaders (1)
[mvn] /solr/collections/control_collection/leaders/control_shard (0)
[mvn] DATA:
[mvn] {
[mvn] "core":"collection1",
[mvn] "node_name":"127.0.0.1:42130_solr",
[mvn] "base_url":"http://127.0.0.1:42130/solr"}
[mvn] /solr/clusterstate.json (0)
[mvn] DATA:
[mvn] {
[mvn] "collection1":{
[mvn] "shard1":{
[mvn] "127.0.0.1:42132_solr_collection1":{
[mvn] "shard":"shard1",
[mvn] "roles":null,
[mvn] "leader":"true",
[mvn] "state":"active",
[mvn] "core":"collection1",
[mvn] "collection":"collection1",
[mvn] "node_name":"127.0.0.1:42132_solr",
[mvn] "base_url":"http://127.0.0.1:42132/solr"},
[mvn] "127.0.0.1:42137_solr_collection1":{
[mvn] "shard":"shard1",
[mvn] "roles":null,
[mvn] "state":"active",
[mvn] "core":"collection1",
[mvn] "collection":"collection1",
[mvn] "node_name":"127.0.0.1:42137_solr",
[mvn] "base_url":"http://127.0.0.1:42137/solr"}},
[mvn] "shard2":{
[mvn] "127.0.0.1:42134_solr_collection1":{
[mvn] "shard":"shard2",
[mvn] "roles":null,
[mvn] "state":"active",
[mvn] "core":"collection1",
[mvn] "collection":"collection1",
[mvn] "node_name":"127.0.0.1:42134_solr",
[mvn] "base_url":"http://127.0.0.1:42134/solr"},
[mvn] "127.0.0.1:42142_solr_collection1":{
[mvn] "shard":"shard2",
[mvn] "roles":null,
[mvn] "state":"recovering",
[mvn] "core":"collection1",
[mvn] "collection":"collection1",
[mvn] "node_name":"127.0.0.1:42142_solr",
[mvn] "base_url":"http://127.0.0.1:42142/solr"}}},
[mvn] "control_collection":{"control_shard":{"127.0.0.1:42130_solr_collection1":{
[mvn] "shard":"control_shard",
[mvn] "leader":"true",
[mvn] "roles":null,
[mvn] "state":"active",
[mvn] "core":"collection1",
[mvn] "collection":"control_collection",
[mvn] "node_name":"127.0.0.1:42130_solr",
[mvn] "base_url":"http://127.0.0.1:42130/solr"}}}}
[mvn] /zookeeper (1)
[mvn] DATA:
[mvn]
[mvn]
[mvn] 269819 T2795 C6 P42142 oasc.SolrException.log SEVERE Error while trying to recover. core=collection1:org.apache.solr.client.solrj.SolrServerException: IOException occured when talking to server at: http://127.0.0.1:42134/solr
[mvn] at org.apache.solr.client.solrj.impl.HttpSolrServer.request(HttpSolrServer.java:414)
[mvn] at org.apache.solr.client.solrj.impl.HttpSolrServer.request(HttpSolrServer.java:182)
[mvn] at org.apache.solr.cloud.RecoveryStrategy.sendPrepRecoveryCmd(RecoveryStrategy.java:199)
[mvn] at org.apache.solr.cloud.RecoveryStrategy.doRecovery(RecoveryStrategy.java:388)
[mvn] at org.apache.solr.cloud.RecoveryStrategy.run(RecoveryStrategy.java:220)
[mvn] Caused by: org.apache.http.conn.ConnectTimeoutException: Connect to 127.0.0.1:42134 timed out
[mvn] at org.apache.http.conn.scheme.PlainSocketFactory.connectSocket(PlainSocketFactory.java:125)
[mvn] at org.apache.http.impl.conn.DefaultClientConnectionOperator.openConnection(DefaultClientConnectionOperator.java:148)
[mvn] at org.apache.http.impl.conn.AbstractPoolEntry.open(AbstractPoolEntry.java:150)
[mvn] at org.apache.http.impl.conn.AbstractPooledConnAdapter.open(AbstractPooledConnAdapter.java:121)
[mvn] at org.apache.http.impl.client.DefaultRequestDirector.tryConnect(DefaultRequestDirector.java:575)
[mvn] at org.apache.http.impl.client.DefaultRequestDirector.execute(DefaultRequestDirector.java:425)
[mvn] at org.apache.http.impl.client.AbstractHttpClient.execute(AbstractHttpClient.java:820)
[mvn] at org.apache.http.impl.client.AbstractHttpClient.execute(AbstractHttpClient.java:754)
[mvn] at org.apache.http.impl.client.AbstractHttpClient.execute(AbstractHttpClient.java:732)
[mvn] at org.apache.solr.client.solrj.impl.HttpSolrServer.request(HttpSolrServer.java:353)
[mvn] ... 4 more
[mvn]
[mvn] 269819 T2795 C6 P42142 oasc.RecoveryStrategy.doRecovery SEVERE Recovery failed - trying again... core=collection1
[mvn] 269820 T2795 C6 P42142 oasc.SolrException.log SEVERE Recovery failed - max retries exceeded. core=collection1
[mvn] 269820 T2795 C6 P42142 oasc.SolrException.log SEVERE Recovery failed - I give up. core=collection1
[mvn] 272034 T2795 C6 P42142 oasc.SolrException.log SEVERE Could not publish that recovery failed:org.apache.zookeeper.KeeperException$ConnectionLossException: KeeperErrorCode = ConnectionLoss for /overseer/queue/qn-
[mvn] at org.apache.zookeeper.KeeperException.create(KeeperException.java:90)
[mvn] at org.apache.zookeeper.KeeperException.create(KeeperException.java:42)
[mvn] at org.apache.zookeeper.ZooKeeper.create(ZooKeeper.java:643)
[mvn] at org.apache.solr.common.cloud.SolrZkClient$5.execute(SolrZkClient.java:256)
[mvn] at org.apache.solr.common.cloud.SolrZkClient$5.execute(SolrZkClient.java:253)
[mvn] at org.apache.solr.common.cloud.ZkCmdExecutor.retryOperation(ZkCmdExecutor.java:67)
[mvn] at org.apache.solr.common.cloud.SolrZkClient.create(SolrZkClient.java:253)
[mvn] at org.apache.solr.cloud.DistributedQueue.offer(DistributedQueue.java:236)
[mvn] at org.apache.solr.cloud.ZkController.publish(ZkController.java:867)
[mvn] at org.apache.solr.cloud.ZkController.publish(ZkController.java:838)
[mvn] at org.apache.solr.cloud.RecoveryStrategy.recoveryFailed(RecoveryStrategy.java:112)
[mvn] at org.apache.solr.cloud.RecoveryStrategy.doRecovery(RecoveryStrategy.java:466)
[mvn] at org.apache.solr.cloud.RecoveryStrategy.run(RecoveryStrategy.java:220)
[mvn]
[mvn] NOTE: reproduce with: ant test -Dtestcase=BasicDistributedZk2Test -Dtests.method=testDistribSearch -Dtests.seed=5C61D1D3E58F5990 -Dtests.locale=es_HN -Dtests.timezone=America/Indiana/Winamac -Dtests.file.encoding=ISO8859-1
[mvn] 302037 T2756 oasc.SolrException.log SEVERE Sync Failed
[mvn] NOTE: test params are: codec=Lucene40: {n_f1=Pulsing40(freqCutoff=11 minBlockSize=49 maxBlockSize=98), foo_b=PostingsFormat(name=Direct), foo_d=PostingsFormat(name=Asserting), foo_f=PostingsFormat(name=Direct), n_tl1=Pulsing40(freqCutoff=11 minBlockSize=49 maxBlockSize=98), n_d1=PostingsFormat(name=MockRandom), rnd_b=PostingsFormat(name=Asserting), intDefault=Pulsing40(freqCutoff=11 minBlockSize=49 maxBlockSize=98), n_td1=Pulsing40(freqCutoff=11 minBlockSize=49 maxBlockSize=98), id=PostingsFormat(name=Asserting), timestamp=PostingsFormat(name=MockRandom), range_facet_sl=PostingsFormat(name=Asserting), range_facet_si=PostingsFormat(name=MockRandom), oddField_s=PostingsFormat(name=Asserting), multiDefault=PostingsFormat(name=MockRandom), n_tf1=PostingsFormat(name=MockRandom), n_dt1=Pulsing40(freqCutoff=11 minBlockSize=49 maxBlockSize=98), n_ti1=PostingsFormat(name=Asserting), range_facet_l=PostingsFormat(name=MockRandom), text=PostingsFormat(name=Direct), _version_=Pulsing40(freqCutoff=11 minBlockSize=49 maxBlockSize=98), SubjectTerms_mfacet=Pulsing40(freqCutoff=11 minBlockSize=49 maxBlockSize=98), a_t=PostingsFormat(name=MockRandom), n_tdt1=Pulsing40(freqCutoff=11 minBlockSize=49 maxBlockSize=98), other_tl1=Pulsing40(freqCutoff=11 minBlockSize=49 maxBlockSize=98), n_l1=PostingsFormat(name=MockRandom), a_si=Pulsing40(freqCutoff=11 minBlockSize=49 maxBlockSize=98)}, sim=RandomSimilarityProvider(queryNorm=false,coord=no): {}, locale=es_HN, timezone=America/Indiana/Winamac
[mvn] NOTE: FreeBSD 9.0-RELEASE amd64/Sun Microsystems Inc. 1.6.0_32 (64-bit)/cpus=16,threads=2,free=145685568,total=272433152
[mvn] NOTE: All tests run in this JVM: [FullSolrCloudDistribCmdsTest, FastVectorHighlighterTest, DistributedTermsComponentTest, TestFaceting, TestHashPartitioner, TestSolrDeletionPolicy2, TestGroupingSearch, TestStressReorder, TestConfig, TestCSVResponseWriter, LegacyHTMLStripCharFilterTest, ShowFileRequestHandlerTest, SuggesterFSTTest, PrimUtilsTest, TestDFRSimilarityFactory, PathHierarchyTokenizerFactoryTest, TestReload, PeerSyncTest, NotRequiredUniqueKeyTest, MinimalSchemaTest, TestRTGBase, TestExtendedDismaxParser, DateMathParserTest, OverseerTest, BadComponentTest, TestSolrXMLSerializer, DocumentAnalysisRequestHandlerTest, PolyFieldTest, SpellingQueryConverterTest, ReturnFieldsTest, QueryEqualityTest, NumericFieldsTest, AlternateDirectoryTest, RecoveryZkTest, TestSystemIdResolver, DirectSolrSpellCheckerTest, DistributedQueryElevationComponentTest, TestDocumentBuilder, SolrCmdDistributorTest, FileBasedSpellCheckerTest, TestQuerySenderNoQuery, SpatialFilterTest, ClusterStateUpdateTest, TestRandomFaceting, PingRequestHandlerTest, SpellCheckComponentTest, SoftAutoCommitTest, TestIndexingPerformance, TestDistributedSearch, CopyFieldTest, DateFieldTest, TestValueSourceCache, TestPropInject, NoCacheHeaderTest, ZkControllerTest, TestJmxMonitoredMap, TestStressLucene, FileUtilsTest, BasicZkTest, TestFastOutputStream, TestFiltering, TestRealTimeGet, DOMUtilTest, TestBinaryField, LoggingHandlerTest, TestQueryUtils, TestBadConfig, PreAnalyzedFieldTest, TestLuceneMatchVersion, IndexSchemaRuntimeFieldTest, TestRecovery, SampleTest, DocumentBuilderTest, DirectUpdateHandlerOptimizeTest, TestSolrJ, ScriptEngineTest, DirectUpdateHandlerTest, HighlighterConfigTest, TestSolr4Spatial, FieldMutatingUpdateProcessorTest, SuggesterTSTTest, TestStressRecovery, EchoParamsTest, UpdateParamsTest, TestCSVLoader, HighlighterTest, RequiredFieldsTest, TestLMDirichletSimilarityFactory, TestPseudoReturnFields, TestFoldingMultitermQuery, TestFastLRUCache, TestQueryTypes, CoreContainerCoreInitFailuresTest, LeaderElectionIntegrationTest, TestDefaultSimilarityFactory, TermVectorComponentDistributedTest, TestCharFilters, SolrCoreCheckLockOnStartupTest, TestFastWriter, TimeZoneUtilsTest, TestTrie, SpellPossibilityIteratorTest, SuggesterWFSTTest, StatelessScriptUpdateProcessorFactoryTest, PluginInfoTest, TestPerFieldSimilarity, TestSuggestSpellingConverter, TestLFUCache, RequestHandlersTest, SimpleFacetsTest, TestCollationKeyRangeQueries, TestUtils, TestXIncludeConfig, WordBreakSolrSpellCheckerTest, TestPHPSerializedResponseWriter, TestElisionMultitermQuery, TestJoin, TestPluginEnable, DistanceFunctionTest, DisMaxRequestHandlerTest, SolrInfoMBeanTest, TestBinaryResponseWriter, TermVectorComponentTest, SimplePostToolTest, TestIndexSearcher, SuggesterTest, ConvertedLegacyTest, PrimitiveFieldTypeTest, TestSolrDeletionPolicy1, BadIndexSchemaTest, BasicFunctionalityTest, LukeRequestHandlerTest, TestOmitPositions, TestCodecSupport, OutputWriterTest, UUIDFieldTest, StatsComponentTest, IndexSchemaTest, TestArbitraryIndexDir, TestWriterPerf, TestLMJelinekMercerSimilarityFactory, TestPhraseSuggestions, DebugComponentTest, TestCoreContainer, TestCollationField, SolrIndexConfigTest, SolrCoreTest, TestReversedWildcardFilterFactory, ZkSolrClientTest, UniqFieldsUpdateProcessorFactoryTest, AnalysisAfterCoreReloadTest, TermsComponentTest, SolrPluginUtilsTest, BinaryUpdateRequestHandlerTest, TestSearchPerf, TestRemoteStreaming, CSVRequestHandlerTest, TestPropInjectDefaults, LeaderElectionTest, TestDocSet, BasicDistributedZk2Test]
[mvn] Tests run: 1, Failures: 1, Errors: 0, Skipped: 0, Time elapsed: 302.309 sec <<< FAILURE!
[mvn] Running org.apache.solr.search.TestSurroundQueryParser
[mvn] Tests run: 1, Failures: 0, Errors: 0, Skipped: 0, Time elapsed: 0.549 sec
[mvn] Running org.apache.solr.analysis.TestWordDelimiterFilterFactory
[mvn] Creating dataDir: /usr/home/hudson/hudson-slave/workspace/Lucene-Solr-Maven-4.x/maven-build/solr/core/src/test/target/test/./solrtest-TestWordDelimiterFilterFactory-1347879772864
[mvn] Tests run: 7, Failures: 0, Errors: 0, Skipped: 0, Time elapsed: 0.763 sec
[mvn] Running org.apache.solr.update.processor.SignatureUpdateProcessorFactoryTest
[mvn] Creating dataDir: /usr/home/hudson/hudson-slave/workspace/Lucene-Solr-Maven-4.x/maven-build/solr/core/src/test/target/test/./solrtest-SignatureUpdateProcessorFactoryTest-1347879773628
[mvn] Tests run: 6, Failures: 0, Errors: 0, Skipped: 0, Time elapsed: 0.817 sec
[mvn] Running org.apache.solr.search.similarities.TestBM25SimilarityFactory
[mvn] Creating dataDir: /usr/home/hudson/hudson-slave/workspace/Lucene-Solr-Maven-4.x/maven-build/solr/core/src/test/target/test/./solrtest-TestBM25SimilarityFactory-1347879774445
[mvn] Tests run: 2, Failures: 0, Errors: 0, Skipped: 0, Time elapsed: 0.096 sec
[mvn] Running org.apache.solr.core.TestJmxIntegration
[mvn] Tests run: 3, Failures: 0, Errors: 0, Skipped: 1, Time elapsed: 1.047 sec
[mvn] Running org.apache.solr.handler.component.DistributedSpellCheckComponentTest
[mvn] Tests run: 1, Failures: 0, Errors: 0, Skipped: 0, Time elapsed: 8.235 sec
[mvn] Running org.apache.solr.update.processor.DefaultValueUpdateProcessorTest
[mvn] Creating dataDir: /usr/home/hudson/hudson-slave/workspace/Lucene-Solr-Maven-4.x/maven-build/solr/core/src/test/target/test/./solrtest-DefaultValueUpdateProcessorTest-1347879783829
[mvn] Tests run: 1, Failures: 0, Errors: 0, Skipped: 0, Time elapsed: 0.411 sec
[mvn] Running org.apache.solr.servlet.SolrRequestParserTest
[mvn] Creating dataDir: /usr/home/hudson/hudson-slave/workspace/Lucene-Solr-Maven-4.x/maven-build/solr/core/src/test/target/test/./solrtest-SolrRequestParserTest-1347879784246
[mvn] Tests run: 4, Failures: 0, Errors: 0, Skipped: 0, Time elapsed: 0.747 sec
[mvn] Running org.apache.solr.cloud.TestMultiCoreConfBootstrap
[mvn] Creating dataDir: /usr/home/hudson/hudson-slave/workspace/Lucene-Solr-Maven-4.x/maven-build/solr/core/src/test/target/test/./solrtest-TestMultiCoreConfBootstrap-1347879784990
[mvn] !!!! WARNING: best effort to remove /usr/home/hudson/hudson-slave/workspace/Lucene-Solr-Maven-4.x/maven-build/solr/core/src/test/target/test/./solrtest-TestMultiCoreConfBootstrap-1347879784990 FAILED !!!!!
[mvn] Tests run: 1, Failures: 0, Errors: 0, Skipped: 0, Time elapsed: 3.436 sec
[mvn] Running org.apache.solr.schema.MultiTermTest
[mvn] Creating dataDir: /usr/home/hudson/hudson-slave/workspace/Lucene-Solr-Maven-4.x/maven-build/solr/core/src/test/target/test/./solrtest-MultiTermTest-1347879788425
[mvn] Tests run: 3, Failures: 0, Errors: 0, Skipped: 0, Time elapsed: 0.22 sec
[mvn] Running org.apache.solr.core.SOLR749Test
[mvn] Creating dataDir: /usr/home/hudson/hudson-slave/workspace/Lucene-Solr-Maven-4.x/maven-build/solr/core/src/test/target/test/./solrtest-SOLR749Test-1347879788646
[mvn] Tests run: 1, Failures: 0, Errors: 0, Skipped: 0, Time elapsed: 0.399 sec
[mvn] Running org.apache.solr.spelling.SpellCheckCollatorTest
[mvn] Creating dataDir: /usr/home/hudson/hudson-slave/workspace/Lucene-Solr-Maven-4.x/maven-build/solr/core/src/test/target/test/./solrtest-SpellCheckCollatorTest-1347879789048
[mvn] Tests run: 7, Failures: 0, Errors: 0, Skipped: 0, Time elapsed: 1.63 sec
[mvn] Running org.apache.solr.update.processor.UpdateRequestProcessorFactoryTest
[mvn] Tests run: 2, Failures: 0, Errors: 0, Skipped: 0, Time elapsed: 0.752 sec
[mvn] Running org.apache.solr.handler.admin.CoreAdminHandlerTest
[mvn] Creating dataDir: /usr/home/hudson/hudson-slave/workspace/Lucene-Solr-Maven-4.x/maven-build/solr/core/src/test/target/test/./solrtest-CoreAdminHandlerTest-1347879791429
[mvn] 685 T2976 oasc.CoreContainer.create SEVERE Unable to create core: bogus_dir_core java.io.IOException: Can't find resource 'solrconfig.xml' in classpath or '/usr/home/hudson/hudson-slave/workspace/Lucene-Solr-Maven-4.x/maven-build/solr/core/src/test/target/test-classes/solr/dir_does_not_exist_127896/conf/', cwd=/usr/home/hudson/hudson-slave/workspace/Lucene-Solr-Maven-4.x/maven-build/solr/core/src/test/target/test
[mvn] at org.apache.solr.core.SolrResourceLoader.openResource(SolrResourceLoader.java:314)
[mvn] at org.apache.solr.core.SolrResourceLoader.openConfig(SolrResourceLoader.java:280)
[mvn] at org.apache.solr.core.Config.<init>(Config.java:111)
[mvn] at org.apache.solr.core.Config.<init>(Config.java:78)
[mvn] at org.apache.solr.core.SolrConfig.<init>(SolrConfig.java:117)
[mvn] at org.apache.solr.core.CoreContainer.create(CoreContainer.java:791)
[mvn] at org.apache.solr.handler.admin.CoreAdminHandler.handleCreateAction(CoreAdminHandler.java:519)
[mvn] at org.apache.solr.handler.admin.CoreAdminHandler.handleRequestBody(CoreAdminHandler.java:142)
[mvn] at org.apache.solr.handler.admin.CoreAdminHandlerTest.testCoreAdminHandler(CoreAdminHandlerTest.java:105)
[mvn] at sun.reflect.NativeMethodAccessorImpl.invoke0(Native Method)
[mvn] at sun.reflect.NativeMethodAccessorImpl.invoke(NativeMethodAccessorImpl.java:57)
[mvn] at sun.reflect.DelegatingMethodAccessorImpl.invoke(DelegatingMethodAccessorImpl.java:43)
[mvn] at java.lang.reflect.Method.invoke(Method.java:616)
[mvn] at com.carrotsearch.randomizedtesting.RandomizedRunner.invoke(RandomizedRunner.java:1559)
[mvn] at com.carrotsearch.randomizedtesting.RandomizedRunner.access$600(RandomizedRunner.java:79)
[mvn] at com.carrotsearch.randomizedtesting.RandomizedRunner$6.evaluate(RandomizedRunner.java:737)
[mvn] at com.carrotsearch.randomizedtesting.RandomizedRunner$7.evaluate(RandomizedRunner.java:773)
[mvn] at com.carrotsearch.randomizedtesting.RandomizedRunner$8.evaluate(RandomizedRunner.java:787)
[mvn] at com.carrotsearch.randomizedtesting.rules.SystemPropertiesRestoreRule$1.evaluate(SystemPropertiesRestoreRule.java:53)
[mvn] at org.apache.lucene.util.TestRuleSetupTeardownChained$1.evaluate(TestRuleSetupTeardownChained.java:50)
[mvn] at org.apache.lucene.util.TestRuleFieldCacheSanity$1.evaluate(TestRuleFieldCacheSanity.java:51)
[mvn] at org.apache.lucene.util.AbstractBeforeAfterRule$1.evaluate(AbstractBeforeAfterRule.java:45)
[mvn] at com.carrotsearch.randomizedtesting.rules.SystemPropertiesInvariantRule$1.evaluate(SystemPropertiesInvariantRule.java:55)
[mvn] at org.apache.lucene.util.TestRuleThreadAndTestName$1.evaluate(TestRuleThreadAndTestName.java:48)
[mvn] at org.apache.lucene.util.TestRuleIgnoreAfterMaxFailures$1.evaluate(TestRuleIgnoreAfterMaxFailures.java:70)
[mvn] at org.apache.lucene.util.TestRuleMarkFailure$1.evaluate(TestRuleMarkFailure.java:48)
[mvn] at com.carrotsearch.randomizedtesting.rules.StatementAdapter.evaluate(StatementAdapter.java:36)
[mvn] at com.carrotsearch.randomizedtesting.ThreadLeakControl$StatementRunner.run(ThreadLeakControl.java:358)
[mvn] at com.carrotsearch.randomizedtesting.ThreadLeakControl.forkTimeoutingTask(ThreadLeakControl.java:782)
[mvn] at com.carrotsearch.randomizedtesting.ThreadLeakControl$3.evaluate(ThreadLeakControl.java:442)
[mvn] at com.carrotsearch.randomizedtesting.RandomizedRunner.runSingleTest(RandomizedRunner.java:746)
[mvn] at com.carrotsearch.randomizedtesting.RandomizedRunner$3.evaluate(RandomizedRunner.java:648)
[mvn] at com.carrotsearch.randomizedtesting.RandomizedRunner$4.evaluate(RandomizedRunner.java:682)
[mvn] at com.carrotsearch.randomizedtesting.RandomizedRunner$5.evaluate(RandomizedRunner.java:693)
[mvn] at com.carrotsearch.randomizedtesting.rules.StatementAdapter.evaluate(StatementAdapter.java:36)
[mvn] at com.carrotsearch.randomizedtesting.rules.SystemPropertiesRestoreRule$1.evaluate(SystemPropertiesRestoreRule.java:53)
[mvn] at org.apache.lucene.util.AbstractBeforeAfterRule$1.evaluate(AbstractBeforeAfterRule.java:45)
[mvn] at org.apache.lucene.util.TestRuleStoreClassName$1.evaluate(TestRuleStoreClassName.java:42)
[mvn] at com.carrotsearch.randomizedtesting.rules.SystemPropertiesInvariantRule$1.evaluate(SystemPropertiesInvariantRule.java:55)
[mvn] at com.carrotsearch.randomizedtesting.rules.NoShadowingOrOverridesOnMethodsRule$1.evaluate(NoShadowingOrOverridesOnMethodsRule.java:39)
[mvn] at com.carrotsearch.randomizedtesting.rules.NoShadowingOrOverridesOnMethodsRule$1.evaluate(NoShadowingOrOverridesOnMethodsRule.java:39)
[mvn] at com.carrotsearch.randomizedtesting.rules.StatementAdapter.evaluate(StatementAdapter.java:36)
[mvn] at org.apache.lucene.util.TestRuleAssertionsRequired$1.evaluate(TestRuleAssertionsRequired.java:43)
[mvn] at org.apache.lucene.util.TestRuleMarkFailure$1.evaluate(TestRuleMarkFailure.java:48)
[mvn] at org.apache.lucene.util.TestRuleIgnoreAfterMaxFailures$1.evaluate(TestRuleIgnoreAfterMaxFailures.java:70)
[mvn] at org.apache.lucene.util.TestRuleIgnoreTestSuites$1.evaluate(TestRuleIgnoreTestSuites.java:55)
[mvn] at com.carrotsearch.randomizedtesting.rules.StatementAdapter.evaluate(StatementAdapter.java:36)
[mvn] at com.carrotsearch.randomizedtesting.ThreadLeakControl$StatementRunner.run(ThreadLeakControl.java:358)
[mvn] at java.lang.Thread.run(Thread.java:679)
[mvn]
[mvn] Tests run: 1, Failures: 0, Errors: 0, Skipped: 0, Time elapsed: 0.7 sec
[mvn] Running org.apache.solr.handler.JsonLoaderTest
[mvn] Creating dataDir: /usr/home/hudson/hudson-slave/workspace/Lucene-Solr-Maven-4.x/maven-build/solr/core/src/test/target/test/./solrtest-JsonLoaderTest-1347879792130
[mvn] Tests run: 6, Failures: 0, Errors: 0, Skipped: 0, Time elapsed: 0.572 sec
[mvn] Running org.apache.solr.search.TestSolrQueryParser
[mvn] Creating dataDir: /usr/home/hudson/hudson-slave/workspace/Lucene-Solr-Maven-4.x/maven-build/solr/core/src/test/target/test/./solrtest-TestSolrQueryParser-1347879792707
[mvn] Tests run: 1, Failures: 0, Errors: 0, Skipped: 0, Time elapsed: 0.494 sec
[mvn] Running org.apache.solr.update.TestUpdate
[mvn] Creating dataDir: /usr/home/hudson/hudson-slave/workspace/Lucene-Solr-Maven-4.x/maven-build/solr/core/src/test/target/test/./solrtest-TestUpdate-1347879793201
[mvn] Tests run: 1, Failures: 0, Errors: 0, Skipped: 0, Time elapsed: 0.556 sec
[mvn] Running org.apache.solr.search.similarities.TestIBSimilarityFactory
[mvn] Creating dataDir: /usr/home/hudson/hudson-slave/workspace/Lucene-Solr-Maven-4.x/maven-build/solr/core/src/test/target/test/./solrtest-TestIBSimilarityFactory-1347879793759
[mvn] Tests run: 2, Failures: 0, Errors: 0, Skipped: 0, Time elapsed: 0.095 sec
[mvn] Running org.apache.solr.schema.OpenExchangeRatesOrgProviderTest
[mvn] Tests run: 5, Failures: 0, Errors: 0, Skipped: 0, Time elapsed: 0.056 sec
[mvn] Running org.apache.solr.handler.component.SearchHandlerTest
[mvn] Creating dataDir: /usr/home/hudson/hudson-slave/workspace/Lucene-Solr-Maven-4.x/maven-build/solr/core/src/test/target/test/./solrtest-SearchHandlerTest-1347879793911
[mvn] Tests run: 1, Failures: 0, Errors: 0, Skipped: 0, Time elapsed: 0.471 sec
[mvn] Running org.apache.solr.core.TestQuerySenderListener
[mvn] Creating dataDir: /usr/home/hudson/hudson-slave/workspace/Lucene-Solr-Maven-4.x/maven-build/solr/core/src/test/target/test/./solrtest-TestQuerySenderListener-1347879794384
[mvn] Tests run: 3, Failures: 0, Errors: 0, Skipped: 0, Time elapsed: 0.361 sec
[mvn] Running org.apache.solr.update.processor.URLClassifyProcessorTest
[mvn] Tests run: 7, Failures: 0, Errors: 0, Skipped: 0, Time elapsed: 0.236 sec
[mvn] Running org.apache.solr.cloud.BasicDistributedZkTest
[mvn] Creating dataDir: /usr/home/hudson/hudson-slave/workspace/Lucene-Solr-Maven-4.x/maven-build/solr/core/src/test/target/test/./solrtest-BasicDistributedZkTest-1347879794998
[mvn] / (2)
[mvn] DATA:
[mvn]
[mvn] /solr (6)
[mvn] /solr/configs (1)
[mvn] /solr/configs/conf1 (9)
[mvn] /solr/configs/conf1/mapping-ISOLatin1Accent.txt (0)
[mvn] DATA: ...supressed...
[mvn] /solr/configs/conf1/currency.xml (0)
[mvn] DATA: ...supressed...
[mvn] /solr/configs/conf1/protwords.txt (0)
[mvn] DATA: ...supressed...
[mvn] /solr/configs/conf1/synonyms.txt (0)
[mvn] DATA: ...supressed...
[mvn] /solr/configs/conf1/old_synonyms.txt (0)
[mvn] DATA: ...supressed...
[mvn] /solr/configs/conf1/solrconfig.xml (0)
[mvn] DATA: ...supressed...
[mvn] /solr/configs/conf1/stopwords.txt (0)
[mvn] DATA: ...supressed...
[mvn] /solr/configs/conf1/open-exchange-rates.json (0)
[mvn] DATA:
[mvn] {
[mvn] "disclaimer": "This data is collected from various providers and provided free of charge for informational purposes only, with no guarantee whatsoever of accuracy, validity, availability or fitness for any purpose; use at your own risk. Other than that - have fun, and please share/watch/fork if you think data like this should be free!",
[mvn] "license": "Data collected from various providers with public-facing APIs; copyright may apply; not for resale; no warranties given.",
[mvn] "timestamp": 1332070464,
[mvn] "base": "USD",
[mvn] "rates": {
[mvn] "AED": 3.6732,
[mvn] "AFN": 48.299999,
[mvn] "ALL": 105.919998,
[mvn] "AMD": 388.890015,
[mvn] "ANG": 1.79,
[mvn] "AOA": 94.769997,
[mvn] "ARS": 4.35,
[mvn] "AUD": 0.943931,
[mvn] "AWG": 1.7899,
[mvn] "AZN": 0.7863,
[mvn] "BAM": 1.48775,
[mvn] "BBD": 2,
[mvn] "BDT": 82,
[mvn] "BGN": 1.4962,
[mvn] "BHD": 0.37703,
[mvn] "BIF": 1304.170044,
[mvn] "BMD": 1,
[mvn] "BND": 1.2575,
[mvn] "BOB": 6.91,
[mvn] "BRL": 1.8003,
[mvn] "BSD": 1,
[mvn] "BTN": 50.185001,
[mvn] "BWP": 7.2307,
[mvn] "BYR": 8150,
[mvn] "BZD": 1.9135,
[mvn] "CAD": 0.9921,
[mvn] "CDF": 917.276917,
[mvn] "CHF": 0.9164,
[mvn] "CLF": 0.02146,
[mvn] "CLP": 482.75,
[mvn] "CNY": 6.3239,
[mvn] "COP": 1760,
[mvn] "CRC": 507.600006,
[mvn] "CUP": 1,
[mvn] "CVE": 84.190002,
[mvn] "CZK": 18.606001,
[mvn] "DJF": 179.490005,
[mvn]
[...truncated too long message...]
TF-8' encoding to copy filtered resources.
[mvn] [INFO] skip non existing resourceDirectory /usr/home/hudson/hudson-slave/workspace/Lucene-Solr-Maven-4.x/maven-build/solr/contrib/velocity/src/main/resources
[mvn] [INFO] Copying 3 resources
[mvn] [INFO] [compiler:compile {execution: default-compile}]
[mvn] [INFO] Compiling 4 source files to /usr/home/hudson/hudson-slave/workspace/Lucene-Solr-Maven-4.x/maven-build/solr/contrib/velocity/target/classes
[mvn] [INFO] [bundle:manifest {execution: bundle-manifest}]
[mvn] [debug] execute contextualize
[mvn] [INFO] [resources:testResources {execution: default-testResources}]
[mvn] [INFO] Using 'UTF-8' encoding to copy filtered resources.
[mvn] [INFO] Copying 3 resources
[mvn] [INFO] Copying 1 resource
[mvn] [INFO] Copying 3 resources
[mvn] [INFO] [compiler:testCompile {execution: default-testCompile}]
[mvn] [INFO] Compiling 1 source file to /usr/home/hudson/hudson-slave/workspace/Lucene-Solr-Maven-4.x/maven-build/solr/contrib/velocity/target/test-classes
[mvn] [INFO] [surefire:test {execution: default-test}]
[mvn] [INFO] Surefire report directory: /usr/home/hudson/hudson-slave/workspace/Lucene-Solr-Maven-4.x/maven-build/solr/contrib/velocity/target/surefire-reports
[mvn]
[mvn] -------------------------------------------------------
[mvn] T E S T S
[mvn] -------------------------------------------------------
[mvn] Running org.apache.solr.velocity.VelocityResponseWriterTest
[mvn] Creating dataDir: /usr/home/hudson/hudson-slave/workspace/Lucene-Solr-Maven-4.x/maven-build/solr/contrib/velocity/target/test/./solrtest-VelocityResponseWriterTest-1347880503126
[mvn] Tests run: 1, Failures: 0, Errors: 0, Skipped: 0, Time elapsed: 2.247 sec
[mvn]
[mvn] Results :
[mvn]
[mvn] Tests run: 1, Failures: 0, Errors: 0, Skipped: 0
[mvn]
[mvn] [INFO] [jar:jar {execution: default-jar}]
[mvn] [INFO] Building jar: /usr/home/hudson/hudson-slave/workspace/Lucene-Solr-Maven-4.x/maven-build/solr/contrib/velocity/target/solr-velocity-4.0-SNAPSHOT.jar
[mvn] [INFO] [install:install {execution: default-install}]
[mvn] [INFO] Installing /usr/home/hudson/hudson-slave/workspace/Lucene-Solr-Maven-4.x/maven-build/solr/contrib/velocity/target/solr-velocity-4.0-SNAPSHOT.jar to /home/hudson/.m2/repository/org/apache/solr/solr-velocity/4.0-SNAPSHOT/solr-velocity-4.0-SNAPSHOT.jar
[mvn] [INFO] ------------------------------------------------------------------------
[mvn] [INFO] Building Apache Solr Contrib aggregator POM
[mvn] [INFO] task-segment: [install]
[mvn] [INFO] ------------------------------------------------------------------------
[mvn] [INFO] [groovy:execute {execution: generate-timestamps}]
[mvn] [INFO] [buildnumber:create {execution: default}]
[mvn] [INFO] [enforcer:enforce {execution: enforce-java-compat-version-and-maven-2.2.1}]
[mvn] [INFO] [remote-resources:process {execution: default}]
[mvn] [INFO] [bundle:manifest {execution: bundle-manifest}]
[mvn] [WARNING] Ignoring project type pom - supportedProjectTypes = [jar, bundle]
[mvn] [INFO] [site:attach-descriptor {execution: default-attach-descriptor}]
[mvn] [INFO] [install:install {execution: default-install}]
[mvn] [INFO] Installing /usr/home/hudson/hudson-slave/workspace/Lucene-Solr-Maven-4.x/maven-build/solr/contrib/pom.xml to /home/hudson/.m2/repository/org/apache/solr/solr-contrib-aggregator/4.0-SNAPSHOT/solr-contrib-aggregator-4.0-SNAPSHOT.pom
[mvn] [INFO]
[mvn] [INFO]
[mvn] [INFO] ------------------------------------------------------------------------
[mvn] [INFO] Reactor Summary:
[mvn] [INFO] ------------------------------------------------------------------------
[mvn] [INFO] Grandparent POM for Apache Lucene Core and Apache Solr SUCCESS [8.043s]
[mvn] [INFO] Lucene parent POM ..................................... SUCCESS [0.089s]
[mvn] [INFO] Lucene Core ........................................... SUCCESS [14.535s]
[mvn] [INFO] Lucene codecs ......................................... SUCCESS [3.366s]
[mvn] [INFO] Lucene Test Framework ................................. SUCCESS [5.193s]
[mvn] [INFO] Lucene Core tests ..................................... SUCCESS [4:29.167s]
[mvn] [INFO] Lucene Core aggregator POM ............................ SUCCESS [0.093s]
[mvn] [INFO] Lucene codecs tests ................................... SUCCESS [3.128s]
[mvn] [INFO] Lucene codecs aggregator POM .......................... SUCCESS [0.058s]
[mvn] [INFO] Lucene Common Analyzers ............................... SUCCESS [1:59.547s]
[mvn] [INFO] Lucene ICU Analysis Components ........................ SUCCESS [11.989s]
[mvn] [INFO] Lucene Kuromoji Japanese Morphological Analyzer ....... SUCCESS [29.019s]
[mvn] [INFO] Lucene Morfologik Polish Lemmatizer ................... SUCCESS [3.978s]
[mvn] [INFO] Lucene Phonetic Filters ............................... SUCCESS [19.732s]
[mvn] [INFO] Lucene Smart Chinese Analyzer ......................... SUCCESS [9.727s]
[mvn] [INFO] Lucene Stempel Analyzer ............................... SUCCESS [6.976s]
[mvn] [INFO] Lucene UIMA Analysis Components ....................... SUCCESS [18.480s]
[mvn] [INFO] Lucene Analysis Modules aggregator POM ................ SUCCESS [0.089s]
[mvn] [INFO] Lucene Queries ........................................ SUCCESS [10.751s]
[mvn] [INFO] Lucene Sandbox ........................................ SUCCESS [7.371s]
[mvn] [INFO] Lucene QueryParsers ................................... SUCCESS [16.388s]
[mvn] [INFO] Lucene Memory ......................................... SUCCESS [9.121s]
[mvn] [INFO] Lucene Highlighter .................................... SUCCESS [7.695s]
[mvn] [INFO] Lucene Facets ......................................... SUCCESS [59.675s]
[mvn] [INFO] Lucene Benchmark ...................................... SUCCESS [25.115s]
[mvn] [INFO] Lucene Demo ........................................... SUCCESS [3.715s]
[mvn] [INFO] Lucene Grouping ....................................... SUCCESS [20.152s]
[mvn] [INFO] Lucene Join ........................................... SUCCESS [14.101s]
[mvn] [INFO] Lucene Miscellaneous .................................. SUCCESS [7.644s]
[mvn] [INFO] Lucene Spatial ........................................ SUCCESS [13.837s]
[mvn] [INFO] Lucene Suggest ........................................ SUCCESS [15.876s]
[mvn] [INFO] Apache Solr parent POM ................................ SUCCESS [0.100s]
[mvn] [INFO] Apache Solr Solrj ..................................... SUCCESS [4.686s]
[mvn] [INFO] Apache Solr Core ...................................... SUCCESS [13.292s]
[mvn] [INFO] Apache Solr Test Framework ............................ SUCCESS [4.377s]
[mvn] [INFO] Apache Solr Core tests ................................ FAILED [19:47.568s]
[mvn] [INFO] Apache Solr Core aggregator POM ....................... SUCCESS [0.085s]
[mvn] [INFO] Apache Solr Solrj tests ............................... SUCCESS [3:47.061s]
[mvn] [INFO] Apache Solr Solrj aggregator POM ...................... SUCCESS [0.080s]
[mvn] [INFO] Apache Solr Search Server ............................. SUCCESS [5.165s]
[mvn] [INFO] Apache Solr Analysis Extras ........................... SUCCESS [8.281s]
[mvn] [INFO] Apache Solr Clustering ................................ SUCCESS [15.279s]
[mvn] [INFO] Apache Solr DataImportHandler ......................... SUCCESS [1:33.747s]
[mvn] [INFO] Apache Solr DataImportHandler Extras .................. SUCCESS [6.994s]
[mvn] [INFO] Apache Solr Content Extraction Library ................ SUCCESS [10.388s]
[mvn] [INFO] Apache Solr Language Identifier ....................... SUCCESS [7.897s]
[mvn] [INFO] Apache Solr UIMA integration .......................... SUCCESS [33.521s]
[mvn] [INFO] Apache Solr Velocity .................................. SUCCESS [5.196s]
[mvn] [INFO] Apache Solr Contrib aggregator POM .................... SUCCESS [0.077s]
[mvn] [INFO] ------------------------------------------------------------------------
[mvn] [INFO] Error for project: Apache Solr Core tests (during install)
[mvn] [INFO] ------------------------------------------------------------------------
[mvn] [INFO] There are test failures.
[mvn]
[mvn] Please refer to /usr/home/hudson/hudson-slave/workspace/Lucene-Solr-Maven-4.x/maven-build/solr/core/src/test/target/surefire-reports for the individual test results.
[mvn] [INFO] ------------------------------------------------------------------------
[mvn] [INFO] For more information, run Maven with the -e switch
[mvn] [INFO] ------------------------------------------------------------------------
[mvn] [INFO] BUILD ERRORS
[mvn] [INFO] ------------------------------------------------------------------------
[mvn] [INFO] Total time: 39 minutes 19 seconds
[mvn] [INFO] Finished at: Mon Sep 17 11:15:05 UTC 2012
[mvn] [INFO] Final Memory: 289M/2048M
[mvn] [INFO] ------------------------------------------------------------------------
BUILD FAILED
/usr/home/hudson/hudson-slave/workspace/Lucene-Solr-Maven-4.x/build.xml:159: The following error occurred while executing this line:
/usr/home/hudson/hudson-slave/workspace/Lucene-Solr-Maven-4.x/extra-targets.xml:56: Java returned: 1
Total time: 39 minutes 25 seconds
Build step 'Invoke Ant' marked build as failure
Recording test results
Email was triggered for: Failure
Sending email for trigger: Failure