You are viewing a plain text version of this content. The canonical link for it is here.
Posted to yarn-dev@hadoop.apache.org by Apache Jenkins Server <je...@builds.apache.org> on 2015/05/21 01:45:21 UTC
Failed: YARN-3051 PreCommit Build #8034
Jira: https://issues.apache.org/jira/browse/YARN-3051
Build: https://builds.apache.org/job/PreCommit-YARN-Build/8034/
###################################################################################
########################## LAST 60 LINES OF THE CONSOLE ###########################
[...truncated 364 lines...]
| Found reliance on default encoding in org.apache.hadoop.yarn.server.timelineservice.storage.FileSystemTimelineReaderImpl.getEntity(String, String, String, String, Collection, Collection, Long, Long, EnumSet):in org.apache.hadoop.yarn.server.timelineservice.storage.FileSystemTimelineReaderImpl.getEntity(String, String, String, String, Collection, Collection, Long, Long, EnumSet): new java.io.FileReader(File) At FileSystemTimelineReaderImpl.java:[line 68]
FindBugs | module:hadoop-yarn-common
| Inconsistent synchronization of org.apache.hadoop.yarn.api.protocolrecords.impl.pb.AllocateResponsePBImpl.builder; locked 92% of time Unsynchronized access at AllocateResponsePBImpl.java:92% of time Unsynchronized access at AllocateResponsePBImpl.java:[line 391]
| Inconsistent synchronization of org.apache.hadoop.yarn.api.protocolrecords.impl.pb.AllocateResponsePBImpl.proto; locked 94% of time Unsynchronized access at AllocateResponsePBImpl.java:94% of time Unsynchronized access at AllocateResponsePBImpl.java:[line 391]
| Inconsistent synchronization of org.apache.hadoop.yarn.api.protocolrecords.impl.pb.AllocateResponsePBImpl.viaProto; locked 94% of time Unsynchronized access at AllocateResponsePBImpl.java:94% of time Unsynchronized access at AllocateResponsePBImpl.java:[line 391]
FindBugs | module:hadoop-yarn-api
| org.apache.hadoop.yarn.api.records.timelineservice.TimelineMetric$1.compare(Long, Long) negates the return value of Long.compareTo(Long) At TimelineMetric.java:value of Long.compareTo(Long) At TimelineMetric.java:[line 47]
|| Subsystem || Report/Notes ||
============================================================================
| Patch URL | http://issues.apache.org/jira/secure/attachment/12734255/YARN-3051-YARN-2928.03.patch |
| Optional Tests | shellcheck javadoc javac unit findbugs checkstyle |
| git revision | YARN-2928 / 463e070 |
| javadoc | /home/jenkins/jenkins-slave/workspace/PreCommit-YARN-Build/patchprocess/diffJavadocWarnings.txt |
| Release Audit | /home/jenkins/jenkins-slave/workspace/PreCommit-YARN-Build/patchprocess/patchReleaseAuditProblems.txt |
| checkstyle | /home/jenkins/jenkins-slave/workspace/PreCommit-YARN-Build/patchprocess/diffcheckstylehadoop-yarn-api.txt |
| whitespace | /home/jenkins/jenkins-slave/workspace/PreCommit-YARN-Build/patchprocess/whitespace.txt |
| Findbugs warnings | /home/jenkins/jenkins-slave/workspace/PreCommit-YARN-Build/patchprocess/newPatchFindbugsWarningshadoop-yarn-server-timelineservice.html |
| Findbugs warnings | /home/jenkins/jenkins-slave/workspace/PreCommit-YARN-Build/patchprocess/newPatchFindbugsWarningshadoop-yarn-common.html |
| Findbugs warnings | /home/jenkins/jenkins-slave/workspace/PreCommit-YARN-Build/patchprocess/newPatchFindbugsWarningshadoop-yarn-api.html |
| hadoop-yarn-api test log | /home/jenkins/jenkins-slave/workspace/PreCommit-YARN-Build/patchprocess/testrun_hadoop-yarn-api.txt |
| hadoop-yarn-common test log | /home/jenkins/jenkins-slave/workspace/PreCommit-YARN-Build/patchprocess/testrun_hadoop-yarn-common.txt |
| hadoop-yarn-server-timelineservice test log | /home/jenkins/jenkins-slave/workspace/PreCommit-YARN-Build/patchprocess/testrun_hadoop-yarn-server-timelineservice.txt |
| Test Results | https://builds.apache.org/job/PreCommit-YARN-Build/8034/testReport/ |
| Java | 1.7.0_55 |
| uname | Linux asf906.gq1.ygridcore.net 3.13.0-36-lowlatency #63-Ubuntu SMP PREEMPT Wed Sep 3 21:56:12 UTC 2014 x86_64 x86_64 x86_64 GNU/Linux |
============================================================================
============================================================================
Adding comment to JIRA
============================================================================
============================================================================
Comment added.
e27c33eb4061edce35ead9441084af1725b7fcea logged out
============================================================================
============================================================================
Finished build.
============================================================================
============================================================================
Build step 'Execute shell' marked build as failure
Archiving artifacts
Sending artifact delta relative to PreCommit-YARN-Build #8033
Archived 47 artifacts
Archive block size is 32768
Received 55 blocks and 25709476 bytes
Compression is 6.6%
Took 5.8 sec
[description-setter] Could not determine description.
Recording test results
Email was triggered for: Failure
Sending email for trigger: Failure
###################################################################################
############################## FAILED TESTS (if any) ##############################
All tests passed
Success: YARN-3655 PreCommit Build #8037
Posted by Apache Jenkins Server <je...@builds.apache.org>.
Jira: https://issues.apache.org/jira/browse/YARN-3655
Build: https://builds.apache.org/job/PreCommit-YARN-Build/8037/
###################################################################################
########################## LAST 60 LINES OF THE CONSOLE ###########################
[...truncated 263 lines...]
| | | | messages.
| +1 | release audit | 0m 23s | The applied patch does not increase
| | | | the total number of release audit
| | | | warnings.
| +1 | checkstyle | 0m 48s | There were no new checkstyle
| | | | issues.
| +1 | whitespace | 0m 1s | The patch has no lines that end in
| | | | whitespace.
| +1 | install | 1m 35s | mvn install still works.
| +1 | eclipse:eclipse | 0m 33s | The patch built with
| | | | eclipse:eclipse.
| +1 | findbugs | 1m 16s | The patch does not introduce any
| | | | new Findbugs (version 3.0.0)
| | | | warnings.
| +1 | yarn tests | 50m 22s | Tests passed in
| | | | hadoop-yarn-server-resourcemanager.
| | | 87m 39s |
|| Subsystem || Report/Notes ||
============================================================================
| Patch URL | http://issues.apache.org/jira/secure/attachment/12734328/YARN-3655.002.patch |
| Optional Tests | javadoc javac unit findbugs checkstyle |
| git revision | trunk / fb6b38d |
| hadoop-yarn-server-resourcemanager test log | /home/jenkins/jenkins-slave/workspace/PreCommit-YARN-Build/patchprocess/testrun_hadoop-yarn-server-resourcemanager.txt |
| Test Results | https://builds.apache.org/job/PreCommit-YARN-Build/8037/testReport/ |
| Java | 1.7.0_55 |
| uname | Linux asf903.gq1.ygridcore.net 3.13.0-36-lowlatency #63-Ubuntu SMP PREEMPT Wed Sep 3 21:56:12 UTC 2014 x86_64 x86_64 x86_64 GNU/Linux |
============================================================================
============================================================================
Adding comment to JIRA
============================================================================
============================================================================
Comment added.
1326bfa65366947874af684e2dd99b902c715782 logged out
============================================================================
============================================================================
Finished build.
============================================================================
============================================================================
Archiving artifacts
Sending artifact delta relative to PreCommit-YARN-Build #8033
Archived 24 artifacts
Archive block size is 32768
Received 25 blocks and 12140853 bytes
Compression is 6.3%
Took 4 sec
Description set: YARN-3655
Recording test results
Email was triggered for: Success
Sending email for trigger: Success
###################################################################################
############################## FAILED TESTS (if any) ##############################
All tests passed
Failed: YARN-3645 PreCommit Build #8036
Posted by Apache Jenkins Server <je...@builds.apache.org>.
Jira: https://issues.apache.org/jira/browse/YARN-3645
Build: https://builds.apache.org/job/PreCommit-YARN-Build/8036/
###################################################################################
########################## LAST 60 LINES OF THE CONSOLE ###########################
[...truncated 271 lines...]
| | | | warnings.
| -1 | checkstyle | 1m 14s | The applied patch generated 5 new
| | | | checkstyle issues (total was 27, now
| | | | 28).
| +1 | whitespace | 0m 0s | The patch has no lines that end in
| | | | whitespace.
| +1 | install | 1m 35s | mvn install still works.
| +1 | eclipse:eclipse | 0m 38s | The patch built with
| | | | eclipse:eclipse.
| +1 | findbugs | 1m 16s | The patch does not introduce any
| | | | new Findbugs (version 3.0.0)
| | | | warnings.
| +1 | yarn tests | 50m 8s | Tests passed in
| | | | hadoop-yarn-server-resourcemanager.
| | | 87m 14s |
|| Subsystem || Report/Notes ||
============================================================================
| Patch URL | http://issues.apache.org/jira/secure/attachment/12734306/YARN-3645.1.patch |
| Optional Tests | javadoc javac unit findbugs checkstyle |
| git revision | trunk / 6329bd0 |
| checkstyle | /home/jenkins/jenkins-slave/workspace/PreCommit-YARN-Build/patchprocess/diffcheckstylehadoop-yarn-server-resourcemanager.txt |
| hadoop-yarn-server-resourcemanager test log | /home/jenkins/jenkins-slave/workspace/PreCommit-YARN-Build/patchprocess/testrun_hadoop-yarn-server-resourcemanager.txt |
| Test Results | https://builds.apache.org/job/PreCommit-YARN-Build/8036/testReport/ |
| Java | 1.7.0_55 |
| uname | Linux asf907.gq1.ygridcore.net 3.13.0-36-lowlatency #63-Ubuntu SMP PREEMPT Wed Sep 3 21:56:12 UTC 2014 x86_64 x86_64 x86_64 GNU/Linux |
============================================================================
============================================================================
Adding comment to JIRA
============================================================================
============================================================================
Comment added.
f8d884d16453a23a1adda0e1e2ca22df35ff5fff logged out
============================================================================
============================================================================
Finished build.
============================================================================
============================================================================
Build step 'Execute shell' marked build as failure
Archiving artifacts
Sending artifact delta relative to PreCommit-YARN-Build #8033
Archived 25 artifacts
Archive block size is 32768
Received 25 blocks and 12290752 bytes
Compression is 6.2%
Took 4.5 sec
[description-setter] Could not determine description.
Recording test results
Email was triggered for: Failure
Sending email for trigger: Failure
###################################################################################
############################## FAILED TESTS (if any) ##############################
All tests passed
Failed: YARN-3609 PreCommit Build #8035
Posted by Apache Jenkins Server <je...@builds.apache.org>.
Jira: https://issues.apache.org/jira/browse/YARN-3609
Build: https://builds.apache.org/job/PreCommit-YARN-Build/8035/
###################################################################################
########################## LAST 60 LINES OF THE CONSOLE ###########################
[...truncated 107 lines...]
startRMs(rm1, confForRM1, rm2, confForRM2);
}
error: patch failed: hadoop-yarn-project/hadoop-yarn/hadoop-yarn-server/hadoop-yarn-server-resourcemanager/src/test/java/org/apache/hadoop/yarn/server/resourcemanager/RMHATestBase.java:106
error: hadoop-yarn-project/hadoop-yarn/hadoop-yarn-server/hadoop-yarn-server-resourcemanager/src/test/java/org/apache/hadoop/yarn/server/resourcemanager/RMHATestBase.java: patch does not apply
Checking patch hadoop-yarn-project/hadoop-yarn/hadoop-yarn-server/hadoop-yarn-server-resourcemanager/src/test/java/org/apache/hadoop/yarn/server/resourcemanager/TestRMHAForNodeLabels.java...
error: hadoop-yarn-project/hadoop-yarn/hadoop-yarn-server/hadoop-yarn-server-resourcemanager/src/test/java/org/apache/hadoop/yarn/server/resourcemanager/TestRMHAForNodeLabels.java: already exists in working directory
PATCH APPLICATION FAILED
Elapsed time: 0m 0s
-1 overall
| Vote | Subsystem | Runtime | Comment
============================================================================
| -1 | patch | 0m 0s | The patch command could not apply the
| | | | patch during dryrun.
|| Subsystem || Report/Notes ||
============================================================================
| Patch URL | http://issues.apache.org/jira/secure/attachment/12734279/YARN-3609.3.branch-2.7.patch |
| Optional Tests | javadoc javac unit findbugs checkstyle |
| git revision | trunk / 8966d42 |
============================================================================
============================================================================
Adding comment to JIRA
============================================================================
============================================================================
Comment added.
487865eefb5b6f81253d188e2b4b2021237a1f37 logged out
============================================================================
============================================================================
Finished build.
============================================================================
============================================================================
Build step 'Execute shell' marked build as failure
Archiving artifacts
Sending artifact delta relative to PreCommit-YARN-Build #8033
Archived 3 artifacts
Archive block size is 32768
Received 0 blocks and 134177 bytes
Compression is 0.0%
Took 1.5 sec
[description-setter] Could not determine description.
Recording test results
Email was triggered for: Failure
Sending email for trigger: Failure
###################################################################################
############################## FAILED TESTS (if any) ##############################
No tests ran.