You are viewing a plain text version of this content. The canonical link for it is here.
Posted to builds@beam.apache.org by Apache Jenkins Server <je...@builds.apache.org> on 2022/02/23 11:48:07 UTC

Build failed in Jenkins: beam_PostCommit_Java_VR_Dataflow_V2_Streaming #1802

See <https://ci-beam.apache.org/job/beam_PostCommit_Java_VR_Dataflow_V2_Streaming/1802/display/redirect?page=changes>

Changes:

[Kyle Weaver] [BEAM-13796] projection pushdown in BQ IO

[Kyle Weaver] [BEAM-13796] Move test to ReadTest class and correct javadoc for

[Kyle Weaver] [BEAM-13796] Pushdown is not supported on TypedRead#fromQuery.

[noreply] Palo Alto case study (#16915)


------------------------------------------
[...truncated 52.75 KB...]
    result = func(*args)
  File "/usr/lib/python3.8/urllib/request.py", line 649, in http_error_default
    raise HTTPError(req.full_url, code, msg, hdrs, fp)
urllib.error.HTTPError: HTTP Error 502: Bad Gateway
ERROR:root:Invalid url for grpc-protobuf-lite-1.43.2: https://opensource.org/licenses/Apache-2.0. Retrying...
Traceback (most recent call last):
  File "<https://ci-beam.apache.org/job/beam_PostCommit_Java_VR_Dataflow_V2_Streaming/ws/src/sdks/java/container/license_scripts/pull_licenses_java.py",> line 58, in pull_from_url
    url_read = urlopen(url)
  File "/usr/lib/python3.8/urllib/request.py", line 222, in urlopen
    return opener.open(url, data, timeout)
  File "/usr/lib/python3.8/urllib/request.py", line 531, in open
    response = meth(req, response)
  File "/usr/lib/python3.8/urllib/request.py", line 640, in http_response
    response = self.parent.error(
  File "/usr/lib/python3.8/urllib/request.py", line 563, in error
    result = self._call_chain(*args)
  File "/usr/lib/python3.8/urllib/request.py", line 502, in _call_chain
    result = func(*args)
  File "/usr/lib/python3.8/urllib/request.py", line 755, in http_error_302
    return self.parent.open(new, timeout=req.timeout)
  File "/usr/lib/python3.8/urllib/request.py", line 531, in open
    response = meth(req, response)
  File "/usr/lib/python3.8/urllib/request.py", line 640, in http_response
    response = self.parent.error(
  File "/usr/lib/python3.8/urllib/request.py", line 569, in error
    return self._call_chain(*args)
  File "/usr/lib/python3.8/urllib/request.py", line 502, in _call_chain
    result = func(*args)
  File "/usr/lib/python3.8/urllib/request.py", line 649, in http_error_default
    raise HTTPError(req.full_url, code, msg, hdrs, fp)
urllib.error.HTTPError: HTTP Error 502: Bad Gateway
ERROR:root:Invalid url for checker-compat-qual-2.5.3: http://opensource.org/licenses/MIT. Retrying...

> Task :release:go-licenses:java:dockerRun
+ rm -rf '/output/*'
+ export GO111MODULE=off
+ GO111MODULE=off
+ go get github.com/apache/beam/sdks/java/container

> Task :sdks:java:io:google-cloud-platform:compileJava

> Task :sdks:java:container:pullLicenses
Traceback (most recent call last):
  File "<https://ci-beam.apache.org/job/beam_PostCommit_Java_VR_Dataflow_V2_Streaming/ws/src/sdks/java/container/license_scripts/pull_licenses_java.py",> line 58, in pull_from_url
    url_read = urlopen(url)
  File "/usr/lib/python3.8/urllib/request.py", line 222, in urlopen
    return opener.open(url, data, timeout)
  File "/usr/lib/python3.8/urllib/request.py", line 531, in open
    response = meth(req, response)
  File "/usr/lib/python3.8/urllib/request.py", line 640, in http_response
    response = self.parent.error(
  File "/usr/lib/python3.8/urllib/request.py", line 563, in error
    result = self._call_chain(*args)
  File "/usr/lib/python3.8/urllib/request.py", line 502, in _call_chain
    result = func(*args)
  File "/usr/lib/python3.8/urllib/request.py", line 755, in http_error_302
    return self.parent.open(new, timeout=req.timeout)
  File "/usr/lib/python3.8/urllib/request.py", line 531, in open
    response = meth(req, response)
  File "/usr/lib/python3.8/urllib/request.py", line 640, in http_response
    response = self.parent.error(
  File "/usr/lib/python3.8/urllib/request.py", line 563, in error
    result = self._call_chain(*args)
  File "/usr/lib/python3.8/urllib/request.py", line 502, in _call_chain
    result = func(*args)
  File "/usr/lib/python3.8/urllib/request.py", line 755, in http_error_302
    return self.parent.open(new, timeout=req.timeout)
  File "/usr/lib/python3.8/urllib/request.py", line 531, in open
    response = meth(req, response)
  File "/usr/lib/python3.8/urllib/request.py", line 640, in http_response
    response = self.parent.error(
  File "/usr/lib/python3.8/urllib/request.py", line 569, in error
    return self._call_chain(*args)
  File "/usr/lib/python3.8/urllib/request.py", line 502, in _call_chain
    result = func(*args)
  File "/usr/lib/python3.8/urllib/request.py", line 649, in http_error_default
    raise HTTPError(req.full_url, code, msg, hdrs, fp)
urllib.error.HTTPError: HTTP Error 502: Bad Gateway
ERROR:root:Invalid url for pcollections-2.1.2: http://www.opensource.org/licenses/mit-license.php. Retrying...
INFO:root:Replaced local file URL with file://<https://ci-beam.apache.org/job/beam_PostCommit_Java_VR_Dataflow_V2_Streaming/ws/src/sdks/java/container/license_scripts/manual_licenses/xz/COPYING> for xz-1.5
INFO:root:pull_licenses_java.py succeed. It took 54.502256 seconds with 16 threads.
Copying licenses from <https://ci-beam.apache.org/job/beam_PostCommit_Java_VR_Dataflow_V2_Streaming/ws/src/sdks/java/container/build/target/java_third_party_licenses> to <https://ci-beam.apache.org/job/beam_PostCommit_Java_VR_Dataflow_V2_Streaming/ws/src/sdks/java/container/build/target/third_party_licenses.>
Finished license_scripts.sh

> Task :sdks:java:container:java8:copyJavaThirdPartyLicenses

> Task :release:go-licenses:java:dockerRun
+ go-licenses save github.com/apache/beam/sdks/java/container --save_path=/output/licenses
+ go-licenses csv github.com/apache/beam/sdks/java/container
+ tee /output/licenses/list.csv
github.com/apache/beam/sdks/java/container,https://github.com/apache/beam/blob/master/LICENSE,Apache-2.0
github.com/apache/beam/sdks/go/pkg/beam,https://github.com/apache/beam/blob/master/sdks/go/README.md,Apache-2.0
golang.org/x/sys,https://go.googlesource.com/sys/+/refs/heads/master/LICENSE,BSD-3-Clause
google.golang.org/grpc,https://github.com/grpc/grpc-go/blob/master/LICENSE,Apache-2.0
golang.org/x/net,https://go.googlesource.com/net/+/refs/heads/master/LICENSE,BSD-3-Clause
github.com/golang/protobuf,https://github.com/golang/protobuf/blob/master/LICENSE,BSD-3-Clause
google.golang.org/protobuf,https://go.googlesource.com/protobuf/+/refs/heads/master/LICENSE,BSD-3-Clause
google.golang.org/genproto/googleapis/rpc/status,https://github.com/googleapis/go-genproto/blob/master/LICENSE,Apache-2.0
golang.org/x/text,https://go.googlesource.com/text/+/refs/heads/master/LICENSE,BSD-3-Clause
+ chmod -R a+w /output/licenses

> Task :release:go-licenses:java:createLicenses
> Task :sdks:java:container:java8:copyGolangLicenses
> Task :sdks:java:container:java8:dockerPrepare
> Task :sdks:java:container:java8:docker

> Task :runners:google-cloud-dataflow-java:buildAndPushDockerJavaContainer
WARNING: `gcloud docker` will not be supported for Docker client versions above 18.03.

As an alternative, use `gcloud auth configure-docker` to configure `docker` to
use `gcloud` as a credential helper, then use `docker` as you would for non-GCR
registries, e.g. `docker pull gcr.io/project-id/my-image`. Add
`--verbosity=error` to silence this warning: `gcloud docker
--verbosity=error -- pull gcr.io/project-id/my-image`.

See: https://cloud.google.com/container-registry/docs/support/deprecation-notices#gcloud-docker

The push refers to repository [us.gcr.io/apache-beam-testing/java-postcommit-it/java]
17600828e53c: Preparing
0282f940b057: Preparing
9a5d07a6b4a9: Preparing
62e75b4eabb8: Preparing
63e7cc3cccfb: Preparing
e2429c1d178b: Preparing
54ea1928145c: Preparing
d626385dd0c1: Preparing
35d18d0160ce: Preparing
ad6636a933bd: Preparing
6e8e604d32a3: Preparing
606a8c942c84: Preparing
0a6322aa4418: Preparing
f53ed9ea8a10: Preparing
6be21046fcff: Preparing
1e5fdc3d671c: Preparing
613ab28cf833: Preparing
bed676ceab7a: Preparing
6398d5cccd2c: Preparing
0b0f2f2f5279: Preparing
e2429c1d178b: Waiting
f53ed9ea8a10: Waiting
bed676ceab7a: Waiting
6be21046fcff: Waiting
6398d5cccd2c: Waiting
d626385dd0c1: Waiting
35d18d0160ce: Waiting
54ea1928145c: Waiting
0a6322aa4418: Waiting
ad6636a933bd: Waiting
606a8c942c84: Waiting
6e8e604d32a3: Waiting
63e7cc3cccfb: Pushed
0282f940b057: Pushed
9a5d07a6b4a9: Pushed
d626385dd0c1: Pushed
17600828e53c: Pushed
e2429c1d178b: Pushed
62e75b4eabb8: Pushed
ad6636a933bd: Pushed
606a8c942c84: Pushed
f53ed9ea8a10: Layer already exists
35d18d0160ce: Pushed
6be21046fcff: Layer already exists
1e5fdc3d671c: Layer already exists
613ab28cf833: Layer already exists
54ea1928145c: Pushed
bed676ceab7a: Layer already exists
6398d5cccd2c: Layer already exists
0b0f2f2f5279: Layer already exists
0a6322aa4418: Pushed
6e8e604d32a3: Pushed
20220223060116: digest: sha256:f53335dedffb6cb94c4857f5dc0807a91fcea1239411fe74c77c5ed61cea6e69 size: 4520

> Task :sdks:java:io:google-cloud-platform:compileJava
Note: Some input files use or override a deprecated API.
Note: Recompile with -Xlint:deprecation for details.
Note: Some input files use unchecked or unsafe operations.
Note: Recompile with -Xlint:unchecked for details.

> Task :sdks:java:io:google-cloud-platform:classes
> Task :sdks:java:io:google-cloud-platform:jar
> Task :runners:google-cloud-dataflow-java:compileJava
> Task :sdks:java:io:google-cloud-platform:compileTestJava
Note: Some input files use or override a deprecated API.
Note: Recompile with -Xlint:deprecation for details.
Note: Some input files use unchecked or unsafe operations.
Note: Recompile with -Xlint:unchecked for details.

> Task :sdks:java:io:google-cloud-platform:testClasses
> Task :sdks:java:io:google-cloud-platform:testJar

> Task :runners:google-cloud-dataflow-java:compileJava
Note: Some input files use or override a deprecated API.
Note: Recompile with -Xlint:deprecation for details.
Note: Some input files use unchecked or unsafe operations.
Note: Recompile with -Xlint:unchecked for details.

> Task :runners:google-cloud-dataflow-java:classes
> Task :runners:google-cloud-dataflow-java:jar

> Task :runners:google-cloud-dataflow-java:compileTestJava
Note: Some input files use or override a deprecated API.
Note: Recompile with -Xlint:deprecation for details.
Note: Some input files use unchecked or unsafe operations.
Note: Recompile with -Xlint:unchecked for details.

> Task :runners:google-cloud-dataflow-java:testClasses
> Task :runners:google-cloud-dataflow-java:testJar
> Task :runners:google-cloud-dataflow-java:validatesRunnerV2TestStreaming

org.apache.beam.sdk.transforms.ParDoSchemaTest > testSchemaConversionPipeline FAILED
    java.lang.RuntimeException at ParDoSchemaTest.java:474

org.apache.beam.sdk.transforms.ParDoTest$StateTests > testValueStateDedup FAILED
    java.lang.RuntimeException at ParDoTest.java:2330

246 tests completed, 2 failed, 3 skipped

> Task :runners:google-cloud-dataflow-java:validatesRunnerV2TestStreaming FAILED

FAILURE: Build failed with an exception.

* What went wrong:
Execution failed for task ':runners:google-cloud-dataflow-java:validatesRunnerV2TestStreaming'.
> There were failing tests. See the report at: file://<https://ci-beam.apache.org/job/beam_PostCommit_Java_VR_Dataflow_V2_Streaming/ws/src/runners/google-cloud-dataflow-java/build/reports/tests/validatesRunnerV2TestStreaming/index.html>

* Try:
> Run with --stacktrace option to get the stack trace.
> Run with --info or --debug option to get more log output.
> Run with --scan to get full insights.

* Get more help at https://help.gradle.org

Deprecated Gradle features were used in this build, making it incompatible with Gradle 8.0.

You can use '--warning-mode all' to show the individual deprecation warnings and determine if they come from your own scripts or plugins.

See https://docs.gradle.org/7.3.2/userguide/command_line_interface.html#sec:command_line_warnings

Execution optimizations have been disabled for 1 invalid unit(s) of work during this build to ensure correctness.
Please consult deprecation warnings for more details.

BUILD FAILED in 5h 47m 34s
135 actionable tasks: 89 executed, 42 from cache, 4 up-to-date

Publishing build scan...
https://gradle.com/s/fifnaav27viqe

Build step 'Invoke Gradle script' changed build result to FAILURE
Build step 'Invoke Gradle script' marked build as failure

---------------------------------------------------------------------
To unsubscribe, e-mail: builds-unsubscribe@beam.apache.org
For additional commands, e-mail: builds-help@beam.apache.org


Build failed in Jenkins: beam_PostCommit_Java_VR_Dataflow_V2_Streaming #1803

Posted by Apache Jenkins Server <je...@builds.apache.org>.
See <https://ci-beam.apache.org/job/beam_PostCommit_Java_VR_Dataflow_V2_Streaming/1803/display/redirect>

Changes:


------------------------------------------
[...truncated 78.74 KB...]
    java.lang.RuntimeException at ReshuffleTest.java:173

org.apache.beam.sdk.transforms.ParDoSchemaTest > testNestedSchema FAILED
    java.lang.RuntimeException at ParDoSchemaTest.java:513

org.apache.beam.sdk.transforms.FlattenTest > testFlattenMultipleCoders FAILED
    java.lang.RuntimeException at FlattenTest.java:189

org.apache.beam.sdk.testing.PAssertTest > testContainsInAnyOrderNotSerializable FAILED
    java.lang.RuntimeException at PAssertTest.java:189

org.apache.beam.sdk.transforms.SplittableDoFnTest > testSideInputUnbounded FAILED
    java.lang.RuntimeException at SplittableDoFnTest.java:451

org.apache.beam.sdk.transforms.windowing.WindowingTest > testPartitioningWindowing FAILED
    java.lang.RuntimeException at WindowingTest.java:127

org.apache.beam.sdk.transforms.GroupByKeyTest > org.apache.beam.sdk.transforms.GroupByKeyTest$BasicTests.testTimestampCombinerEarliest FAILED
    java.lang.RuntimeException at GroupByKeyTest.java:494

org.apache.beam.sdk.transforms.ReshuffleTest > testReshuffleAfterFixedWindows FAILED
    java.lang.RuntimeException at ReshuffleTest.java:235

org.apache.beam.sdk.transforms.ParDoTest$TimerTests > testOutputTimestampDefaultBounded FAILED
    java.lang.RuntimeException at ParDoTest.java:4314

org.apache.beam.sdk.testing.PAssertTest > testSerializablePredicate FAILED
    java.lang.RuntimeException at PAssertTest.java:210

org.apache.beam.sdk.transforms.FlattenTest > testFlattenPCollectionsThenParDo FAILED
    java.lang.RuntimeException at FlattenTest.java:123

org.apache.beam.sdk.transforms.GroupByKeyTest > org.apache.beam.sdk.transforms.GroupByKeyTest$BasicTests.testGroupByKey FAILED
    java.lang.RuntimeException at GroupByKeyTest.java:146

org.apache.beam.sdk.transforms.ReshuffleTest > testReshuffleAfterFixedWindowsAndGroupByKey FAILED
    java.lang.RuntimeException at ReshuffleTest.java:194

org.apache.beam.sdk.transforms.ParDoTest$TimerTests > testEventTimeTimerAbsolute FAILED
    java.lang.RuntimeException at ParDoTest.java:4116

org.apache.beam.sdk.transforms.FlattenTest > testFlattenMultiplePCollectionsHavingMultipleConsumers FAILED
    java.lang.RuntimeException at FlattenTest.java:352

org.apache.beam.sdk.testing.PAssertTest > testNotEqualTo FAILED
    java.lang.RuntimeException at PAssertTest.java:370

org.apache.beam.sdk.transforms.ReshuffleTest > testReshuffleAfterSlidingWindows FAILED
    java.lang.RuntimeException at ReshuffleTest.java:255

org.apache.beam.sdk.transforms.GroupByKeyTest > org.apache.beam.sdk.transforms.GroupByKeyTest$BasicTests.testGroupByKeyWithBadEqualsHashCode FAILED
    java.lang.RuntimeException at GroupByKeyTest.java:571

org.apache.beam.sdk.testing.PAssertTest > testGlobalWindowContainsInAnyOrder FAILED
    java.lang.RuntimeException at PAssertTest.java:433

org.apache.beam.sdk.transforms.ParDoTest$TimerTests > testTimerReceivedInOriginalWindow FAILED
    java.lang.RuntimeException at ParDoTest.java:4082

org.apache.beam.sdk.transforms.FlattenTest > testFlattenWithDifferentInputAndOutputCoders FAILED
    java.lang.RuntimeException at FlattenTest.java:374

org.apache.beam.sdk.transforms.ReshuffleTest > testReshufflePreservesTimestamps FAILED
    java.lang.RuntimeException at ReshuffleTest.java:152

org.apache.beam.sdk.transforms.ParDoTest$StateCoderInferenceTests > testCombiningStateCoderInference FAILED
    java.lang.RuntimeException at ParDoTest.java:3799

org.apache.beam.sdk.testing.PAssertTest > testPAssertThatFlattenedFalse FAILED
    java.lang.AssertionError at PAssertTest.java:652

org.apache.beam.sdk.transforms.ParDoTest$TimerTests > testEventTimeTimerBounded FAILED
    java.lang.RuntimeException at ParDoTest.java:3963

org.apache.beam.sdk.transforms.FlattenTest > testFlattenIterables FAILED
    java.lang.RuntimeException at FlattenTest.java:257

org.apache.beam.sdk.transforms.ReshuffleTest > testReshuffleAfterSlidingWindowsAndGroupByKey FAILED
    java.lang.RuntimeException at ReshuffleTest.java:215

org.apache.beam.sdk.testing.PAssertTest > testEmptyFalseDefaultReasonString FAILED
    java.lang.AssertionError at PAssertTest.java:528

org.apache.beam.sdk.transforms.ParDoTest$StateCoderInferenceTests > testBagStateCoderInference FAILED
    java.lang.RuntimeException at ParDoTest.java:3498

org.apache.beam.sdk.transforms.ParDoTest$TimerTests > testOutOfBoundsProcessingTimeTimerHold FAILED
    java.lang.RuntimeException at ParDoTest.java:4399

org.apache.beam.sdk.transforms.FlattenTest > testFlattenIterablesSets FAILED
    java.lang.RuntimeException at FlattenTest.java:285

org.apache.beam.sdk.testing.PAssertTest > testPAssertThatListSatisfiesMultipleMatchersFalse FAILED
    java.lang.AssertionError at PAssertTest.java:762

org.apache.beam.sdk.transforms.ReshuffleTest > testJustReshuffle FAILED
    java.lang.RuntimeException at ReshuffleTest.java:106

org.apache.beam.sdk.transforms.ReifyTimestampsTest > extractFromValuesWhenValueTimestampedLaterSucceeds FAILED
    java.lang.RuntimeException at ReifyTimestampsTest.java:128

org.apache.beam.sdk.transforms.ParDoTest$TimerTests > testEventTimeTimerAlignBounded FAILED
    java.lang.RuntimeException at ParDoTest.java:4037

org.apache.beam.sdk.transforms.ParDoTest$MultipleInputsAndOutputTests > testParDoWithOnlyTaggedOutput FAILED
    java.lang.RuntimeException at ParDoTest.java:806

org.apache.beam.sdk.testing.PAssertTest > testContainsInAnyOrderWithMatchers FAILED
    java.lang.RuntimeException at PAssertTest.java:424

org.apache.beam.sdk.transforms.ViewTest > testMapAsEntrySetSideInput FAILED
    java.lang.RuntimeException at ViewTest.java:1020

org.apache.beam.sdk.transforms.ReifyTimestampsTest > extractFromValuesSucceeds FAILED
    java.lang.RuntimeException at ReifyTimestampsTest.java:92

org.apache.beam.sdk.transforms.ParDoTest$TimerTests > testEventTimeTimerLoop FAILED
    java.lang.RuntimeException at ParDoTest.java:4165

org.apache.beam.sdk.transforms.ParDoTest$MultipleInputsAndOutputTests > testMultiOutputChaining FAILED
    java.lang.RuntimeException at ParDoTest.java:1446

org.apache.beam.sdk.testing.PAssertTest > testAssertionSiteIsCapturedWithoutMessage FAILED
    java.lang.AssertionError at PAssertTest.java:570

org.apache.beam.sdk.transforms.ViewTest > testMultimapSideInput FAILED
    java.lang.RuntimeException at ViewTest.java:586

org.apache.beam.sdk.transforms.ReifyTimestampsTest > inValuesSucceeds FAILED
    java.lang.RuntimeException at ReifyTimestampsTest.java:60

org.apache.beam.sdk.transforms.ParDoTest$MultipleInputsAndOutputTests > testMultiOutputParDoWithSideInputs FAILED
    java.lang.RuntimeException at ParDoTest.java:1239

org.apache.beam.sdk.transforms.ParDoTest$TimerTests > testGbkFollowedByUserTimers FAILED
    java.lang.RuntimeException at ParDoTest.java:4002

org.apache.beam.sdk.testing.PAssertTest > testWindowedSerializablePredicate FAILED
    java.lang.RuntimeException at PAssertTest.java:244

org.apache.beam.sdk.transforms.ViewTest > testEmptyIterableSideInput FAILED
    java.lang.RuntimeException at ViewTest.java:513

org.apache.beam.sdk.transforms.join.CoGroupByKeyTest > testCoGroupByKey FAILED
    java.lang.RuntimeException at CoGroupByKeyTest.java:296

org.apache.beam.sdk.transforms.ParDoTest$MultipleInputsAndOutputTests > testSideInputsWithMultipleWindows FAILED
    java.lang.RuntimeException at ParDoTest.java:1325

org.apache.beam.sdk.transforms.ParDoTest$TimerTests > testOutOfBoundsEventTimeTimerHold FAILED
    java.lang.RuntimeException at ParDoTest.java:4356

org.apache.beam.sdk.testing.PAssertTest > testWindowedIsEqualTo FAILED
    java.lang.RuntimeException at PAssertTest.java:361

org.apache.beam.sdk.transforms.ViewTest > testSideInputWithNestedIterables FAILED
    java.lang.RuntimeException at ViewTest.java:1583

org.apache.beam.sdk.transforms.join.CoGroupByKeyTest > testCoGroupByKeyGetOnly FAILED
    java.lang.RuntimeException at CoGroupByKeyTest.java:139

org.apache.beam.sdk.transforms.ParDoTest$MultipleInputsAndOutputTests > testParDoEmptyWithTaggedOutput FAILED
    java.lang.RuntimeException at ParDoTest.java:753

org.apache.beam.sdk.transforms.ParDoTest$TimerTests > testOutOfBoundsEventTimeTimer FAILED
    java.lang.RuntimeException at ParDoTest.java:4270

org.apache.beam.sdk.testing.PAssertTest > testContainsInAnyOrderFalse FAILED
    java.lang.AssertionError at PAssertTest.java:495

org.apache.beam.sdk.transforms.join.CoGroupByKeyTest > testCoGroupByKeyHandleResults FAILED
    java.lang.RuntimeException at CoGroupByKeyTest.java:466

org.apache.beam.sdk.transforms.ViewTest > testListSideInput FAILED
    java.lang.RuntimeException at ViewTest.java:284

org.apache.beam.sdk.transforms.ParDoTest$TimerTests > testEventTimeTimerMultipleKeys FAILED
    java.lang.RuntimeException at ParDoTest.java:4230

org.apache.beam.sdk.transforms.ParDoTest$MultipleInputsAndOutputTests > testParDoWithTaggedOutput FAILED
    java.lang.RuntimeException at ParDoTest.java:711

org.apache.beam.sdk.transforms.ViewTest > testMapSideInput FAILED
    java.lang.RuntimeException at ViewTest.java:988

org.apache.beam.sdk.transforms.join.CoGroupByKeyTest > testCoGroupByKeyWithWindowing FAILED
    java.lang.RuntimeException at CoGroupByKeyTest.java:494

org.apache.beam.sdk.transforms.ParDoTest$TimerTests > testPipelineOptionsParameterOnTimer FAILED
    java.lang.RuntimeException at ParDoTest.java:4845

org.apache.beam.sdk.transforms.ParDoTest$MultipleInputsAndOutputTests > testMultiOutputParDoWithSideInputsIsCumulative FAILED
    java.lang.RuntimeException at ParDoTest.java:1277

org.apache.beam.sdk.transforms.ViewTest > testWindowedSideInputFixedToFixedWithDefault FAILED
    java.lang.RuntimeException at ViewTest.java:1499
FATAL: command execution failed
java.io.IOException: Backing channel 'apache-beam-jenkins-14' is disconnected.
	at hudson.remoting.RemoteInvocationHandler.channelOrFail(RemoteInvocationHandler.java:216)
	at hudson.remoting.RemoteInvocationHandler.invoke(RemoteInvocationHandler.java:286)
	at com.sun.proxy.$Proxy126.isAlive(Unknown Source)
	at hudson.Launcher$RemoteLauncher$ProcImpl.isAlive(Launcher.java:1213)
	at hudson.Launcher$RemoteLauncher$ProcImpl.join(Launcher.java:1205)
	at hudson.Launcher$ProcStarter.join(Launcher.java:522)
	at hudson.plugins.gradle.Gradle.perform(Gradle.java:317)
	at hudson.tasks.BuildStepMonitor$1.perform(BuildStepMonitor.java:20)
	at hudson.model.AbstractBuild$AbstractBuildExecution.perform(AbstractBuild.java:806)
	at hudson.model.Build$BuildExecution.build(Build.java:198)
	at hudson.model.Build$BuildExecution.doRun(Build.java:163)
	at hudson.model.AbstractBuild$AbstractBuildExecution.run(AbstractBuild.java:514)
	at hudson.model.Run.execute(Run.java:1888)
	at hudson.model.FreeStyleBuild.run(FreeStyleBuild.java:43)
	at hudson.model.ResourceController.execute(ResourceController.java:99)
	at hudson.model.Executor.run(Executor.java:432)
Caused by: java.io.IOException: Unexpected termination of the channel
	at hudson.remoting.SynchronousCommandTransport$ReaderThread.run(SynchronousCommandTransport.java:75)
Caused by: java.io.EOFException
	at java.io.ObjectInputStream$PeekInputStream.readFully(ObjectInputStream.java:2799)
	at java.io.ObjectInputStream$BlockDataInputStream.readShort(ObjectInputStream.java:3274)
	at java.io.ObjectInputStream.readStreamHeader(ObjectInputStream.java:934)
	at java.io.ObjectInputStream.<init>(ObjectInputStream.java:396)
	at hudson.remoting.ObjectInputStreamEx.<init>(ObjectInputStreamEx.java:49)
	at hudson.remoting.Command.readFrom(Command.java:142)
	at hudson.remoting.Command.readFrom(Command.java:128)
	at hudson.remoting.AbstractSynchronousByteArrayCommandTransport.read(AbstractSynchronousByteArrayCommandTransport.java:35)
	at hudson.remoting.SynchronousCommandTransport$ReaderThread.run(SynchronousCommandTransport.java:61)
Build step 'Invoke Gradle script' changed build result to FAILURE
Build step 'Invoke Gradle script' marked build as failure
FATAL: Channel "hudson.remoting.Channel@42d8a66a:apache-beam-jenkins-14": Remote call on apache-beam-jenkins-14 failed. The channel is closing down or has closed down
java.io.EOFException
	at java.io.ObjectInputStream$PeekInputStream.readFully(ObjectInputStream.java:2799)
	at java.io.ObjectInputStream$BlockDataInputStream.readShort(ObjectInputStream.java:3274)
	at java.io.ObjectInputStream.readStreamHeader(ObjectInputStream.java:934)
	at java.io.ObjectInputStream.<init>(ObjectInputStream.java:396)
	at hudson.remoting.ObjectInputStreamEx.<init>(ObjectInputStreamEx.java:49)
	at hudson.remoting.Command.readFrom(Command.java:142)
	at hudson.remoting.Command.readFrom(Command.java:128)
	at hudson.remoting.AbstractSynchronousByteArrayCommandTransport.read(AbstractSynchronousByteArrayCommandTransport.java:35)
	at hudson.remoting.SynchronousCommandTransport$ReaderThread.run(SynchronousCommandTransport.java:61)
Caused: java.io.IOException: Unexpected termination of the channel
	at hudson.remoting.SynchronousCommandTransport$ReaderThread.run(SynchronousCommandTransport.java:75)
Caused: hudson.remoting.ChannelClosedException: Channel "hudson.remoting.Channel@42d8a66a:apache-beam-jenkins-14": Remote call on apache-beam-jenkins-14 failed. The channel is closing down or has closed down
	at hudson.remoting.Channel.call(Channel.java:994)
	at hudson.Launcher$RemoteLauncher.kill(Launcher.java:1148)
	at hudson.model.AbstractBuild$AbstractBuildExecution.run(AbstractBuild.java:526)
	at hudson.model.Run.execute(Run.java:1888)
	at hudson.model.FreeStyleBuild.run(FreeStyleBuild.java:43)
	at hudson.model.ResourceController.execute(ResourceController.java:99)
	at hudson.model.Executor.run(Executor.java:432)

---------------------------------------------------------------------
To unsubscribe, e-mail: builds-unsubscribe@beam.apache.org
For additional commands, e-mail: builds-help@beam.apache.org


Jenkins build is back to normal : beam_PostCommit_Java_VR_Dataflow_V2_Streaming #1805

Posted by Apache Jenkins Server <je...@builds.apache.org>.
See <https://ci-beam.apache.org/job/beam_PostCommit_Java_VR_Dataflow_V2_Streaming/1805/display/redirect?page=changes>


---------------------------------------------------------------------
To unsubscribe, e-mail: builds-unsubscribe@beam.apache.org
For additional commands, e-mail: builds-help@beam.apache.org


beam_PostCommit_Java_VR_Dataflow_V2_Streaming - Build # 1804 - Aborted!

Posted by Apache Jenkins Server <je...@builds.apache.org>.
beam_PostCommit_Java_VR_Dataflow_V2_Streaming - Build # 1804 - Aborted:

Check console output at https://ci-beam.apache.org/job/beam_PostCommit_Java_VR_Dataflow_V2_Streaming/1804/ to view the results.