You are viewing a plain text version of this content. The canonical link for it is here.
Posted to dev@lucene.apache.org by Policeman Jenkins Server <je...@thetaphi.de> on 2019/06/23 02:48:09 UTC
[JENKINS-EA] Lucene-Solr-8.x-Linux (64bit/jdk-13-ea+26) - Build #
749 - Still Unstable!
Build: https://jenkins.thetaphi.de/job/Lucene-Solr-8.x-Linux/749/
Java: 64bit/jdk-13-ea+26 -XX:-UseCompressedOops -XX:+UseSerialGC
8 tests failed.
FAILED: org.apache.solr.update.processor.ParsingFieldUpdateProcessorsTest.testParseFloatNonRootLocale
Error Message:
Stack Trace:
java.lang.AssertionError
at __randomizedtesting.SeedInfo.seed([AEB3D98A69A59B49:B56F245BC9006754]:0)
at org.junit.Assert.fail(Assert.java:86)
at org.junit.Assert.assertTrue(Assert.java:41)
at org.junit.Assert.assertTrue(Assert.java:52)
at org.apache.solr.update.processor.ParsingFieldUpdateProcessorsTest.testParseFloatNonRootLocale(ParsingFieldUpdateProcessorsTest.java:471)
at java.base/jdk.internal.reflect.NativeMethodAccessorImpl.invoke0(Native Method)
at java.base/jdk.internal.reflect.NativeMethodAccessorImpl.invoke(NativeMethodAccessorImpl.java:62)
at java.base/jdk.internal.reflect.DelegatingMethodAccessorImpl.invoke(DelegatingMethodAccessorImpl.java:43)
at java.base/java.lang.reflect.Method.invoke(Method.java:567)
at com.carrotsearch.randomizedtesting.RandomizedRunner.invoke(RandomizedRunner.java:1750)
at com.carrotsearch.randomizedtesting.RandomizedRunner$8.evaluate(RandomizedRunner.java:938)
at com.carrotsearch.randomizedtesting.RandomizedRunner$9.evaluate(RandomizedRunner.java:974)
at com.carrotsearch.randomizedtesting.RandomizedRunner$10.evaluate(RandomizedRunner.java:988)
at com.carrotsearch.randomizedtesting.rules.SystemPropertiesRestoreRule$1.evaluate(SystemPropertiesRestoreRule.java:57)
at org.apache.lucene.util.TestRuleSetupTeardownChained$1.evaluate(TestRuleSetupTeardownChained.java:49)
at org.apache.lucene.util.AbstractBeforeAfterRule$1.evaluate(AbstractBeforeAfterRule.java:45)
at org.apache.lucene.util.TestRuleThreadAndTestName$1.evaluate(TestRuleThreadAndTestName.java:48)
at org.apache.lucene.util.TestRuleIgnoreAfterMaxFailures$1.evaluate(TestRuleIgnoreAfterMaxFailures.java:64)
at org.apache.lucene.util.TestRuleMarkFailure$1.evaluate(TestRuleMarkFailure.java:47)
at com.carrotsearch.randomizedtesting.rules.StatementAdapter.evaluate(StatementAdapter.java:36)
at com.carrotsearch.randomizedtesting.ThreadLeakControl$StatementRunner.run(ThreadLeakControl.java:368)
at com.carrotsearch.randomizedtesting.ThreadLeakControl.forkTimeoutingTask(ThreadLeakControl.java:817)
at com.carrotsearch.randomizedtesting.ThreadLeakControl$3.evaluate(ThreadLeakControl.java:468)
at com.carrotsearch.randomizedtesting.RandomizedRunner.runSingleTest(RandomizedRunner.java:947)
at com.carrotsearch.randomizedtesting.RandomizedRunner$5.evaluate(RandomizedRunner.java:832)
at com.carrotsearch.randomizedtesting.RandomizedRunner$6.evaluate(RandomizedRunner.java:883)
at com.carrotsearch.randomizedtesting.RandomizedRunner$7.evaluate(RandomizedRunner.java:894)
at com.carrotsearch.randomizedtesting.rules.StatementAdapter.evaluate(StatementAdapter.java:36)
at com.carrotsearch.randomizedtesting.rules.SystemPropertiesRestoreRule$1.evaluate(SystemPropertiesRestoreRule.java:57)
at org.apache.lucene.util.AbstractBeforeAfterRule$1.evaluate(AbstractBeforeAfterRule.java:45)
at com.carrotsearch.randomizedtesting.rules.StatementAdapter.evaluate(StatementAdapter.java:36)
at org.apache.lucene.util.TestRuleStoreClassName$1.evaluate(TestRuleStoreClassName.java:41)
at com.carrotsearch.randomizedtesting.rules.NoShadowingOrOverridesOnMethodsRule$1.evaluate(NoShadowingOrOverridesOnMethodsRule.java:40)
at com.carrotsearch.randomizedtesting.rules.NoShadowingOrOverridesOnMethodsRule$1.evaluate(NoShadowingOrOverridesOnMethodsRule.java:40)
at com.carrotsearch.randomizedtesting.rules.StatementAdapter.evaluate(StatementAdapter.java:36)
at com.carrotsearch.randomizedtesting.rules.StatementAdapter.evaluate(StatementAdapter.java:36)
at org.apache.lucene.util.TestRuleAssertionsRequired$1.evaluate(TestRuleAssertionsRequired.java:53)
at org.apache.lucene.util.TestRuleMarkFailure$1.evaluate(TestRuleMarkFailure.java:47)
at org.apache.lucene.util.TestRuleIgnoreAfterMaxFailures$1.evaluate(TestRuleIgnoreAfterMaxFailures.java:64)
at org.apache.lucene.util.TestRuleIgnoreTestSuites$1.evaluate(TestRuleIgnoreTestSuites.java:54)
at com.carrotsearch.randomizedtesting.rules.StatementAdapter.evaluate(StatementAdapter.java:36)
at com.carrotsearch.randomizedtesting.ThreadLeakControl$StatementRunner.run(ThreadLeakControl.java:368)
at java.base/java.lang.Thread.run(Thread.java:830)
FAILED: org.apache.solr.update.processor.ParsingFieldUpdateProcessorsTest.testParseDoubleNonRootLocale
Error Message:
Stack Trace:
java.lang.AssertionError
at __randomizedtesting.SeedInfo.seed([AEB3D98A69A59B49:B948146D6DDDF1AB]:0)
at org.junit.Assert.fail(Assert.java:86)
at org.junit.Assert.assertTrue(Assert.java:41)
at org.junit.Assert.assertTrue(Assert.java:52)
at org.apache.solr.update.processor.ParsingFieldUpdateProcessorsTest.testParseDoubleNonRootLocale(ParsingFieldUpdateProcessorsTest.java:573)
at java.base/jdk.internal.reflect.NativeMethodAccessorImpl.invoke0(Native Method)
at java.base/jdk.internal.reflect.NativeMethodAccessorImpl.invoke(NativeMethodAccessorImpl.java:62)
at java.base/jdk.internal.reflect.DelegatingMethodAccessorImpl.invoke(DelegatingMethodAccessorImpl.java:43)
at java.base/java.lang.reflect.Method.invoke(Method.java:567)
at com.carrotsearch.randomizedtesting.RandomizedRunner.invoke(RandomizedRunner.java:1750)
at com.carrotsearch.randomizedtesting.RandomizedRunner$8.evaluate(RandomizedRunner.java:938)
at com.carrotsearch.randomizedtesting.RandomizedRunner$9.evaluate(RandomizedRunner.java:974)
at com.carrotsearch.randomizedtesting.RandomizedRunner$10.evaluate(RandomizedRunner.java:988)
at com.carrotsearch.randomizedtesting.rules.SystemPropertiesRestoreRule$1.evaluate(SystemPropertiesRestoreRule.java:57)
at org.apache.lucene.util.TestRuleSetupTeardownChained$1.evaluate(TestRuleSetupTeardownChained.java:49)
at org.apache.lucene.util.AbstractBeforeAfterRule$1.evaluate(AbstractBeforeAfterRule.java:45)
at org.apache.lucene.util.TestRuleThreadAndTestName$1.evaluate(TestRuleThreadAndTestName.java:48)
at org.apache.lucene.util.TestRuleIgnoreAfterMaxFailures$1.evaluate(TestRuleIgnoreAfterMaxFailures.java:64)
at org.apache.lucene.util.TestRuleMarkFailure$1.evaluate(TestRuleMarkFailure.java:47)
at com.carrotsearch.randomizedtesting.rules.StatementAdapter.evaluate(StatementAdapter.java:36)
at com.carrotsearch.randomizedtesting.ThreadLeakControl$StatementRunner.run(ThreadLeakControl.java:368)
at com.carrotsearch.randomizedtesting.ThreadLeakControl.forkTimeoutingTask(ThreadLeakControl.java:817)
at com.carrotsearch.randomizedtesting.ThreadLeakControl$3.evaluate(ThreadLeakControl.java:468)
at com.carrotsearch.randomizedtesting.RandomizedRunner.runSingleTest(RandomizedRunner.java:947)
at com.carrotsearch.randomizedtesting.RandomizedRunner$5.evaluate(RandomizedRunner.java:832)
at com.carrotsearch.randomizedtesting.RandomizedRunner$6.evaluate(RandomizedRunner.java:883)
at com.carrotsearch.randomizedtesting.RandomizedRunner$7.evaluate(RandomizedRunner.java:894)
at com.carrotsearch.randomizedtesting.rules.StatementAdapter.evaluate(StatementAdapter.java:36)
at com.carrotsearch.randomizedtesting.rules.SystemPropertiesRestoreRule$1.evaluate(SystemPropertiesRestoreRule.java:57)
at org.apache.lucene.util.AbstractBeforeAfterRule$1.evaluate(AbstractBeforeAfterRule.java:45)
at com.carrotsearch.randomizedtesting.rules.StatementAdapter.evaluate(StatementAdapter.java:36)
at org.apache.lucene.util.TestRuleStoreClassName$1.evaluate(TestRuleStoreClassName.java:41)
at com.carrotsearch.randomizedtesting.rules.NoShadowingOrOverridesOnMethodsRule$1.evaluate(NoShadowingOrOverridesOnMethodsRule.java:40)
at com.carrotsearch.randomizedtesting.rules.NoShadowingOrOverridesOnMethodsRule$1.evaluate(NoShadowingOrOverridesOnMethodsRule.java:40)
at com.carrotsearch.randomizedtesting.rules.StatementAdapter.evaluate(StatementAdapter.java:36)
at com.carrotsearch.randomizedtesting.rules.StatementAdapter.evaluate(StatementAdapter.java:36)
at org.apache.lucene.util.TestRuleAssertionsRequired$1.evaluate(TestRuleAssertionsRequired.java:53)
at org.apache.lucene.util.TestRuleMarkFailure$1.evaluate(TestRuleMarkFailure.java:47)
at org.apache.lucene.util.TestRuleIgnoreAfterMaxFailures$1.evaluate(TestRuleIgnoreAfterMaxFailures.java:64)
at org.apache.lucene.util.TestRuleIgnoreTestSuites$1.evaluate(TestRuleIgnoreTestSuites.java:54)
at com.carrotsearch.randomizedtesting.rules.StatementAdapter.evaluate(StatementAdapter.java:36)
at com.carrotsearch.randomizedtesting.ThreadLeakControl$StatementRunner.run(ThreadLeakControl.java:368)
at java.base/java.lang.Thread.run(Thread.java:830)
FAILED: org.apache.solr.update.processor.ParsingFieldUpdateProcessorsTest.testParseFloatNonRootLocale
Error Message:
Stack Trace:
java.lang.AssertionError
at __randomizedtesting.SeedInfo.seed([AEB3D98A69A59B49:B56F245BC9006754]:0)
at org.junit.Assert.fail(Assert.java:86)
at org.junit.Assert.assertTrue(Assert.java:41)
at org.junit.Assert.assertTrue(Assert.java:52)
at org.apache.solr.update.processor.ParsingFieldUpdateProcessorsTest.testParseFloatNonRootLocale(ParsingFieldUpdateProcessorsTest.java:471)
at java.base/jdk.internal.reflect.NativeMethodAccessorImpl.invoke0(Native Method)
at java.base/jdk.internal.reflect.NativeMethodAccessorImpl.invoke(NativeMethodAccessorImpl.java:62)
at java.base/jdk.internal.reflect.DelegatingMethodAccessorImpl.invoke(DelegatingMethodAccessorImpl.java:43)
at java.base/java.lang.reflect.Method.invoke(Method.java:567)
at com.carrotsearch.randomizedtesting.RandomizedRunner.invoke(RandomizedRunner.java:1750)
at com.carrotsearch.randomizedtesting.RandomizedRunner$8.evaluate(RandomizedRunner.java:938)
at com.carrotsearch.randomizedtesting.RandomizedRunner$9.evaluate(RandomizedRunner.java:974)
at com.carrotsearch.randomizedtesting.RandomizedRunner$10.evaluate(RandomizedRunner.java:988)
at com.carrotsearch.randomizedtesting.rules.SystemPropertiesRestoreRule$1.evaluate(SystemPropertiesRestoreRule.java:57)
at org.apache.lucene.util.TestRuleSetupTeardownChained$1.evaluate(TestRuleSetupTeardownChained.java:49)
at org.apache.lucene.util.AbstractBeforeAfterRule$1.evaluate(AbstractBeforeAfterRule.java:45)
at org.apache.lucene.util.TestRuleThreadAndTestName$1.evaluate(TestRuleThreadAndTestName.java:48)
at org.apache.lucene.util.TestRuleIgnoreAfterMaxFailures$1.evaluate(TestRuleIgnoreAfterMaxFailures.java:64)
at org.apache.lucene.util.TestRuleMarkFailure$1.evaluate(TestRuleMarkFailure.java:47)
at com.carrotsearch.randomizedtesting.rules.StatementAdapter.evaluate(StatementAdapter.java:36)
at com.carrotsearch.randomizedtesting.ThreadLeakControl$StatementRunner.run(ThreadLeakControl.java:368)
at com.carrotsearch.randomizedtesting.ThreadLeakControl.forkTimeoutingTask(ThreadLeakControl.java:817)
at com.carrotsearch.randomizedtesting.ThreadLeakControl$3.evaluate(ThreadLeakControl.java:468)
at com.carrotsearch.randomizedtesting.RandomizedRunner.runSingleTest(RandomizedRunner.java:947)
at com.carrotsearch.randomizedtesting.RandomizedRunner$5.evaluate(RandomizedRunner.java:832)
at com.carrotsearch.randomizedtesting.RandomizedRunner$6.evaluate(RandomizedRunner.java:883)
at com.carrotsearch.randomizedtesting.RandomizedRunner$7.evaluate(RandomizedRunner.java:894)
at com.carrotsearch.randomizedtesting.rules.StatementAdapter.evaluate(StatementAdapter.java:36)
at com.carrotsearch.randomizedtesting.rules.SystemPropertiesRestoreRule$1.evaluate(SystemPropertiesRestoreRule.java:57)
at org.apache.lucene.util.AbstractBeforeAfterRule$1.evaluate(AbstractBeforeAfterRule.java:45)
at com.carrotsearch.randomizedtesting.rules.StatementAdapter.evaluate(StatementAdapter.java:36)
at org.apache.lucene.util.TestRuleStoreClassName$1.evaluate(TestRuleStoreClassName.java:41)
at com.carrotsearch.randomizedtesting.rules.NoShadowingOrOverridesOnMethodsRule$1.evaluate(NoShadowingOrOverridesOnMethodsRule.java:40)
at com.carrotsearch.randomizedtesting.rules.NoShadowingOrOverridesOnMethodsRule$1.evaluate(NoShadowingOrOverridesOnMethodsRule.java:40)
at com.carrotsearch.randomizedtesting.rules.StatementAdapter.evaluate(StatementAdapter.java:36)
at com.carrotsearch.randomizedtesting.rules.StatementAdapter.evaluate(StatementAdapter.java:36)
at org.apache.lucene.util.TestRuleAssertionsRequired$1.evaluate(TestRuleAssertionsRequired.java:53)
at org.apache.lucene.util.TestRuleMarkFailure$1.evaluate(TestRuleMarkFailure.java:47)
at org.apache.lucene.util.TestRuleIgnoreAfterMaxFailures$1.evaluate(TestRuleIgnoreAfterMaxFailures.java:64)
at org.apache.lucene.util.TestRuleIgnoreTestSuites$1.evaluate(TestRuleIgnoreTestSuites.java:54)
at com.carrotsearch.randomizedtesting.rules.StatementAdapter.evaluate(StatementAdapter.java:36)
at com.carrotsearch.randomizedtesting.ThreadLeakControl$StatementRunner.run(ThreadLeakControl.java:368)
at java.base/java.lang.Thread.run(Thread.java:830)
FAILED: org.apache.solr.update.processor.ParsingFieldUpdateProcessorsTest.testParseDoubleNonRootLocale
Error Message:
Stack Trace:
java.lang.AssertionError
at __randomizedtesting.SeedInfo.seed([AEB3D98A69A59B49:B948146D6DDDF1AB]:0)
at org.junit.Assert.fail(Assert.java:86)
at org.junit.Assert.assertTrue(Assert.java:41)
at org.junit.Assert.assertTrue(Assert.java:52)
at org.apache.solr.update.processor.ParsingFieldUpdateProcessorsTest.testParseDoubleNonRootLocale(ParsingFieldUpdateProcessorsTest.java:573)
at java.base/jdk.internal.reflect.NativeMethodAccessorImpl.invoke0(Native Method)
at java.base/jdk.internal.reflect.NativeMethodAccessorImpl.invoke(NativeMethodAccessorImpl.java:62)
at java.base/jdk.internal.reflect.DelegatingMethodAccessorImpl.invoke(DelegatingMethodAccessorImpl.java:43)
at java.base/java.lang.reflect.Method.invoke(Method.java:567)
at com.carrotsearch.randomizedtesting.RandomizedRunner.invoke(RandomizedRunner.java:1750)
at com.carrotsearch.randomizedtesting.RandomizedRunner$8.evaluate(RandomizedRunner.java:938)
at com.carrotsearch.randomizedtesting.RandomizedRunner$9.evaluate(RandomizedRunner.java:974)
at com.carrotsearch.randomizedtesting.RandomizedRunner$10.evaluate(RandomizedRunner.java:988)
at com.carrotsearch.randomizedtesting.rules.SystemPropertiesRestoreRule$1.evaluate(SystemPropertiesRestoreRule.java:57)
at org.apache.lucene.util.TestRuleSetupTeardownChained$1.evaluate(TestRuleSetupTeardownChained.java:49)
at org.apache.lucene.util.AbstractBeforeAfterRule$1.evaluate(AbstractBeforeAfterRule.java:45)
at org.apache.lucene.util.TestRuleThreadAndTestName$1.evaluate(TestRuleThreadAndTestName.java:48)
at org.apache.lucene.util.TestRuleIgnoreAfterMaxFailures$1.evaluate(TestRuleIgnoreAfterMaxFailures.java:64)
at org.apache.lucene.util.TestRuleMarkFailure$1.evaluate(TestRuleMarkFailure.java:47)
at com.carrotsearch.randomizedtesting.rules.StatementAdapter.evaluate(StatementAdapter.java:36)
at com.carrotsearch.randomizedtesting.ThreadLeakControl$StatementRunner.run(ThreadLeakControl.java:368)
at com.carrotsearch.randomizedtesting.ThreadLeakControl.forkTimeoutingTask(ThreadLeakControl.java:817)
at com.carrotsearch.randomizedtesting.ThreadLeakControl$3.evaluate(ThreadLeakControl.java:468)
at com.carrotsearch.randomizedtesting.RandomizedRunner.runSingleTest(RandomizedRunner.java:947)
at com.carrotsearch.randomizedtesting.RandomizedRunner$5.evaluate(RandomizedRunner.java:832)
at com.carrotsearch.randomizedtesting.RandomizedRunner$6.evaluate(RandomizedRunner.java:883)
at com.carrotsearch.randomizedtesting.RandomizedRunner$7.evaluate(RandomizedRunner.java:894)
at com.carrotsearch.randomizedtesting.rules.StatementAdapter.evaluate(StatementAdapter.java:36)
at com.carrotsearch.randomizedtesting.rules.SystemPropertiesRestoreRule$1.evaluate(SystemPropertiesRestoreRule.java:57)
at org.apache.lucene.util.AbstractBeforeAfterRule$1.evaluate(AbstractBeforeAfterRule.java:45)
at com.carrotsearch.randomizedtesting.rules.StatementAdapter.evaluate(StatementAdapter.java:36)
at org.apache.lucene.util.TestRuleStoreClassName$1.evaluate(TestRuleStoreClassName.java:41)
at com.carrotsearch.randomizedtesting.rules.NoShadowingOrOverridesOnMethodsRule$1.evaluate(NoShadowingOrOverridesOnMethodsRule.java:40)
at com.carrotsearch.randomizedtesting.rules.NoShadowingOrOverridesOnMethodsRule$1.evaluate(NoShadowingOrOverridesOnMethodsRule.java:40)
at com.carrotsearch.randomizedtesting.rules.StatementAdapter.evaluate(StatementAdapter.java:36)
at com.carrotsearch.randomizedtesting.rules.StatementAdapter.evaluate(StatementAdapter.java:36)
at org.apache.lucene.util.TestRuleAssertionsRequired$1.evaluate(TestRuleAssertionsRequired.java:53)
at org.apache.lucene.util.TestRuleMarkFailure$1.evaluate(TestRuleMarkFailure.java:47)
at org.apache.lucene.util.TestRuleIgnoreAfterMaxFailures$1.evaluate(TestRuleIgnoreAfterMaxFailures.java:64)
at org.apache.lucene.util.TestRuleIgnoreTestSuites$1.evaluate(TestRuleIgnoreTestSuites.java:54)
at com.carrotsearch.randomizedtesting.rules.StatementAdapter.evaluate(StatementAdapter.java:36)
at com.carrotsearch.randomizedtesting.ThreadLeakControl$StatementRunner.run(ThreadLeakControl.java:368)
at java.base/java.lang.Thread.run(Thread.java:830)
FAILED: org.apache.solr.update.processor.ParsingFieldUpdateProcessorsTest.testParseFloatNonRootLocale
Error Message:
Stack Trace:
java.lang.AssertionError
at __randomizedtesting.SeedInfo.seed([AEB3D98A69A59B49:B56F245BC9006754]:0)
at org.junit.Assert.fail(Assert.java:86)
at org.junit.Assert.assertTrue(Assert.java:41)
at org.junit.Assert.assertTrue(Assert.java:52)
at org.apache.solr.update.processor.ParsingFieldUpdateProcessorsTest.testParseFloatNonRootLocale(ParsingFieldUpdateProcessorsTest.java:471)
at java.base/jdk.internal.reflect.NativeMethodAccessorImpl.invoke0(Native Method)
at java.base/jdk.internal.reflect.NativeMethodAccessorImpl.invoke(NativeMethodAccessorImpl.java:62)
at java.base/jdk.internal.reflect.DelegatingMethodAccessorImpl.invoke(DelegatingMethodAccessorImpl.java:43)
at java.base/java.lang.reflect.Method.invoke(Method.java:567)
at com.carrotsearch.randomizedtesting.RandomizedRunner.invoke(RandomizedRunner.java:1750)
at com.carrotsearch.randomizedtesting.RandomizedRunner$8.evaluate(RandomizedRunner.java:938)
at com.carrotsearch.randomizedtesting.RandomizedRunner$9.evaluate(RandomizedRunner.java:974)
at com.carrotsearch.randomizedtesting.RandomizedRunner$10.evaluate(RandomizedRunner.java:988)
at com.carrotsearch.randomizedtesting.rules.SystemPropertiesRestoreRule$1.evaluate(SystemPropertiesRestoreRule.java:57)
at org.apache.lucene.util.TestRuleSetupTeardownChained$1.evaluate(TestRuleSetupTeardownChained.java:49)
at org.apache.lucene.util.AbstractBeforeAfterRule$1.evaluate(AbstractBeforeAfterRule.java:45)
at org.apache.lucene.util.TestRuleThreadAndTestName$1.evaluate(TestRuleThreadAndTestName.java:48)
at org.apache.lucene.util.TestRuleIgnoreAfterMaxFailures$1.evaluate(TestRuleIgnoreAfterMaxFailures.java:64)
at org.apache.lucene.util.TestRuleMarkFailure$1.evaluate(TestRuleMarkFailure.java:47)
at com.carrotsearch.randomizedtesting.rules.StatementAdapter.evaluate(StatementAdapter.java:36)
at com.carrotsearch.randomizedtesting.ThreadLeakControl$StatementRunner.run(ThreadLeakControl.java:368)
at com.carrotsearch.randomizedtesting.ThreadLeakControl.forkTimeoutingTask(ThreadLeakControl.java:817)
at com.carrotsearch.randomizedtesting.ThreadLeakControl$3.evaluate(ThreadLeakControl.java:468)
at com.carrotsearch.randomizedtesting.RandomizedRunner.runSingleTest(RandomizedRunner.java:947)
at com.carrotsearch.randomizedtesting.RandomizedRunner$5.evaluate(RandomizedRunner.java:832)
at com.carrotsearch.randomizedtesting.RandomizedRunner$6.evaluate(RandomizedRunner.java:883)
at com.carrotsearch.randomizedtesting.RandomizedRunner$7.evaluate(RandomizedRunner.java:894)
at com.carrotsearch.randomizedtesting.rules.StatementAdapter.evaluate(StatementAdapter.java:36)
at com.carrotsearch.randomizedtesting.rules.SystemPropertiesRestoreRule$1.evaluate(SystemPropertiesRestoreRule.java:57)
at org.apache.lucene.util.AbstractBeforeAfterRule$1.evaluate(AbstractBeforeAfterRule.java:45)
at com.carrotsearch.randomizedtesting.rules.StatementAdapter.evaluate(StatementAdapter.java:36)
at org.apache.lucene.util.TestRuleStoreClassName$1.evaluate(TestRuleStoreClassName.java:41)
at com.carrotsearch.randomizedtesting.rules.NoShadowingOrOverridesOnMethodsRule$1.evaluate(NoShadowingOrOverridesOnMethodsRule.java:40)
at com.carrotsearch.randomizedtesting.rules.NoShadowingOrOverridesOnMethodsRule$1.evaluate(NoShadowingOrOverridesOnMethodsRule.java:40)
at com.carrotsearch.randomizedtesting.rules.StatementAdapter.evaluate(StatementAdapter.java:36)
at com.carrotsearch.randomizedtesting.rules.StatementAdapter.evaluate(StatementAdapter.java:36)
at org.apache.lucene.util.TestRuleAssertionsRequired$1.evaluate(TestRuleAssertionsRequired.java:53)
at org.apache.lucene.util.TestRuleMarkFailure$1.evaluate(TestRuleMarkFailure.java:47)
at org.apache.lucene.util.TestRuleIgnoreAfterMaxFailures$1.evaluate(TestRuleIgnoreAfterMaxFailures.java:64)
at org.apache.lucene.util.TestRuleIgnoreTestSuites$1.evaluate(TestRuleIgnoreTestSuites.java:54)
at com.carrotsearch.randomizedtesting.rules.StatementAdapter.evaluate(StatementAdapter.java:36)
at com.carrotsearch.randomizedtesting.ThreadLeakControl$StatementRunner.run(ThreadLeakControl.java:368)
at java.base/java.lang.Thread.run(Thread.java:830)
FAILED: org.apache.solr.update.processor.ParsingFieldUpdateProcessorsTest.testParseDoubleNonRootLocale
Error Message:
Stack Trace:
java.lang.AssertionError
at __randomizedtesting.SeedInfo.seed([AEB3D98A69A59B49:B948146D6DDDF1AB]:0)
at org.junit.Assert.fail(Assert.java:86)
at org.junit.Assert.assertTrue(Assert.java:41)
at org.junit.Assert.assertTrue(Assert.java:52)
at org.apache.solr.update.processor.ParsingFieldUpdateProcessorsTest.testParseDoubleNonRootLocale(ParsingFieldUpdateProcessorsTest.java:573)
at java.base/jdk.internal.reflect.NativeMethodAccessorImpl.invoke0(Native Method)
at java.base/jdk.internal.reflect.NativeMethodAccessorImpl.invoke(NativeMethodAccessorImpl.java:62)
at java.base/jdk.internal.reflect.DelegatingMethodAccessorImpl.invoke(DelegatingMethodAccessorImpl.java:43)
at java.base/java.lang.reflect.Method.invoke(Method.java:567)
at com.carrotsearch.randomizedtesting.RandomizedRunner.invoke(RandomizedRunner.java:1750)
at com.carrotsearch.randomizedtesting.RandomizedRunner$8.evaluate(RandomizedRunner.java:938)
at com.carrotsearch.randomizedtesting.RandomizedRunner$9.evaluate(RandomizedRunner.java:974)
at com.carrotsearch.randomizedtesting.RandomizedRunner$10.evaluate(RandomizedRunner.java:988)
at com.carrotsearch.randomizedtesting.rules.SystemPropertiesRestoreRule$1.evaluate(SystemPropertiesRestoreRule.java:57)
at org.apache.lucene.util.TestRuleSetupTeardownChained$1.evaluate(TestRuleSetupTeardownChained.java:49)
at org.apache.lucene.util.AbstractBeforeAfterRule$1.evaluate(AbstractBeforeAfterRule.java:45)
at org.apache.lucene.util.TestRuleThreadAndTestName$1.evaluate(TestRuleThreadAndTestName.java:48)
at org.apache.lucene.util.TestRuleIgnoreAfterMaxFailures$1.evaluate(TestRuleIgnoreAfterMaxFailures.java:64)
at org.apache.lucene.util.TestRuleMarkFailure$1.evaluate(TestRuleMarkFailure.java:47)
at com.carrotsearch.randomizedtesting.rules.StatementAdapter.evaluate(StatementAdapter.java:36)
at com.carrotsearch.randomizedtesting.ThreadLeakControl$StatementRunner.run(ThreadLeakControl.java:368)
at com.carrotsearch.randomizedtesting.ThreadLeakControl.forkTimeoutingTask(ThreadLeakControl.java:817)
at com.carrotsearch.randomizedtesting.ThreadLeakControl$3.evaluate(ThreadLeakControl.java:468)
at com.carrotsearch.randomizedtesting.RandomizedRunner.runSingleTest(RandomizedRunner.java:947)
at com.carrotsearch.randomizedtesting.RandomizedRunner$5.evaluate(RandomizedRunner.java:832)
at com.carrotsearch.randomizedtesting.RandomizedRunner$6.evaluate(RandomizedRunner.java:883)
at com.carrotsearch.randomizedtesting.RandomizedRunner$7.evaluate(RandomizedRunner.java:894)
at com.carrotsearch.randomizedtesting.rules.StatementAdapter.evaluate(StatementAdapter.java:36)
at com.carrotsearch.randomizedtesting.rules.SystemPropertiesRestoreRule$1.evaluate(SystemPropertiesRestoreRule.java:57)
at org.apache.lucene.util.AbstractBeforeAfterRule$1.evaluate(AbstractBeforeAfterRule.java:45)
at com.carrotsearch.randomizedtesting.rules.StatementAdapter.evaluate(StatementAdapter.java:36)
at org.apache.lucene.util.TestRuleStoreClassName$1.evaluate(TestRuleStoreClassName.java:41)
at com.carrotsearch.randomizedtesting.rules.NoShadowingOrOverridesOnMethodsRule$1.evaluate(NoShadowingOrOverridesOnMethodsRule.java:40)
at com.carrotsearch.randomizedtesting.rules.NoShadowingOrOverridesOnMethodsRule$1.evaluate(NoShadowingOrOverridesOnMethodsRule.java:40)
at com.carrotsearch.randomizedtesting.rules.StatementAdapter.evaluate(StatementAdapter.java:36)
at com.carrotsearch.randomizedtesting.rules.StatementAdapter.evaluate(StatementAdapter.java:36)
at org.apache.lucene.util.TestRuleAssertionsRequired$1.evaluate(TestRuleAssertionsRequired.java:53)
at org.apache.lucene.util.TestRuleMarkFailure$1.evaluate(TestRuleMarkFailure.java:47)
at org.apache.lucene.util.TestRuleIgnoreAfterMaxFailures$1.evaluate(TestRuleIgnoreAfterMaxFailures.java:64)
at org.apache.lucene.util.TestRuleIgnoreTestSuites$1.evaluate(TestRuleIgnoreTestSuites.java:54)
at com.carrotsearch.randomizedtesting.rules.StatementAdapter.evaluate(StatementAdapter.java:36)
at com.carrotsearch.randomizedtesting.ThreadLeakControl$StatementRunner.run(ThreadLeakControl.java:368)
at java.base/java.lang.Thread.run(Thread.java:830)
FAILED: org.apache.solr.update.processor.ParsingFieldUpdateProcessorsTest.testParseFloatNonRootLocale
Error Message:
Stack Trace:
java.lang.AssertionError
at __randomizedtesting.SeedInfo.seed([AEB3D98A69A59B49:B56F245BC9006754]:0)
at org.junit.Assert.fail(Assert.java:86)
at org.junit.Assert.assertTrue(Assert.java:41)
at org.junit.Assert.assertTrue(Assert.java:52)
at org.apache.solr.update.processor.ParsingFieldUpdateProcessorsTest.testParseFloatNonRootLocale(ParsingFieldUpdateProcessorsTest.java:471)
at java.base/jdk.internal.reflect.NativeMethodAccessorImpl.invoke0(Native Method)
at java.base/jdk.internal.reflect.NativeMethodAccessorImpl.invoke(NativeMethodAccessorImpl.java:62)
at java.base/jdk.internal.reflect.DelegatingMethodAccessorImpl.invoke(DelegatingMethodAccessorImpl.java:43)
at java.base/java.lang.reflect.Method.invoke(Method.java:567)
at com.carrotsearch.randomizedtesting.RandomizedRunner.invoke(RandomizedRunner.java:1750)
at com.carrotsearch.randomizedtesting.RandomizedRunner$8.evaluate(RandomizedRunner.java:938)
at com.carrotsearch.randomizedtesting.RandomizedRunner$9.evaluate(RandomizedRunner.java:974)
at com.carrotsearch.randomizedtesting.RandomizedRunner$10.evaluate(RandomizedRunner.java:988)
at com.carrotsearch.randomizedtesting.rules.SystemPropertiesRestoreRule$1.evaluate(SystemPropertiesRestoreRule.java:57)
at org.apache.lucene.util.TestRuleSetupTeardownChained$1.evaluate(TestRuleSetupTeardownChained.java:49)
at org.apache.lucene.util.AbstractBeforeAfterRule$1.evaluate(AbstractBeforeAfterRule.java:45)
at org.apache.lucene.util.TestRuleThreadAndTestName$1.evaluate(TestRuleThreadAndTestName.java:48)
at org.apache.lucene.util.TestRuleIgnoreAfterMaxFailures$1.evaluate(TestRuleIgnoreAfterMaxFailures.java:64)
at org.apache.lucene.util.TestRuleMarkFailure$1.evaluate(TestRuleMarkFailure.java:47)
at com.carrotsearch.randomizedtesting.rules.StatementAdapter.evaluate(StatementAdapter.java:36)
at com.carrotsearch.randomizedtesting.ThreadLeakControl$StatementRunner.run(ThreadLeakControl.java:368)
at com.carrotsearch.randomizedtesting.ThreadLeakControl.forkTimeoutingTask(ThreadLeakControl.java:817)
at com.carrotsearch.randomizedtesting.ThreadLeakControl$3.evaluate(ThreadLeakControl.java:468)
at com.carrotsearch.randomizedtesting.RandomizedRunner.runSingleTest(RandomizedRunner.java:947)
at com.carrotsearch.randomizedtesting.RandomizedRunner$5.evaluate(RandomizedRunner.java:832)
at com.carrotsearch.randomizedtesting.RandomizedRunner$6.evaluate(RandomizedRunner.java:883)
at com.carrotsearch.randomizedtesting.RandomizedRunner$7.evaluate(RandomizedRunner.java:894)
at com.carrotsearch.randomizedtesting.rules.StatementAdapter.evaluate(StatementAdapter.java:36)
at com.carrotsearch.randomizedtesting.rules.SystemPropertiesRestoreRule$1.evaluate(SystemPropertiesRestoreRule.java:57)
at org.apache.lucene.util.AbstractBeforeAfterRule$1.evaluate(AbstractBeforeAfterRule.java:45)
at com.carrotsearch.randomizedtesting.rules.StatementAdapter.evaluate(StatementAdapter.java:36)
at org.apache.lucene.util.TestRuleStoreClassName$1.evaluate(TestRuleStoreClassName.java:41)
at com.carrotsearch.randomizedtesting.rules.NoShadowingOrOverridesOnMethodsRule$1.evaluate(NoShadowingOrOverridesOnMethodsRule.java:40)
at com.carrotsearch.randomizedtesting.rules.NoShadowingOrOverridesOnMethodsRule$1.evaluate(NoShadowingOrOverridesOnMethodsRule.java:40)
at com.carrotsearch.randomizedtesting.rules.StatementAdapter.evaluate(StatementAdapter.java:36)
at com.carrotsearch.randomizedtesting.rules.StatementAdapter.evaluate(StatementAdapter.java:36)
at org.apache.lucene.util.TestRuleAssertionsRequired$1.evaluate(TestRuleAssertionsRequired.java:53)
at org.apache.lucene.util.TestRuleMarkFailure$1.evaluate(TestRuleMarkFailure.java:47)
at org.apache.lucene.util.TestRuleIgnoreAfterMaxFailures$1.evaluate(TestRuleIgnoreAfterMaxFailures.java:64)
at org.apache.lucene.util.TestRuleIgnoreTestSuites$1.evaluate(TestRuleIgnoreTestSuites.java:54)
at com.carrotsearch.randomizedtesting.rules.StatementAdapter.evaluate(StatementAdapter.java:36)
at com.carrotsearch.randomizedtesting.ThreadLeakControl$StatementRunner.run(ThreadLeakControl.java:368)
at java.base/java.lang.Thread.run(Thread.java:830)
FAILED: org.apache.solr.update.processor.ParsingFieldUpdateProcessorsTest.testParseDoubleNonRootLocale
Error Message:
Stack Trace:
java.lang.AssertionError
at __randomizedtesting.SeedInfo.seed([AEB3D98A69A59B49:B948146D6DDDF1AB]:0)
at org.junit.Assert.fail(Assert.java:86)
at org.junit.Assert.assertTrue(Assert.java:41)
at org.junit.Assert.assertTrue(Assert.java:52)
at org.apache.solr.update.processor.ParsingFieldUpdateProcessorsTest.testParseDoubleNonRootLocale(ParsingFieldUpdateProcessorsTest.java:573)
at java.base/jdk.internal.reflect.NativeMethodAccessorImpl.invoke0(Native Method)
at java.base/jdk.internal.reflect.NativeMethodAccessorImpl.invoke(NativeMethodAccessorImpl.java:62)
at java.base/jdk.internal.reflect.DelegatingMethodAccessorImpl.invoke(DelegatingMethodAccessorImpl.java:43)
at java.base/java.lang.reflect.Method.invoke(Method.java:567)
at com.carrotsearch.randomizedtesting.RandomizedRunner.invoke(RandomizedRunner.java:1750)
at com.carrotsearch.randomizedtesting.RandomizedRunner$8.evaluate(RandomizedRunner.java:938)
at com.carrotsearch.randomizedtesting.RandomizedRunner$9.evaluate(RandomizedRunner.java:974)
at com.carrotsearch.randomizedtesting.RandomizedRunner$10.evaluate(RandomizedRunner.java:988)
at com.carrotsearch.randomizedtesting.rules.SystemPropertiesRestoreRule$1.evaluate(SystemPropertiesRestoreRule.java:57)
at org.apache.lucene.util.TestRuleSetupTeardownChained$1.evaluate(TestRuleSetupTeardownChained.java:49)
at org.apache.lucene.util.AbstractBeforeAfterRule$1.evaluate(AbstractBeforeAfterRule.java:45)
at org.apache.lucene.util.TestRuleThreadAndTestName$1.evaluate(TestRuleThreadAndTestName.java:48)
at org.apache.lucene.util.TestRuleIgnoreAfterMaxFailures$1.evaluate(TestRuleIgnoreAfterMaxFailures.java:64)
at org.apache.lucene.util.TestRuleMarkFailure$1.evaluate(TestRuleMarkFailure.java:47)
at com.carrotsearch.randomizedtesting.rules.StatementAdapter.evaluate(StatementAdapter.java:36)
at com.carrotsearch.randomizedtesting.ThreadLeakControl$StatementRunner.run(ThreadLeakControl.java:368)
at com.carrotsearch.randomizedtesting.ThreadLeakControl.forkTimeoutingTask(ThreadLeakControl.java:817)
at com.carrotsearch.randomizedtesting.ThreadLeakControl$3.evaluate(ThreadLeakControl.java:468)
at com.carrotsearch.randomizedtesting.RandomizedRunner.runSingleTest(RandomizedRunner.java:947)
at com.carrotsearch.randomizedtesting.RandomizedRunner$5.evaluate(RandomizedRunner.java:832)
at com.carrotsearch.randomizedtesting.RandomizedRunner$6.evaluate(RandomizedRunner.java:883)
at com.carrotsearch.randomizedtesting.RandomizedRunner$7.evaluate(RandomizedRunner.java:894)
at com.carrotsearch.randomizedtesting.rules.StatementAdapter.evaluate(StatementAdapter.java:36)
at com.carrotsearch.randomizedtesting.rules.SystemPropertiesRestoreRule$1.evaluate(SystemPropertiesRestoreRule.java:57)
at org.apache.lucene.util.AbstractBeforeAfterRule$1.evaluate(AbstractBeforeAfterRule.java:45)
at com.carrotsearch.randomizedtesting.rules.StatementAdapter.evaluate(StatementAdapter.java:36)
at org.apache.lucene.util.TestRuleStoreClassName$1.evaluate(TestRuleStoreClassName.java:41)
at com.carrotsearch.randomizedtesting.rules.NoShadowingOrOverridesOnMethodsRule$1.evaluate(NoShadowingOrOverridesOnMethodsRule.java:40)
at com.carrotsearch.randomizedtesting.rules.NoShadowingOrOverridesOnMethodsRule$1.evaluate(NoShadowingOrOverridesOnMethodsRule.java:40)
at com.carrotsearch.randomizedtesting.rules.StatementAdapter.evaluate(StatementAdapter.java:36)
at com.carrotsearch.randomizedtesting.rules.StatementAdapter.evaluate(StatementAdapter.java:36)
at org.apache.lucene.util.TestRuleAssertionsRequired$1.evaluate(TestRuleAssertionsRequired.java:53)
at org.apache.lucene.util.TestRuleMarkFailure$1.evaluate(TestRuleMarkFailure.java:47)
at org.apache.lucene.util.TestRuleIgnoreAfterMaxFailures$1.evaluate(TestRuleIgnoreAfterMaxFailures.java:64)
at org.apache.lucene.util.TestRuleIgnoreTestSuites$1.evaluate(TestRuleIgnoreTestSuites.java:54)
at com.carrotsearch.randomizedtesting.rules.StatementAdapter.evaluate(StatementAdapter.java:36)
at com.carrotsearch.randomizedtesting.ThreadLeakControl$StatementRunner.run(ThreadLeakControl.java:368)
at java.base/java.lang.Thread.run(Thread.java:830)
Build Log:
[...truncated 13840 lines...]
[junit4] Suite: org.apache.solr.update.processor.ParsingFieldUpdateProcessorsTest
[junit4] 2> Creating dataDir: /home/jenkins/workspace/Lucene-Solr-8.x-Linux/solr/build/solr-core/test/J2/temp/solr.update.processor.ParsingFieldUpdateProcessorsTest_AEB3D98A69A59B49-001/init-core-data-001
[junit4] 2> 667535 WARN (SUITE-ParsingFieldUpdateProcessorsTest-seed#[AEB3D98A69A59B49]-worker) [ ] o.a.s.SolrTestCaseJ4 startTrackingSearchers: numOpens=8 numCloses=8
[junit4] 2> 667535 INFO (SUITE-ParsingFieldUpdateProcessorsTest-seed#[AEB3D98A69A59B49]-worker) [ ] o.a.s.SolrTestCaseJ4 Using PointFields (NUMERIC_POINTS_SYSPROP=true) w/NUMERIC_DOCVALUES_SYSPROP=true
[junit4] 2> 667535 INFO (SUITE-ParsingFieldUpdateProcessorsTest-seed#[AEB3D98A69A59B49]-worker) [ ] o.a.s.SolrTestCaseJ4 Randomized ssl (false) and clientAuth (false) via: @org.apache.solr.util.RandomizeSSL(reason="", ssl=0.0/0.0, value=0.0/0.0, clientAuth=0.0/0.0)
[junit4] 2> 667535 INFO (SUITE-ParsingFieldUpdateProcessorsTest-seed#[AEB3D98A69A59B49]-worker) [ ] o.a.s.SolrTestCaseJ4 SecureRandom sanity checks: test.solr.allowed.securerandom=null & java.security.egd=file:/dev/./urandom
[junit4] 2> 667535 INFO (SUITE-ParsingFieldUpdateProcessorsTest-seed#[AEB3D98A69A59B49]-worker) [ ] o.a.s.SolrTestCaseJ4 ####initCore
[junit4] 2> 667536 INFO (SUITE-ParsingFieldUpdateProcessorsTest-seed#[AEB3D98A69A59B49]-worker) [ ] o.a.s.c.SolrResourceLoader [null] Added 2 libs to classloader, from paths: [/home/jenkins/workspace/Lucene-Solr-8.x-Linux/solr/core/src/test-files/solr/collection1/lib, /home/jenkins/workspace/Lucene-Solr-8.x-Linux/solr/core/src/test-files/solr/collection1/lib/classes]
[junit4] 2> 667545 INFO (SUITE-ParsingFieldUpdateProcessorsTest-seed#[AEB3D98A69A59B49]-worker) [ ] o.a.s.c.SolrConfig Using Lucene MatchVersion: 8.2.0
[junit4] 2> 667563 INFO (SUITE-ParsingFieldUpdateProcessorsTest-seed#[AEB3D98A69A59B49]-worker) [ ] o.a.s.s.IndexSchema [null] Schema name=test
[junit4] 2> 667628 WARN (SUITE-ParsingFieldUpdateProcessorsTest-seed#[AEB3D98A69A59B49]-worker) [ ] o.a.s.s.IndexSchema Field text is not multivalued and destination for multiple copyFields (2)
[junit4] 2> 667628 INFO (SUITE-ParsingFieldUpdateProcessorsTest-seed#[AEB3D98A69A59B49]-worker) [ ] o.a.s.s.IndexSchema Loaded schema test/1.4 with uniqueid field id
[junit4] 2> 667666 INFO (SUITE-ParsingFieldUpdateProcessorsTest-seed#[AEB3D98A69A59B49]-worker) [ ] o.a.s.h.c.HttpShardHandlerFactory Host whitelist initialized: WhitelistHostChecker [whitelistHosts=null, whitelistHostCheckingEnabled=true]
[junit4] 2> 667667 WARN (SUITE-ParsingFieldUpdateProcessorsTest-seed#[AEB3D98A69A59B49]-worker) [ ] o.e.j.u.s.S.config Trusting all certificates configured for Client@435e42f5[provider=null,keyStore=null,trustStore=null]
[junit4] 2> 667667 WARN (SUITE-ParsingFieldUpdateProcessorsTest-seed#[AEB3D98A69A59B49]-worker) [ ] o.e.j.u.s.S.config No Client EndPointIdentificationAlgorithm configured for Client@435e42f5[provider=null,keyStore=null,trustStore=null]
[junit4] 2> 667669 WARN (SUITE-ParsingFieldUpdateProcessorsTest-seed#[AEB3D98A69A59B49]-worker) [ ] o.e.j.u.s.S.config Trusting all certificates configured for Client@277120[provider=null,keyStore=null,trustStore=null]
[junit4] 2> 667669 WARN (SUITE-ParsingFieldUpdateProcessorsTest-seed#[AEB3D98A69A59B49]-worker) [ ] o.e.j.u.s.S.config No Client EndPointIdentificationAlgorithm configured for Client@277120[provider=null,keyStore=null,trustStore=null]
[junit4] 2> 667677 INFO (SUITE-ParsingFieldUpdateProcessorsTest-seed#[AEB3D98A69A59B49]-worker) [ ] o.a.s.c.TransientSolrCoreCacheDefault Allocating transient cache for 2147483647 transient cores
[junit4] 2> 667677 INFO (SUITE-ParsingFieldUpdateProcessorsTest-seed#[AEB3D98A69A59B49]-worker) [ ] o.a.s.h.a.MetricsHistoryHandler No .system collection, keeping metrics history in memory.
[junit4] 2> 667686 INFO (SUITE-ParsingFieldUpdateProcessorsTest-seed#[AEB3D98A69A59B49]-worker) [ ] o.a.s.m.r.SolrJmxReporter JMX monitoring for 'solr.node' (registry 'solr.node') enabled at server: com.sun.jmx.mbeanserver.JmxMBeanServer@4e53f158
[junit4] 2> 667691 INFO (SUITE-ParsingFieldUpdateProcessorsTest-seed#[AEB3D98A69A59B49]-worker) [ ] o.a.s.m.r.SolrJmxReporter JMX monitoring for 'solr.jvm' (registry 'solr.jvm') enabled at server: com.sun.jmx.mbeanserver.JmxMBeanServer@4e53f158
[junit4] 2> 667691 INFO (SUITE-ParsingFieldUpdateProcessorsTest-seed#[AEB3D98A69A59B49]-worker) [ ] o.a.s.m.r.SolrJmxReporter JMX monitoring for 'solr.jetty' (registry 'solr.jetty') enabled at server: com.sun.jmx.mbeanserver.JmxMBeanServer@4e53f158
[junit4] 2> 667692 INFO (coreLoadExecutor-4134-thread-1) [ x:collection1 ] o.a.s.c.SolrResourceLoader [null] Added 2 libs to classloader, from paths: [/home/jenkins/workspace/Lucene-Solr-8.x-Linux/solr/core/src/test-files/solr/collection1/lib, /home/jenkins/workspace/Lucene-Solr-8.x-Linux/solr/core/src/test-files/solr/collection1/lib/classes]
[junit4] 2> 667712 INFO (coreLoadExecutor-4134-thread-1) [ x:collection1 ] o.a.s.c.SolrConfig Using Lucene MatchVersion: 8.2.0
[junit4] 2> 667725 INFO (coreLoadExecutor-4134-thread-1) [ x:collection1 ] o.a.s.s.IndexSchema [collection1] Schema name=test
[junit4] 2> 667799 WARN (coreLoadExecutor-4134-thread-1) [ x:collection1 ] o.a.s.s.IndexSchema Field text is not multivalued and destination for multiple copyFields (2)
[junit4] 2> 667799 INFO (coreLoadExecutor-4134-thread-1) [ x:collection1 ] o.a.s.s.IndexSchema Loaded schema test/1.4 with uniqueid field id
[junit4] 2> 667805 INFO (coreLoadExecutor-4134-thread-1) [ x:collection1 ] o.a.s.c.CoreContainer Creating SolrCore 'collection1' using configuration from instancedir /home/jenkins/workspace/Lucene-Solr-8.x-Linux/solr/core/src/test-files/solr/collection1, trusted=true
[junit4] 2> 667805 INFO (coreLoadExecutor-4134-thread-1) [ x:collection1 ] o.a.s.m.r.SolrJmxReporter JMX monitoring for 'solr.core.collection1' (registry 'solr.core.collection1') enabled at server: com.sun.jmx.mbeanserver.JmxMBeanServer@4e53f158
[junit4] 2> 667805 INFO (coreLoadExecutor-4134-thread-1) [ x:collection1 ] o.a.s.c.SolrCore [[collection1] ] Opening new SolrCore at [/home/jenkins/workspace/Lucene-Solr-8.x-Linux/solr/core/src/test-files/solr/collection1], dataDir=[/home/jenkins/workspace/Lucene-Solr-8.x-Linux/solr/build/solr-core/test/J2/temp/solr.update.processor.ParsingFieldUpdateProcessorsTest_AEB3D98A69A59B49-001/init-core-data-001/]
[junit4] 2> 667894 INFO (coreLoadExecutor-4134-thread-1) [ x:collection1 ] o.a.s.u.CommitTracker Hard AutoCommit: disabled
[junit4] 2> 667894 INFO (coreLoadExecutor-4134-thread-1) [ x:collection1 ] o.a.s.u.CommitTracker Soft AutoCommit: disabled
[junit4] 2> 667895 INFO (coreLoadExecutor-4134-thread-1) [ x:collection1 ] o.a.s.s.SolrIndexSearcher Opening [Searcher@54b3d741[collection1] main]
[junit4] 2> 667895 WARN (coreLoadExecutor-4134-thread-1) [ x:collection1 ] o.a.s.r.ManagedResourceStorage Cannot write to config directory /home/jenkins/workspace/Lucene-Solr-8.x-Linux/solr/core/src/test-files/solr/collection1/conf; switching to use InMemory storage instead.
[junit4] 2> 667895 INFO (coreLoadExecutor-4134-thread-1) [ x:collection1 ] o.a.s.h.ReplicationHandler Commits will be reserved for 10000ms.
[junit4] 2> 667896 INFO (searcherExecutor-4135-thread-1-processing-x:collection1) [ x:collection1 ] o.a.s.c.SolrCore [collection1] Registered new searcher Searcher@54b3d741[collection1] main{ExitableDirectoryReader(UninvertingDirectoryReader())}
[junit4] 2> 667896 INFO (SUITE-ParsingFieldUpdateProcessorsTest-seed#[AEB3D98A69A59B49]-worker) [ ] o.a.s.SolrTestCaseJ4 ####initCore end
[junit4] 2> 667901 INFO (TEST-ParsingFieldUpdateProcessorsTest.testParseFloatRoundTrip-seed#[AEB3D98A69A59B49]) [ ] o.a.s.SolrTestCaseJ4 ###Starting testParseFloatRoundTrip
[junit4] 2> 667906 INFO (TEST-ParsingFieldUpdateProcessorsTest.testParseFloatRoundTrip-seed#[AEB3D98A69A59B49]) [ ] o.a.s.u.DirectUpdateHandler2 start commit{,optimize=false,openSearcher=true,waitSearcher=true,expungeDeletes=false,softCommit=false,prepareCommit=false}
[junit4] 2> 667906 INFO (TEST-ParsingFieldUpdateProcessorsTest.testParseFloatRoundTrip-seed#[AEB3D98A69A59B49]) [ ] o.a.s.u.SolrIndexWriter Calling setCommitData with IW:org.apache.solr.update.SolrIndexWriter@1c30d970 commitCommandVersion:0
[junit4] 2> 667921 INFO (TEST-ParsingFieldUpdateProcessorsTest.testParseFloatRoundTrip-seed#[AEB3D98A69A59B49]) [ ] o.a.s.s.SolrIndexSearcher Opening [Searcher@50660542[collection1] main]
[junit4] 2> 667921 INFO (TEST-ParsingFieldUpdateProcessorsTest.testParseFloatRoundTrip-seed#[AEB3D98A69A59B49]) [ ] o.a.s.u.DirectUpdateHandler2 end_commit_flush
[junit4] 2> 667922 INFO (searcherExecutor-4135-thread-1) [ ] o.a.s.c.SolrCore [collection1] Registered new searcher Searcher@50660542[collection1] main{ExitableDirectoryReader(UninvertingDirectoryReader(Uninverting(_0(8.2.0):C1:[diagnostics={os=Linux, java.vendor=Oracle Corporation, java.version=13-ea, java.vm.version=13-ea+26, lucene.version=8.2.0, os.arch=amd64, java.runtime.version=13-ea+26, source=flush, os.version=4.18.0-17-generic, timestamp=1561255134193}]:[attributes={Lucene50StoredFieldsFormat.mode=BEST_SPEED}])))}
[junit4] 2> 667922 INFO (TEST-ParsingFieldUpdateProcessorsTest.testParseFloatRoundTrip-seed#[AEB3D98A69A59B49]) [ ] o.a.s.u.p.LogUpdateProcessorFactory [collection1] webapp=null path=null params={}{commit=} 0 16
[junit4] 2> 667924 INFO (TEST-ParsingFieldUpdateProcessorsTest.testParseFloatRoundTrip-seed#[AEB3D98A69A59B49]) [ ] o.a.s.c.S.Request [collection1] webapp=null path=null params={q=id:128&qt=&start=0&rows=20&version=2.2} hits=1 status=0 QTime=0
[junit4] 2> 667925 INFO (TEST-ParsingFieldUpdateProcessorsTest.testParseFloatRoundTrip-seed#[AEB3D98A69A59B49]) [ ] o.a.s.SolrTestCaseJ4 ###Ending testParseFloatRoundTrip
[junit4] 2> 667929 INFO (TEST-ParsingFieldUpdateProcessorsTest.testParseTrieFloatRoundTrip-seed#[AEB3D98A69A59B49]) [ ] o.a.s.SolrTestCaseJ4 ###Starting testParseTrieFloatRoundTrip
[junit4] 2> 667930 INFO (TEST-ParsingFieldUpdateProcessorsTest.testParseTrieFloatRoundTrip-seed#[AEB3D98A69A59B49]) [ ] o.a.s.u.DirectUpdateHandler2 start commit{,optimize=false,openSearcher=true,waitSearcher=true,expungeDeletes=false,softCommit=false,prepareCommit=false}
[junit4] 2> 667930 INFO (TEST-ParsingFieldUpdateProcessorsTest.testParseTrieFloatRoundTrip-seed#[AEB3D98A69A59B49]) [ ] o.a.s.u.SolrIndexWriter Calling setCommitData with IW:org.apache.solr.update.SolrIndexWriter@1c30d970 commitCommandVersion:0
[junit4] 2> 667931 INFO (TEST-ParsingFieldUpdateProcessorsTest.testParseTrieFloatRoundTrip-seed#[AEB3D98A69A59B49]) [ ] o.a.s.s.SolrIndexSearcher Opening [Searcher@3f0e0684[collection1] main]
[junit4] 2> 667932 INFO (TEST-ParsingFieldUpdateProcessorsTest.testParseTrieFloatRoundTrip-seed#[AEB3D98A69A59B49]) [ ] o.a.s.u.DirectUpdateHandler2 end_commit_flush
[junit4] 2> 667933 INFO (searcherExecutor-4135-thread-1) [ ] o.a.s.c.SolrCore [collection1] Registered new searcher Searcher@3f0e0684[collection1] main{ExitableDirectoryReader(UninvertingDirectoryReader(Uninverting(_0(8.2.0):C1:[diagnostics={os=Linux, java.vendor=Oracle Corporation, java.version=13-ea, java.vm.version=13-ea+26, lucene.version=8.2.0, os.arch=amd64, java.runtime.version=13-ea+26, source=flush, os.version=4.18.0-17-generic, timestamp=1561255134193}]:[attributes={Lucene50StoredFieldsFormat.mode=BEST_SPEED}]) Uninverting(_1(8.2.0):C1:[diagnostics={os=Linux, java.vendor=Oracle Corporation, java.version=13-ea, java.vm.version=13-ea+26, lucene.version=8.2.0, os.arch=amd64, java.runtime.version=13-ea+26, source=flush, os.version=4.18.0-17-generic, timestamp=1561255134216}]:[attributes={Lucene50StoredFieldsFormat.mode=BEST_SPEED}])))}
[junit4] 2> 667933 INFO (TEST-ParsingFieldUpdateProcessorsTest.testParseTrieFloatRoundTrip-seed#[AEB3D98A69A59B49]) [ ] o.a.s.u.p.LogUpdateProcessorFactory [collection1] webapp=null path=null params={}{commit=} 0 3
[junit4] 2> 667937 INFO (TEST-ParsingFieldUpdateProcessorsTest.testParseTrieFloatRoundTrip-seed#[AEB3D98A69A59B49]) [ ] o.a.s.c.S.Request [collection1] webapp=null path=null params={q=id:728&qt=&start=0&rows=20&version=2.2} hits=1 status=0 QTime=4
[junit4] 2> 667938 INFO (TEST-ParsingFieldUpdateProcessorsTest.testParseTrieFloatRoundTrip-seed#[AEB3D98A69A59B49]) [ ] o.a.s.SolrTestCaseJ4 ###Ending testParseTrieFloatRoundTrip
[junit4] 2> 667958 INFO (TEST-ParsingFieldUpdateProcessorsTest.testFailedParseMixedBoolean-seed#[AEB3D98A69A59B49]) [ ] o.a.s.SolrTestCaseJ4 ###Starting testFailedParseMixedBoolean
[junit4] 2> 667959 INFO (TEST-ParsingFieldUpdateProcessorsTest.testFailedParseMixedBoolean-seed#[AEB3D98A69A59B49]) [ ] o.a.s.SolrTestCaseJ4 ###Ending testFailedParseMixedBoolean
[junit4] 2> 667963 INFO (TEST-ParsingFieldUpdateProcessorsTest.testParseTrieDateRoundTrip-seed#[AEB3D98A69A59B49]) [ ] o.a.s.SolrTestCaseJ4 ###Starting testParseTrieDateRoundTrip
[junit4] 2> 667965 INFO (TEST-ParsingFieldUpdateProcessorsTest.testParseTrieDateRoundTrip-seed#[AEB3D98A69A59B49]) [ ] o.a.s.u.DirectUpdateHandler2 start commit{,optimize=false,openSearcher=true,waitSearcher=true,expungeDeletes=false,softCommit=false,prepareCommit=false}
[junit4] 2> 667965 INFO (TEST-ParsingFieldUpdateProcessorsTest.testParseTrieDateRoundTrip-seed#[AEB3D98A69A59B49]) [ ] o.a.s.u.SolrIndexWriter Calling setCommitData with IW:org.apache.solr.update.SolrIndexWriter@1c30d970 commitCommandVersion:0
[junit4] 2> 667966 INFO (TEST-ParsingFieldUpdateProcessorsTest.testParseTrieDateRoundTrip-seed#[AEB3D98A69A59B49]) [ ] o.a.s.s.SolrIndexSearcher Opening [Searcher@6904d634[collection1] main]
[junit4] 2> 667967 INFO (TEST-ParsingFieldUpdateProcessorsTest.testParseTrieDateRoundTrip-seed#[AEB3D98A69A59B49]) [ ] o.a.s.u.DirectUpdateHandler2 end_commit_flush
[junit4] 2> 667967 INFO (searcherExecutor-4135-thread-1) [ ] o.a.s.c.SolrCore [collection1] Registered new searcher Searcher@6904d634[collection1] main{ExitableDirectoryReader(UninvertingDirectoryReader(Uninverting(_0(8.2.0):C1:[diagnostics={os=Linux, java.vendor=Oracle Corporation, java.version=13-ea, java.vm.version=13-ea+26, lucene.version=8.2.0, os.arch=amd64, java.runtime.version=13-ea+26, source=flush, os.version=4.18.0-17-generic, timestamp=1561255134193}]:[attributes={Lucene50StoredFieldsFormat.mode=BEST_SPEED}]) Uninverting(_1(8.2.0):C1:[diagnostics={os=Linux, java.vendor=Oracle Corporation, java.version=13-ea, java.vm.version=13-ea+26, lucene.version=8.2.0, os.arch=amd64, java.runtime.version=13-ea+26, source=flush, os.version=4.18.0-17-generic, timestamp=1561255134216}]:[attributes={Lucene50StoredFieldsFormat.mode=BEST_SPEED}]) Uninverting(_2(8.2.0):C1:[diagnostics={os=Linux, java.vendor=Oracle Corporation, java.version=13-ea, java.vm.version=13-ea+26, lucene.version=8.2.0, os.arch=amd64, java.runtime.version=13-ea+26, source=flush, os.version=4.18.0-17-generic, timestamp=1561255134251}]:[attributes={Lucene50StoredFieldsFormat.mode=BEST_SPEED}])))}
[junit4] 2> 667968 INFO (TEST-ParsingFieldUpdateProcessorsTest.testParseTrieDateRoundTrip-seed#[AEB3D98A69A59B49]) [ ] o.a.s.u.p.LogUpdateProcessorFactory [collection1] webapp=null path=null params={}{commit=} 0 3
[junit4] 2> 667968 INFO (TEST-ParsingFieldUpdateProcessorsTest.testParseTrieDateRoundTrip-seed#[AEB3D98A69A59B49]) [ ] o.a.s.c.S.Request [collection1] webapp=null path=null params={q=id:39&qt=&start=0&rows=20&version=2.2} hits=1 status=0 QTime=0
[junit4] 2> 667969 INFO (TEST-ParsingFieldUpdateProcessorsTest.testParseTrieDateRoundTrip-seed#[AEB3D98A69A59B49]) [ ] o.a.s.SolrTestCaseJ4 ###Ending testParseTrieDateRoundTrip
[junit4] 2> 667976 INFO (TEST-ParsingFieldUpdateProcessorsTest.testParseDateNonUTCdefaultTimeZoneRoundTrip-seed#[AEB3D98A69A59B49]) [ ] o.a.s.SolrTestCaseJ4 ###Starting testParseDateNonUTCdefaultTimeZoneRoundTrip
[junit4] 2> 667977 INFO (TEST-ParsingFieldUpdateProcessorsTest.testParseDateNonUTCdefaultTimeZoneRoundTrip-seed#[AEB3D98A69A59B49]) [ ] o.a.s.u.DirectUpdateHandler2 start commit{,optimize=false,openSearcher=true,waitSearcher=true,expungeDeletes=false,softCommit=false,prepareCommit=false}
[junit4] 2> 667977 INFO (TEST-ParsingFieldUpdateProcessorsTest.testParseDateNonUTCdefaultTimeZoneRoundTrip-seed#[AEB3D98A69A59B49]) [ ] o.a.s.u.SolrIndexWriter Calling setCommitData with IW:org.apache.solr.update.SolrIndexWriter@1c30d970 commitCommandVersion:0
[junit4] 2> 667980 INFO (TEST-ParsingFieldUpdateProcessorsTest.testParseDateNonUTCdefaultTimeZoneRoundTrip-seed#[AEB3D98A69A59B49]) [ ] o.a.s.s.SolrIndexSearcher Opening [Searcher@4ab0f580[collection1] main]
[junit4] 2> 667981 INFO (TEST-ParsingFieldUpdateProcessorsTest.testParseDateNonUTCdefaultTimeZoneRoundTrip-seed#[AEB3D98A69A59B49]) [ ] o.a.s.u.DirectUpdateHandler2 end_commit_flush
[junit4] 2> 667981 INFO (searcherExecutor-4135-thread-1) [ ] o.a.s.c.SolrCore [collection1] Registered new searcher Searcher@4ab0f580[collection1] main{ExitableDirectoryReader(UninvertingDirectoryReader(Uninverting(_0(8.2.0):C1:[diagnostics={os=Linux, java.vendor=Oracle Corporation, java.version=13-ea, java.vm.version=13-ea+26, lucene.version=8.2.0, os.arch=amd64, java.runtime.version=13-ea+26, source=flush, os.version=4.18.0-17-generic, timestamp=1561255134193}]:[attributes={Lucene50StoredFieldsFormat.mode=BEST_SPEED}]) Uninverting(_1(8.2.0):C1:[diagnostics={os=Linux, java.vendor=Oracle Corporation, java.version=13-ea, java.vm.version=13-ea+26, lucene.version=8.2.0, os.arch=amd64, java.runtime.version=13-ea+26, source=flush, os.version=4.18.0-17-generic, timestamp=1561255134216}]:[attributes={Lucene50StoredFieldsFormat.mode=BEST_SPEED}]) Uninverting(_2(8.2.0):C1:[diagnostics={os=Linux, java.vendor=Oracle Corporation, java.version=13-ea, java.vm.version=13-ea+26, lucene.version=8.2.0, os.arch=amd64, java.runtime.version=13-ea+26, source=flush, os.version=4.18.0-17-generic, timestamp=1561255134251}]:[attributes={Lucene50StoredFieldsFormat.mode=BEST_SPEED}]) Uninverting(_3(8.2.0):C1:[diagnostics={os=Linux, java.vendor=Oracle Corporation, java.version=13-ea, java.vm.version=13-ea+26, lucene.version=8.2.0, os.arch=amd64, java.runtime.version=13-ea+26, source=flush, os.version=4.18.0-17-generic, timestamp=1561255134264}]:[attributes={Lucene50StoredFieldsFormat.mode=BEST_SPEED}])))}
[junit4] 2> 667981 INFO (TEST-ParsingFieldUpdateProcessorsTest.testParseDateNonUTCdefaultTimeZoneRoundTrip-seed#[AEB3D98A69A59B49]) [ ] o.a.s.u.p.LogUpdateProcessorFactory [collection1] webapp=null path=null params={}{commit=} 0 4
[junit4] 2> 667982 INFO (TEST-ParsingFieldUpdateProcessorsTest.testParseDateNonUTCdefaultTimeZoneRoundTrip-seed#[AEB3D98A69A59B49]) [ ] o.a.s.c.S.Request [collection1] webapp=null path=null params={q=id:99&qt=&start=0&rows=20&version=2.2} hits=1 status=0 QTime=0
[junit4] 2> 667983 INFO (TEST-ParsingFieldUpdateProcessorsTest.testParseDateNonUTCdefaultTimeZoneRoundTrip-seed#[AEB3D98A69A59B49]) [ ] o.a.s.SolrTestCaseJ4 ###Ending testParseDateNonUTCdefaultTimeZoneRoundTrip
[junit4] 2> 667988 INFO (TEST-ParsingFieldUpdateProcessorsTest.testParseTrieIntRoundTrip-seed#[AEB3D98A69A59B49]) [ ] o.a.s.SolrTestCaseJ4 ###Starting testParseTrieIntRoundTrip
[junit4] 2> 667990 INFO (TEST-ParsingFieldUpdateProcessorsTest.testParseTrieIntRoundTrip-seed#[AEB3D98A69A59B49]) [ ] o.a.s.u.DirectUpdateHandler2 start commit{,optimize=false,openSearcher=true,waitSearcher=true,expungeDeletes=false,softCommit=false,prepareCommit=false}
[junit4] 2> 667990 INFO (TEST-ParsingFieldUpdateProcessorsTest.testParseTrieIntRoundTrip-seed#[AEB3D98A69A59B49]) [ ] o.a.s.u.SolrIndexWriter Calling setCommitData with IW:org.apache.solr.update.SolrIndexWriter@1c30d970 commitCommandVersion:0
[junit4] 2> 667992 INFO (TEST-ParsingFieldUpdateProcessorsTest.testParseTrieIntRoundTrip-seed#[AEB3D98A69A59B49]) [ ] o.a.s.s.SolrIndexSearcher Opening [Searcher@45be25d1[collection1] main]
[junit4] 2> 667992 INFO (TEST-ParsingFieldUpdateProcessorsTest.testParseTrieIntRoundTrip-seed#[AEB3D98A69A59B49]) [ ] o.a.s.u.DirectUpdateHandler2 end_commit_flush
[junit4] 2> 667993 INFO (searcherExecutor-4135-thread-1) [ ] o.a.s.c.SolrCore [collection1] Registered new searcher Searcher@45be25d1[collection1] main{ExitableDirectoryReader(UninvertingDirectoryReader(Uninverting(_0(8.2.0):C1:[diagnostics={os=Linux, java.vendor=Oracle Corporation, java.version=13-ea, java.vm.version=13-ea+26, lucene.version=8.2.0, os.arch=amd64, java.runtime.version=13-ea+26, source=flush, os.version=4.18.0-17-generic, timestamp=1561255134193}]:[attributes={Lucene50StoredFieldsFormat.mode=BEST_SPEED}]) Uninverting(_1(8.2.0):C1:[diagnostics={os=Linux, java.vendor=Oracle Corporation, java.version=13-ea, java.vm.version=13-ea+26, lucene.version=8.2.0, os.arch=amd64, java.runtime.version=13-ea+26, source=flush, os.version=4.18.0-17-generic, timestamp=1561255134216}]:[attributes={Lucene50StoredFieldsFormat.mode=BEST_SPEED}]) Uninverting(_2(8.2.0):C1:[diagnostics={os=Linux, java.vendor=Oracle Corporation, java.version=13-ea, java.vm.version=13-ea+26, lucene.version=8.2.0, os.arch=amd64, java.runtime.version=13-ea+26, source=flush, os.version=4.18.0-17-generic, timestamp=1561255134251}]:[attributes={Lucene50StoredFieldsFormat.mode=BEST_SPEED}]) Uninverting(_3(8.2.0):C1:[diagnostics={os=Linux, java.vendor=Oracle Corporation, java.version=13-ea, java.vm.version=13-ea+26, lucene.version=8.2.0, os.arch=amd64, java.runtime.version=13-ea+26, source=flush, os.version=4.18.0-17-generic, timestamp=1561255134264}]:[attributes={Lucene50StoredFieldsFormat.mode=BEST_SPEED}]) Uninverting(_4(8.2.0):C1:[diagnostics={os=Linux, java.vendor=Oracle Corporation, java.version=13-ea, java.vm.version=13-ea+26, lucene.version=8.2.0, os.arch=amd64, java.runtime.version=13-ea+26, source=flush, os.version=4.18.0-17-generic, timestamp=1561255134276}]:[attributes={Lucene50StoredFieldsFormat.mode=BEST_SPEED}])))}
[junit4] 2> 667993 INFO (TEST-ParsingFieldUpdateProcessorsTest.testParseTrieIntRoundTrip-seed#[AEB3D98A69A59B49]) [ ] o.a.s.u.p.LogUpdateProcessorFactory [collection1] webapp=null path=null params={}{commit=} 0 3
[junit4] 2> 667994 INFO (TEST-ParsingFieldUpdateProcessorsTest.testParseTrieIntRoundTrip-seed#[AEB3D98A69A59B49]) [ ] o.a.s.c.S.Request [collection1] webapp=null path=null params={q=id:113&qt=&start=0&rows=20&version=2.2} hits=1 status=0 QTime=0
[junit4] 2> 667995 INFO (TEST-ParsingFieldUpdateProcessorsTest.testParseTrieIntRoundTrip-seed#[AEB3D98A69A59B49]) [ ] o.a.s.SolrTestCaseJ4 ###Ending testParseTrieIntRoundTrip
[junit4] 2> 667998 INFO (TEST-ParsingFieldUpdateProcessorsTest.testFailedParseMixedFloat-seed#[AEB3D98A69A59B49]) [ ] o.a.s.SolrTestCaseJ4 ###Starting testFailedParseMixedFloat
[junit4] 2> 667999 INFO (TEST-ParsingFieldUpdateProcessorsTest.testFailedParseMixedFloat-seed#[AEB3D98A69A59B49]) [ ] o.a.s.SolrTestCaseJ4 ###Ending testFailedParseMixedFloat
[junit4] 2> 668002 INFO (TEST-ParsingFieldUpdateProcessorsTest.testParseFloatNonRootLocale-seed#[AEB3D98A69A59B49]) [ ] o.a.s.SolrTestCaseJ4 ###Starting testParseFloatNonRootLocale
[junit4] 2> 668003 INFO (TEST-ParsingFieldUpdateProcessorsTest.testParseFloatNonRootLocale-seed#[AEB3D98A69A59B49]) [ ] o.a.s.SolrTestCaseJ4 ###Ending testParseFloatNonRootLocale
[junit4] 2> NOTE: reproduce with: ant test -Dtestcase=ParsingFieldUpdateProcessorsTest -Dtests.method=testParseFloatNonRootLocale -Dtests.seed=AEB3D98A69A59B49 -Dtests.multiplier=3 -Dtests.slow=true -Dtests.locale=ar-EG -Dtests.timezone=SystemV/MST7 -Dtests.asserts=true -Dtests.file.encoding=UTF-8
[junit4] FAILURE 0.01s J2 | ParsingFieldUpdateProcessorsTest.testParseFloatNonRootLocale <<<
[junit4] > Throwable #1: java.lang.AssertionError
[junit4] > at __randomizedtesting.SeedInfo.seed([AEB3D98A69A59B49:B56F245BC9006754]:0)
[junit4] > at org.apache.solr.update.processor.ParsingFieldUpdateProcessorsTest.testParseFloatNonRootLocale(ParsingFieldUpdateProcessorsTest.java:471)
[junit4] > at java.base/jdk.internal.reflect.NativeMethodAccessorImpl.invoke0(Native Method)
[junit4] > at java.base/jdk.internal.reflect.NativeMethodAccessorImpl.invoke(NativeMethodAccessorImpl.java:62)
[junit4] > at java.base/jdk.internal.reflect.DelegatingMethodAccessorImpl.invoke(DelegatingMethodAccessorImpl.java:43)
[junit4] > at java.base/java.lang.reflect.Method.invoke(Method.java:567)
[junit4] > at java.base/java.lang.Thread.run(Thread.java:830)
[junit4] 2> 668007 INFO (TEST-ParsingFieldUpdateProcessorsTest.testParseDateExplicitNotInSchemaSelector-seed#[AEB3D98A69A59B49]) [ ] o.a.s.SolrTestCaseJ4 ###Starting testParseDateExplicitNotInSchemaSelector
[junit4] 2> 668008 INFO (TEST-ParsingFieldUpdateProcessorsTest.testParseDateExplicitNotInSchemaSelector-seed#[AEB3D98A69A59B49]) [ ] o.a.s.SolrTestCaseJ4 ###Ending testParseDateExplicitNotInSchemaSelector
[junit4] 2> 668012 INFO (TEST-ParsingFieldUpdateProcessorsTest.testParseUSPacificDate-seed#[AEB3D98A69A59B49]) [ ] o.a.s.SolrTestCaseJ4 ###Starting testParseUSPacificDate
[junit4] 2> 668012 INFO (TEST-ParsingFieldUpdateProcessorsTest.testParseUSPacificDate-seed#[AEB3D98A69A59B49]) [ ] o.a.s.SolrTestCaseJ4 ###Ending testParseUSPacificDate
[junit4] 2> 668016 INFO (TEST-ParsingFieldUpdateProcessorsTest.testISO8601-seed#[AEB3D98A69A59B49]) [ ] o.a.s.SolrTestCaseJ4 ###Starting testISO8601
[junit4] 2> 668017 INFO (TEST-ParsingFieldUpdateProcessorsTest.testISO8601-seed#[AEB3D98A69A59B49]) [ ] o.a.s.u.DirectUpdateHandler2 start commit{,optimize=false,openSearcher=true,waitSearcher=true,expungeDeletes=false,softCommit=false,prepareCommit=false}
[junit4] 2> 668017 INFO (TEST-ParsingFieldUpdateProcessorsTest.testISO8601-seed#[AEB3D98A69A59B49]) [ ] o.a.s.u.SolrIndexWriter Calling setCommitData with IW:org.apache.solr.update.SolrIndexWriter@1c30d970 commitCommandVersion:0
[junit4] 2> 668019 INFO (TEST-ParsingFieldUpdateProcessorsTest.testISO8601-seed#[AEB3D98A69A59B49]) [ ] o.a.s.s.SolrIndexSearcher Opening [Searcher@74549deb[collection1] main]
[junit4] 2> 668019 INFO (TEST-ParsingFieldUpdateProcessorsTest.testISO8601-seed#[AEB3D98A69A59B49]) [ ] o.a.s.u.DirectUpdateHandler2 end_commit_flush
[junit4] 2> 668020 INFO (searcherExecutor-4135-thread-1) [ ] o.a.s.c.SolrCore [collection1] Registered new searcher Searcher@74549deb[collection1] main{ExitableDirectoryReader(UninvertingDirectoryReader(Uninverting(_0(8.2.0):C1:[diagnostics={os=Linux, java.vendor=Oracle Corporation, java.version=13-ea, java.vm.version=13-ea+26, lucene.version=8.2.0, os.arch=amd64, java.runtime.version=13-ea+26, source=flush, os.version=4.18.0-17-generic, timestamp=1561255134193}]:[attributes={Lucene50StoredFieldsFormat.mode=BEST_SPEED}]) Uninverting(_1(8.2.0):C1:[diagnostics={os=Linux, java.vendor=Oracle Corporation, java.version=13-ea, java.vm.version=13-ea+26, lucene.version=8.2.0, os.arch=amd64, java.runtime.version=13-ea+26, source=flush, os.version=4.18.0-17-generic, timestamp=1561255134216}]:[attributes={Lucene50StoredFieldsFormat.mode=BEST_SPEED}]) Uninverting(_2(8.2.0):C1:[diagnostics={os=Linux, java.vendor=Oracle Corporation, java.version=13-ea, java.vm.version=13-ea+26, lucene.version=8.2.0, os.arch=amd64, java.runtime.version=13-ea+26, source=flush, os.version=4.18.0-17-generic, timestamp=1561255134251}]:[attributes={Lucene50StoredFieldsFormat.mode=BEST_SPEED}]) Uninverting(_3(8.2.0):C1:[diagnostics={os=Linux, java.vendor=Oracle Corporation, java.version=13-ea, java.vm.version=13-ea+26, lucene.version=8.2.0, os.arch=amd64, java.runtime.version=13-ea+26, source=flush, os.version=4.18.0-17-generic, timestamp=1561255134264}]:[attributes={Lucene50StoredFieldsFormat.mode=BEST_SPEED}]) Uninverting(_4(8.2.0):C1:[diagnostics={os=Linux, java.vendor=Oracle Corporation, java.version=13-ea, java.vm.version=13-ea+26, lucene.version=8.2.0, os.arch=amd64, java.runtime.version=13-ea+26, source=flush, os.version=4.18.0-17-generic, timestamp=1561255134276}]:[attributes={Lucene50StoredFieldsFormat.mode=BEST_SPEED}]) Uninverting(_5(8.2.0):C1:[diagnostics={os=Linux, java.vendor=Oracle Corporation, java.version=13-ea, java.vm.version=13-ea+26, lucene.version=8.2.0, os.arch=amd64, java.runtime.version=13-ea+26, source=flush, os.version=4.18.0-17-generic, timestamp=1561255134304}]:[attributes={Lucene50StoredFieldsFormat.mode=BEST_SPEED}])))}
[junit4] 2> 668020 INFO (TEST-ParsingFieldUpdateProcessorsTest.testISO8601-seed#[AEB3D98A69A59B49]) [ ] o.a.s.u.p.LogUpdateProcessorFactory [collection1] webapp=null path=null params={}{commit=} 0 3
[junit4] 2> 668021 INFO (TEST-ParsingFieldUpdateProcessorsTest.testISO8601-seed#[AEB3D98A69A59B49]) [ ] o.a.s.c.S.Request [collection1] webapp=null path=null params={q=id:1&qt=&start=0&rows=20&version=2.2} hits=1 status=0 QTime=0
[junit4] 2> 668022 INFO (TEST-ParsingFieldUpdateProcessorsTest.testISO8601-seed#[AEB3D98A69A59B49]) [ ] o.a.s.u.DirectUpdateHandler2 start commit{,optimize=false,openSearcher=true,waitSearcher=true,expungeDeletes=false,softCommit=false,prepareCommit=false}
[junit4] 2> 668022 INFO (TEST-ParsingFieldUpdateProcessorsTest.testISO8601-seed#[AEB3D98A69A59B49]) [ ] o.a.s.u.SolrIndexWriter Calling setCommitData with IW:org.apache.solr.update.SolrIndexWriter@1c30d970 commitCommandVersion:0
[junit4] 2> 668024 INFO (TEST-ParsingFieldUpdateProcessorsTest.testISO8601-seed#[AEB3D98A69A59B49]) [ ] o.a.s.s.SolrIndexSearcher Opening [Searcher@70d6ed30[collection1] main]
[junit4] 2> 668024 INFO (TEST-ParsingFieldUpdateProcessorsTest.testISO8601-seed#[AEB3D98A69A59B49]) [ ] o.a.s.u.DirectUpdateHandler2 end_commit_flush
[junit4] 2> 668025 INFO (searcherExecutor-4135-thread-1) [ ] o.a.s.c.SolrCore [collection1] Registered new searcher Searcher@70d6ed30[collection1] main{ExitableDirectoryReader(UninvertingDirectoryReader(Uninverting(_0(8.2.0):C1:[diagnostics={os=Linux, java.vendor=Oracle Corporation, java.version=13-ea, java.vm.version=13-ea+26, lucene.version=8.2.0, os.arch=amd64, java.runtime.version=13-ea+26, source=flush, os.version=4.18.0-17-generic, timestamp=1561255134193}]:[attributes={Lucene50StoredFieldsFormat.mode=BEST_SPEED}]) Uninverting(_1(8.2.0):C1:[diagnostics={os=Linux, java.vendor=Oracle Corporation, java.version=13-ea, java.vm.version=13-ea+26, lucene.version=8.2.0, os.arch=amd64, java.runtime.version=13-ea+26, source=flush, os.version=4.18.0-17-generic, timestamp=1561255134216}]:[attributes={Lucene50StoredFieldsFormat.mode=BEST_SPEED}]) Uninverting(_2(8.2.0):C1:[diagnostics={os=Linux, java.vendor=Oracle Corporation, java.version=13-ea, java.vm.version=13-ea+26, lucene.version=8.2.0, os.arch=amd64, java.runtime.version=13-ea+26, source=flush, os.version=4.18.0-17-generic, timestamp=1561255134251}]:[attributes={Lucene50StoredFieldsFormat.mode=BEST_SPEED}]) Uninverting(_3(8.2.0):C1:[diagnostics={os=Linux, java.vendor=Oracle Corporation, java.version=13-ea, java.vm.version=13-ea+26, lucene.version=8.2.0, os.arch=amd64, java.runtime.version=13-ea+26, source=flush, os.version=4.18.0-17-generic, timestamp=1561255134264}]:[attributes={Lucene50StoredFieldsFormat.mode=BEST_SPEED}]) Uninverting(_4(8.2.0):C1:[diagnostics={os=Linux, java.vendor=Oracle Corporation, java.version=13-ea, java.vm.version=13-ea+26, lucene.version=8.2.0, os.arch=amd64, java.runtime.version=13-ea+26, source=flush, os.version=4.18.0-17-generic, timestamp=1561255134276}]:[attributes={Lucene50StoredFieldsFormat.mode=BEST_SPEED}]) Uninverting(_5(8.2.0):C1:[diagnostics={os=Linux, java.vendor=Oracle Corporation, java.version=13-ea, java.vm.version=13-ea+26, lucene.version=8.2.0, os.arch=amd64, java.runtime.version=13-ea+26, source=flush, os.version=4.18.0-17-generic, timestamp=1561255134304}]:[attributes={Lucene50StoredFieldsFormat.mode=BEST_SPEED}]) Uninverting(_6(8.2.0):C1:[diagnostics={os=Linux, java.vendor=Oracle Corporation, java.version=13-ea, java.vm.version=13-ea+26, lucene.version=8.2.0, os.arch=amd64, java.runtime.version=13-ea+26, source=flush, os.version=4.18.0-17-generic, timestamp=1561255134308}]:[attributes={Lucene50StoredFieldsFormat.mode=BEST_SPEED}])))}
[junit4] 2> 668025 INFO (TEST-ParsingFieldUpdateProcessorsTest.testISO8601-seed#[AEB3D98A69A59B49]) [ ] o.a.s.u.p.LogUpdateProcessorFactory [collection1] webapp=null path=null params={}{commit=} 0 4
[junit4] 2> 668026 INFO (TEST-ParsingFieldUpdateProcessorsTest.testISO8601-seed#[AEB3D98A69A59B49]) [ ] o.a.s.c.S.Request [collection1] webapp=null path=null params={q=id:2&qt=&start=0&rows=20&version=2.2} hits=1 status=0 QTime=0
[junit4] 2> 668027 INFO (TEST-ParsingFieldUpdateProcessorsTest.testISO8601-seed#[AEB3D98A69A59B49]) [ ] o.a.s.u.DirectUpdateHandler2 start commit{,optimize=false,openSearcher=true,waitSearcher=true,expungeDeletes=false,softCommit=false,prepareCommit=false}
[junit4] 2> 668027 INFO (TEST-ParsingFieldUpdateProcessorsTest.testISO8601-seed#[AEB3D98A69A59B49]) [ ] o.a.s.u.SolrIndexWriter Calling setCommitData with IW:org.apache.solr.update.SolrIndexWriter@1c30d970 commitCommandVersion:0
[junit4] 2> 668030 INFO (TEST-ParsingFieldUpdateProcessorsTest.testISO8601-seed#[AEB3D98A69A59B49]) [ ] o.a.s.s.SolrIndexSearcher Opening [Searcher@2923fb37[collection1] main]
[junit4] 2> 668030 INFO (TEST-ParsingFieldUpdateProcessorsTest.testISO8601-seed#[AEB3D98A69A59B49]) [ ] o.a.s.u.DirectUpdateHandler2 end_commit_flush
[junit4] 2> 668031 INFO (searcherExecutor-4135-thread-1) [ ] o.a.s.c.SolrCore [collection1] Registered new searcher Searcher@2923fb37[collection1] main{ExitableDirectoryReader(UninvertingDirectoryReader(Uninverting(_0(8.2.0):C1:[diagnostics={os=Linux, java.vendor=Oracle Corporation, java.version=13-ea, java.vm.version=13-ea+26, lucene.version=8.2.0, os.arch=amd64, java.runtime.version=13-ea+26, source=flush, os.version=4.18.0-17-generic, timestamp=1561255134193}]:[attributes={Lucene50StoredFieldsFormat.mode=BEST_SPEED}]) Uninverting(_1(8.2.0):C1:[diagnostics={os=Linux, java.vendor=Oracle Corporation, java.version=13-ea, java.vm.version=13-ea+26, lucene.version=8.2.0, os.arch=amd64, java.runtime.version=13-ea+26, source=flush, os.version=4.18.0-17-generic, timestamp=1561255134216}]:[attributes={Lucene50StoredFieldsFormat.mode=BEST_SPEED}]) Uninverting(_2(8.2.0):C1:[diagnostics={os=Linux, java.vendor=Oracle Corporation, java.version=13-ea, java.vm.version=13-ea+26, lucene.version=8.2.0, os.arch=amd64, java.runtime.version=13-ea+26, source=flush, os.version=4.18.0-17-generic, timestamp=1561255134251}]:[attributes={Lucene50StoredFieldsFormat.mode=BEST_SPEED}]) Uninverting(_3(8.2.0):C1:[diagnostics={os=Linux, java.vendor=Oracle Corporation, java.version=13-ea, java.vm.version=13-ea+26, lucene.version=8.2.0, os.arch=amd64, java.runtime.version=13-ea+26, source=flush, os.version=4.18.0-17-generic, timestamp=1561255134264}]:[attributes={Lucene50StoredFieldsFormat.mode=BEST_SPEED}]) Uninverting(_4(8.2.0):C1:[diagnostics={os=Linux, java.vendor=Oracle Corporation, java.version=13-ea, java.vm.version=13-ea+26, lucene.version=8.2.0, os.arch=amd64, java.runtime.version=13-ea+26, source=flush, os.version=4.18.0-17-generic, timestamp=1561255134276}]:[attributes={Lucene50StoredFieldsFormat.mode=BEST_SPEED}]) Uninverting(_5(8.2.0):C1:[diagnostics={os=Linux, java.vendor=Oracle Corporation, java.version=13-ea, java.vm.version=13-ea+26, lucene.version=8.2.0, os.arch=amd64, java.runtime.version=13-ea+26, source=flush, os.version=4.18.0-17-generic, timestamp=1561255134304}]:[attributes={Lucene50StoredFieldsFormat.mode=BEST_SPEED}]) Uninverting(_6(8.2.0):C1:[diagnostics={os=Linux, java.vendor=Oracle Corporation, java.version=13-ea, java.vm.version=13-ea+26, lucene.version=8.2.0, os.arch=amd64, java.runtime.version=13-ea+26, source=flush, os.version=4.18.0-17-generic, timestamp=1561255134308}]:[attributes={Lucene50StoredFieldsFormat.mode=BEST_SPEED}]) Uninverting(_7(8.2.0):C1:[diagnostics={os=Linux, java.vendor=Oracle Corporation, java.version=13-ea, java.vm.version=13-ea+26, lucene.version=8.2.0, os.arch=amd64, java.runtime.version=13-ea+26, source=flush, os.version=4.18.0-17-generic, timestamp=1561255134314}]:[attributes={Lucene50StoredFieldsFormat.mode=BEST_SPEED}])))}
[junit4] 2> 668031 INFO (TEST-ParsingFieldUpdateProcessorsTest.testISO8601-seed#[AEB3D98A69A59B49]) [ ] o.a.s.u.p.LogUpdateProcessorFactory [collection1] webapp=null path=null params={}{commit=} 0 4
[junit4] 2> 668032 INFO (TEST-ParsingFieldUpdateProcessorsTest.testISO8601-seed#[AEB3D98A69A59B49]) [ ] o.a.s.c.S.Request [collection1] webapp=null path=null params={q=id:3&qt=&start=0&rows=20&version=2.2} hits=1 status=0 QTime=0
[junit4] 2> 668033 INFO (TEST-ParsingFieldUpdateProcessorsTest.testISO8601-seed#[AEB3D98A69A59B49]) [ ] o.a.s.u.DirectUpdateHandler2 start commit{,optimize=false,openSearcher=true,waitSearcher=true,expungeDeletes=false,softCommit=false,prepareCommit=false}
[junit4] 2> 668033 INFO (TEST-ParsingFieldUpdateProcessorsTest.testISO8601-seed#[AEB3D98A69A59B49]) [ ] o.a.s.u.SolrIndexWriter Calling setCommitData with IW:org.apache.solr.update.SolrIndexWriter@1c30d970 commitCommandVersion:0
[junit4] 2> 668035 INFO (TEST-ParsingFieldUpdateProcessorsTest.testISO8601-seed#[AEB3D98A69A59B49]) [ ] o.a.s.s.SolrIndexSearcher Opening [Searcher@15304bf1[collection1] main]
[junit4] 2> 668036 INFO (TEST-ParsingFieldUpdateProcessorsTest.testISO8601-seed#[AEB3D98A69A59B49]) [ ] o.a.s.u.DirectUpdateHandler2 end_commit_flush
[junit4] 2> 668037 INFO (searcherExecutor-4135-thread-1) [ ] o.a.s.c.SolrCore [collection1] Registered new searcher Searcher@15304bf1[collection1] main{ExitableDirectoryReader(UninvertingDirectoryReader(Uninverting(_0(8.2.0):C1:[diagnostics={os=Linux, java.vendor=Oracle Corporation, java.version=13-ea, java.vm.version=13-ea+26, lucene.version=8.2.0, os.arch=amd64, java.runtime.version=13-ea+26, source=flush, os.version=4.18.0-17-generic, timestamp=1561255134193}]:[attributes={Lucene50StoredFieldsFormat.mode=BEST_SPEED}]) Uninverting(_1(8.2.0):C1:[diagnostics={os=Linux, java.vendor=Oracle Corporation, java.version=13-ea, java.vm.version=13-ea+26, lucene.version=8.2.0, os.arch=amd64, java.runtime.version=13-ea+26, source=flush, os.version=4.18.0-17-generic, timestamp=1561255134216}]:[attributes={Lucene50StoredFieldsFormat.mode=BEST_SPEED}]) Uninverting(_2(8.2.0):C1:[diagnostics={os=Linux, java.vendor=Oracle Corporation, java.version=13-ea, java.vm.version=13-ea+26, lucene.version=8.2.0, os.arch=amd64, java.runtime.version=13-ea+26, source=flush, os.version=4.18.0-17-generic, timestamp=1561255134251}]:[attributes={Lucene50StoredFieldsFormat.mode=BEST_SPEED}]) Uninverting(_3(8.2.0):C1:[diagnostics={os=Linux, java.vendor=Oracle Corporation, java.version=13-ea, java.vm.version=13-ea+26, lucene.version=8.2.0, os.arch=amd64, java.runtime.version=13-ea+26, source=flush, os.version=4.18.0-17-generic, timestamp=1561255134264}]:[attributes={Lucene50StoredFieldsFormat.mode=BEST_SPEED}]) Uninverting(_4(8.2.0):C1:[diagnostics={os=Linux, java.vendor=Oracle Corporation, java.version=13-ea, java.vm.version=13-ea+26, lucene.version=8.2.0, os.arch=amd64, java.runtime.version=13-ea+26, source=flush, os.version=4.18.0-17-generic, timestamp=1561255134276}]:[attributes={Lucene50StoredFieldsFormat.mode=BEST_SPEED}]) Uninverting(_5(8.2.0):C1:[diagnostics={os=Linux, java.vendor=Oracle Corporation, java.version=13-ea, java.vm.version=13-ea+26, lucene.version=8.2.0, os.arch=amd64, java.runtime.version=13-ea+26, source=flush, os.version=4.18.0-17-generic, timestamp=1561255134304}]:[attributes={Lucene50StoredFieldsFormat.mode=BEST_SPEED}]) Uninverting(_6(8.2.0):C1:[diagnostics={os=Linux, java.vendor=Oracle Corporation, java.version=13-ea, java.vm.version=13-ea+26, lucene.version=8.2.0, os.arch=amd64, java.runtime.version=13-ea+26, source=flush, os.version=4.18.0-17-generic, timestamp=1561255134308}]:[attributes={Lucene50StoredFieldsFormat.mode=BEST_SPEED}]) Uninverting(_7(8.2.0):C1:[diagnostics={os=Linux, java.vendor=Oracle Corporation, java.version=13-ea, java.vm.version=13-ea+26, lucene.version=8.2.0, os.arch=amd64, java.runtime.version=13-ea+26, source=flush, os.version=4.18.0-17-generic, timestamp=1561255134314}]:[attributes={Lucene50StoredFieldsFormat.mode=BEST_SPEED}]) Uninverting(_8(8.2.0):C1:[diagnostics={os=Linux, java.vendor=Oracle Corporation, java.version=13-ea, java.vm.version=13-ea+26, lucene.version=8.2.0, os.arch=amd64, java.runtime.version=13-ea+26, source=flush, os.version=4.18.0-17-generic, timestamp=1561255134320}]:[attributes={Lucene50StoredFieldsFormat.mode=BEST_SPEED}])))}
[junit4] 2> 668037 INFO (TEST-ParsingFieldUpdateProcessorsTest.testISO8601-seed#[AEB3D98A69A59B49]) [ ] o.a.s.u.p.LogUpdateProcessorFactory [collection1] webapp=null path=null params={}{commit=} 0 3
[junit4] 2> 668040 INFO (TEST-ParsingFieldUpdateProcessorsTest.testISO8601-seed#[AEB3D98A69A59B49]) [ ] o.a.s.c.S.Request [collection1] webapp=null path=null params={q=id:4&qt=&start=0&rows=20&version=2.2} hits=1 status=0 QTime=2
[junit4] 2> 668041 INFO (TEST-ParsingFieldUpdateProcessorsTest.testISO8601-seed#[AEB3D98A69A59B49]) [ ] o.a.s.u.DirectUpdateHandler2 start commit{,optimize=false,openSearcher=true,waitSearcher=true,expungeDeletes=false,softCommit=false,prepareCommit=false}
[junit4] 2> 668041 INFO (TEST-ParsingFieldUpdateProcessorsTest.testISO8601-seed#[AEB3D98A69A59B49]) [ ] o.a.s.u.SolrIndexWriter Calling setCommitData with IW:org.apache.solr.update.SolrIndexWriter@1c30d970 commitCommandVersion:0
[junit4] 2> 668043 INFO (TEST-ParsingFieldUpdateProcessorsTest.testISO8601-seed#[AEB3D98A69A59B49]) [ ] o.a.s.s.SolrIndexSearcher Opening [Searcher@3e2f1981[collection1] main]
[junit4] 2> 668044 INFO (TEST-ParsingFieldUpdateProcessorsTest.testISO8601-seed#[AEB3D98A69A59B49]) [ ] o.a.s.u.DirectUpdateHandler2 end_commit_flush
[junit4] 2> 668045 INFO (searcherExecutor-4135-thread-1) [ ] o.a.s.c.SolrCore [collection1] Registered new searcher Searcher@3e2f1981[collection1] main{ExitableDirectoryReader(UninvertingDirectoryReader(Uninverting(_0(8.2.0):C1:[diagnostics={os=Linux, java.vendor=Oracle Corporation, java.version=13-ea, java.vm.version=13-ea+26, lucene.version=8.2.0, os.arch=amd64, java.runtime.version=13-ea+26, source=flush, os.version=4.18.0-17-generic, timestamp=1561255134193}]:[attributes={Lucene50StoredFieldsFormat.mode=BEST_SPEED}]) Uninverting(_1(8.2.0):C1:[diagnostics={os=Linux, java.vendor=Oracle Corporation, java.version=13-ea, java.vm.version=13-ea+26, lucene.version=8.2.0, os.arch=amd64, java.runtime.version=13-ea+26, source=flush, os.version=4.18.0-17-generic, timestamp=1561255134216}]:[attributes={Lucene50StoredFieldsFormat.mode=BEST_SPEED}]) Uninverting(_2(8.2.0):C1:[diagnostics={os=Linux, java.vendor=Oracle Corporation, java.version=13-ea, java.vm.version=13-ea+26, lucene.version=8.2.0, os.arch=amd64, java.runtime.version=13-ea+26, source=flush, os.version=4.18.0-17-generic, timestamp=1561255134251}]:[attributes={Lucene50StoredFieldsFormat.mode=BEST_SPEED}]) Uninverting(_3(8.2.0):C1:[diagnostics={os=Linux, java.vendor=Oracle Corporation, java.version=13-ea, java.vm.version=13-ea+26, lucene.version=8.2.0, os.arch=amd64, java.runtime.version=13-ea+26, source=flush, os.version=4.18.0-17-generic, timestamp=1561255134264}]:[attributes={Lucene50StoredFieldsFormat.mode=BEST_SPEED}]) Uninverting(_4(8.2.0):C1:[diagnostics={os=Linux, java.vendor=Oracle Corporation, java.version=13-ea, java.vm.version=13-ea+26, lucene.version=8.2.0, os.arch=amd64, java.runtime.version=13-ea+26, source=flush, os.version=4.18.0-17-generic, timestamp=1561255134276}]:[attributes={Lucene50StoredFieldsFormat.mode=BEST_SPEED}]) Uninverting(_5(8.2.0):C1:[diagnostics={os=Linux, java.vendor=Oracle Corporation, java.version=13-ea, java.vm.version=13-ea+26, lucene.version=8.2.0, os.arch=amd64, java.runtime.version=13-ea+26, source=flush, os.version=4.18.0-17-generic, timestamp=1561255134304}]:[attributes={Lucene50StoredFieldsFormat.mode=BEST_SPEED}]) Uninverting(_6(8.2.0):C1:[diagnostics={os=Linux, java.vendor=Oracle Corporation, java.version=13-ea, java.vm.version=13-ea+26, lucene.version=8.2.0, os.arch=amd64, java.runtime.version=13-ea+26, source=flush, os.version=4.18.0-17-generic, timestamp=1561255134308}]:[attributes={Lucene50StoredFieldsFormat.mode=BEST_SPEED}]) Uninverting(_7(8.2.0):C1:[diagnostics={os=Linux, java.vendor=Oracle Corporation, java.version=13-ea, java.vm.version=13-ea+26, lucene.version=8.2.0, os.arch=amd64, java.runtime.version=13-ea+26, source=flush, os.version=4.18.0-17-generic, timestamp=1561255134314}]:[attributes={Lucene50StoredFieldsFormat.mode=BEST_SPEED}]) Uninverting(_8(8.2.0):C1:[diagnostics={os=Linux, java.vendor=Oracle Corporation, java.version=13-ea, java.vm.version=13-ea+26, lucene.version=8.2.0, os.arch=amd64, java.runtime.version=13-ea+26, source=flush, os.version=4.18.0-17-generic, timestamp=1561255134320}]:[attributes={Lucene50StoredFieldsFormat.mode=BEST_SPEED}]) Uninverting(_9(8.2.0):C1:[diagnostics={os=Linux, java.vendor=Oracle Corporation, java.version=13-ea, java.vm.version=13-ea+26, lucene.version=8.2.0, os.arch=amd64, java.runtime.version=13-ea+26, source=flush, os.version=4.18.0-17-generic, timestamp=1561255134328}]:[attributes={Lucene50StoredFieldsFormat.mode=BEST_SPEED}])))}
[junit4] 2> 668045 INFO (TEST-ParsingFieldUpdateProcessorsTest.testISO8601-seed#[AEB3D98A69A59B49]) [ ] o.a.s.u.p.LogUpdateProcessorFactory [collection1] webapp=null path=null params={}{commit=} 0 4
[junit4] 2> 668046 INFO (TEST-ParsingFieldUpdateProcessorsTest.testISO8601-seed#[AEB3D98A69A59B49]) [ ] o.a.s.c.S.Request [collection1] webapp=null path=null params={q=id:5&qt=&start=0&rows=20&version=2.2} hits=1 status=0 QTime=0
[junit4] 2> 668047 INFO (TEST-ParsingFieldUpdateProcessorsTest.testISO8601-seed#[AEB3D98A69A59B49]) [ ] o.a.s.u.DirectUpdateHandler2 start commit{,optimize=false,openSearcher=true,waitSearcher=true,expungeDeletes=false,softCommit=false,prepareCommit=false}
[junit4] 2> 668047 INFO (TEST-ParsingFieldUpdateProcessorsTest.testISO8601-seed#[AEB3D98A69A59B49]) [ ] o.a.s.u.SolrIndexWriter Calling setCommitData with IW:org.apache.solr.update.SolrIndexWriter@1c30d970 commitCommandVersion:0
[junit4] 2> 668055 INFO (TEST-ParsingFieldUpdateProcessorsTest.testISO8601-seed#[AEB3D98A69A59B49]) [ ] o.a.s.s.SolrIndexSearcher Opening [Searcher@6607c8b7[collection1] main]
[junit4] 2> 668057 INFO (TEST-ParsingFieldUpdateProcessorsTest.testISO8601-seed#[AEB3D98A69A59B49]) [ ] o.a.s.u.DirectUpdateHandler2 end_commit_flush
[junit4] 2> 668058 INFO (searcherExecutor-4135-thread-1) [ ] o.a.s.c.SolrCore [collection1] Registered new searcher Searcher@6607c8b7[collection1] main{ExitableDirectoryReader(UninvertingDirectoryReader(Uninverting(_0(8.2.0):C1:[diagnostics={os=Linux, java.vendor=Oracle Corporation, java.version=13-ea, java.vm.version=13-ea+26, lucene.version=8.2.0, os.arch=amd64, java.runtime.version=13-ea+26, source=flush, os.version=4.18.0-17-generic, timestamp=1561255134193}]:[attributes={Lucene50StoredFieldsFormat.mode=BEST_SPEED}]) Uninverting(_1(8.2.0):C1:[diagnostics={os=Linux, java.vendor=Oracle Corporation, java.version=13-ea, java.vm.version=13-ea+26, lucene.version=8.2.0, os.arch=amd64, java.runtime.version=13-ea+26, source=flush, os.version=4.18.0-17-generic, timestamp=1561255134216}]:[attributes={Lucene50StoredFieldsFormat.mode=BEST_SPEED}]) Uninverting(_2(8.2.0):C1:[diagnostics={os=Linux, java.vendor=Oracle Corporation, java.version=13-ea, java.vm.version=13-ea+26, lucene.version=8.2.0, os.arch=amd64, java.runtime.version=13-ea+26, source=flush, os.version=4.18.0-17-generic, timestamp=1561255134251}]:[attributes={Lucene50StoredFieldsFormat.mode=BEST_SPEED}]) Uninverting(_3(8.2.0):C1:[diagnostics={os=Linux, java.vendor=Oracle Corporation, java.version=13-ea, java.vm.version=13-ea+26, lucene.version=8.2.0, os.arch=amd64, java.runtime.version=13-ea+26, source=flush, os.version=4.18.0-17-generic, timestamp=1561255134264}]:[attributes={Lucene50StoredFieldsFormat.mode=BEST_SPEED}]) Uninverting(_4(8.2.0):C1:[diagnostics={os=Linux, java.vendor=Oracle Corporation, java.version=13-ea, java.vm.version=13-ea+26, lucene.version=8.2.0, os.arch=amd64, java.runtime.version=13-ea+26, source=flush, os.version=4.18.0-17-generic, timestamp=1561255134276}]:[attributes={Lucene50StoredFieldsFormat.mode=BEST_SPEED}]) Uninverting(_5(8.2.0):C1:[diagnostics={os=Linux, java.vendor=Oracle Corporation, java.version=13-ea, java.vm.version=13-ea+26, lucene.version=8.2.0, os.arch=amd64, java.runtime.version=13-ea+26, source=flush, os.version=4.18.0-17-generic, timestamp=1561255134304}]:[attributes={Lucene50StoredFieldsFormat.mode=BEST_SPEED}]) Uninverting(_6(8.2.0):C1:[diagnostics={os=Linux, java.vendor=Oracle Corporation, java.version=13-ea, java.vm.version=13-ea+26, lucene.version=8.2.0, os.arch=amd64, java.runtime.version=13-ea+26, source=flush, os.version=4.18.0-17-generic, timestamp=1561255134308}]:[attributes={Lucene50StoredFieldsFormat.mode=BEST_SPEED}]) Uninverting(_7(8.2.0):C1:[diagnostics={os=Linux, java.vendor=Oracle Corporation, java.version=13-ea, java.vm.version=13-ea+26, lucene.version=8.2.0, os.arch=amd64, java.runtime.version=13-ea+26, source=flush, os.version=4.18.0-17-generic, timestamp=1561255134314}]:[attributes={Lucene50StoredFieldsFormat.mode=BEST_SPEED}]) Uninverting(_8(8.2.0):C1:[diagnostics={os=Linux, java.vendor=Oracle Corporation, java.version=13-ea, java.vm.version=13-ea+26, lucene.version=8.2.0, os.arch=amd64, java.runtime.version=13-ea+26, source=flush, os.version=4.18.0-17-generic, timestamp=1561255134320}]:[attributes={Lucene50StoredFieldsFormat.mode=BEST_SPEED}]) Uninverting(_9(8.2.0):C1:[diagnostics={os=Linux, java.vendor=Oracle Corporation, java.version=13-ea, java.vm.version=13-ea+26, lucene.version=8.2.0, os.arch=amd64, java.runtime.version=13-ea+26, source=flush, os.version=4.18.0-17-generic, timestamp=1561255134328}]:[attributes={Lucene50StoredFieldsFormat.mode=BEST_SPEED}]) Uninverting(_a(8.2.0):C1:[diagnostics={os=Linux, java.vendor=Oracle Corporation, java.version=13-ea, java.vm.version=13-ea+26, lucene.version=8.2.0, os.arch=amd64, java.runtime.version=13-ea+26, source=flush, os.version=4.18.0-17-generic, timestamp=1561255134333}]:[attributes={Lucene50StoredFieldsFormat.mode=BEST_SPEED}])))}
[junit4] 2> 668058 INFO (TEST-ParsingFieldUpdateProcessorsTest.testISO8601-seed#[AEB3D98A69A59B49]) [ ] o.a.s.u.p.LogUpdateProcessorFactory [collection1] webapp=null path=null params={}{commit=} 0 11
[junit4] 2> 668058 INFO (TEST-ParsingFieldUpdateProcessorsTest.testISO8601-seed#[AEB3D98A69A59B49]) [ ] o.a.s.c.S.Request [collection1] webapp=null path=null params={q=id:6&qt=&start=0&rows=20&version=2.2} hits=1 status=0 QTime=0
[junit4] 2> 668063 INFO (TEST-ParsingFieldUpdateProcessorsTest.testISO8601-seed#[AEB3D98A69A59B49]) [ ] o.a.s.SolrTestCaseJ4 ###Ending testISO8601
[junit4] 2> 668069 INFO (TEST-ParsingFieldUpdateProcessorsTest.testParseDateManyFormats-seed#[AEB3D98A69A59B49]) [ ] o.a.s.SolrTestCaseJ4 ###Starting testParseDateManyFormats
[junit4] 2> 668077 INFO (TEST-ParsingFieldUpdateProcessorsTest.testParseDateManyFormats-seed#[AEB3D98A69A59B49]) [ ] o.a.s.SolrTestCaseJ4 ###Ending testParseDateManyFormats
[junit4] 2> 668085 INFO (TEST-ParsingFieldUpdateProcessorsTest.testParseQuotedDate-seed#[AEB3D98A69A59B49]) [ ] o.a.s.SolrTestCaseJ4 ###Starting testParseQuotedDate
[junit4] 2> 668086 INFO (TEST-ParsingFieldUpdateProcessorsTest.testParseQuotedDate-seed#[AEB3D98A69A59B49]) [ ] o.a.s.SolrTestCaseJ4 ###Ending testParseQuotedDate
[junit4] 2> 668090 INFO (TEST-ParsingFieldUpdateProcessorsTest.testEDTZone-seed#[AEB3D98A69A59B49]) [ ] o.a.s.SolrTestCaseJ4 ###Starting testEDTZone
[junit4] 2> 668090 INFO (TEST-ParsingFieldUpdateProcessorsTest.testEDTZone-seed#[AEB3D98A69A59B49]) [ ] o.a.s.SolrTestCaseJ4 ###Ending testEDTZone
[junit4] 2> 668093 INFO (TEST-ParsingFieldUpdateProcessorsTest.testIntOverflow-seed#[AEB3D98A69A59B49]) [ ] o.a.s.SolrTestCaseJ4 ###Starting testIntOverflow
[junit4] 2> 668093 INFO (TEST-ParsingFieldUpdateProcessorsTest.testIntOverflow-seed#[AEB3D98A69A59B49]) [ ] o.a.s.SolrTestCaseJ4 ###Ending testIntOverflow
[junit4] 2> 668096 INFO (TEST-ParsingFieldUpdateProcessorsTest.testCascadingParsers-seed#[AEB3D98A69A59B49]) [ ] o.a.s.SolrTestCaseJ4 ###Starting testCascadingParsers
[junit4] 2> 668121 INFO (TEST-ParsingFieldUpdateProcessorsTest.testCascadingParsers-seed#[AEB3D98A69A59B49]) [ ] o.a.s.SolrTestCaseJ4 ###Ending testCascadingParsers
[junit4] 2> 668129 INFO (TEST-ParsingFieldUpdateProcessorsTest.testParseDateRoundTrip-seed#[AEB3D98A69A59B49]) [ ] o.a.s.SolrTestCaseJ4 ###Starting testParseDateRoundTrip
[junit4] 2> 668129 INFO (TEST-ParsingFieldUpdateProcessorsTest.testParseDateRoundTrip-seed#[AEB3D98A69A59B49]) [ ] o.a.s.u.DirectUpdateHandler2 start commit{,optimize=false,openSearcher=true,waitSearcher=true,expungeDeletes=false,softCommit=false,prepareCommit=false}
[junit4] 2> 668129 INFO (TEST-ParsingFieldUpdateProcessorsTest.testParseDateRoundTrip-seed#[AEB3D98A69A59B49]) [ ] o.a.s.u.SolrIndexWriter Calling setCommitData with IW:org.apache.solr.update.SolrIndexWriter@1c30d970 commitCommandVersion:0
[junit4] 2> 668132 INFO (TEST-ParsingFieldUpdateProcessorsTest.testParseDateRoundTrip-seed#[AEB3D98A69A59B49]) [ ] o.a.s.s.SolrIndexSearcher Opening [Searcher@35913c91[collection1] main]
[junit4] 2> 668133 INFO (searcherExecutor-4135-thread-1) [ ] o.a.s.c.SolrCore [collection1] Registered new searcher Searcher@35913c91[collection1] main{ExitableDirectoryReader(UninvertingDirectoryReader(Uninverting(_b(8.2.0):C10/1:[diagnostics={os=Linux, java.version=13-ea, os.arch=amd64, java.runtime.version=13-ea+26, source=merge, os.version=4.18.0-17-generic, java.vendor=Oracle Corporation, java.vm.version=13-ea+26, lucene.version=8.2.0, mergeMaxNumSegments=-1, mergeFactor=10, timestamp=1561255134342}]:[attributes={Lucene50StoredFieldsFormat.mode=BEST_SPEED}]:delGen=1) Uninverting(_3(8.2.0):C1:[diagnostics={os=Linux, java.vendor=Oracle Corporation, java.version=13-ea, java.vm.version=13-ea+26, lucene.version=8.2.0, os.arch=amd64, java.runtime.version=13-ea+26, source=flush, os.version=4.18.0-17-generic, timestamp=1561255134264}]:[attributes={Lucene50StoredFieldsFormat.mode=BEST_SPEED}]) Uninverting(_c(8.2.0):C7/2:[diagnostics={os=Linux, java.vendor=Oracle Corporation, java.version=13-ea, java.vm.version=13-ea+26, lucene.version=8.2.0, os.arch=amd64, java.runtime.versio
[...truncated too long message...]
teProcessorsTest.testParseDateFieldNotInSchema-seed#[AEB3D98A69A59B49]) [ ] o.a.s.SolrTestCaseJ4 ###Ending testParseDateFieldNotInSchema
[junit4] OK 0.00s J0 | ParsingFieldUpdateProcessorsTest.testParseDateFieldNotInSchema
[junit4] 2> 16067 INFO (TEST-ParsingFieldUpdateProcessorsTest.testRfc1036-seed#[AEB3D98A69A59B49]) [ ] o.a.s.SolrTestCaseJ4 ###Starting testRfc1036
[junit4] 2> 16069 INFO (TEST-ParsingFieldUpdateProcessorsTest.testRfc1036-seed#[AEB3D98A69A59B49]) [ ] o.a.s.SolrTestCaseJ4 ###Ending testRfc1036
[junit4] OK 0.00s J0 | ParsingFieldUpdateProcessorsTest.testRfc1036
[junit4] 2> 16072 INFO (TEST-ParsingFieldUpdateProcessorsTest.testMixedFloats-seed#[AEB3D98A69A59B49]) [ ] o.a.s.SolrTestCaseJ4 ###Starting testMixedFloats
[junit4] 2> 16073 INFO (TEST-ParsingFieldUpdateProcessorsTest.testMixedFloats-seed#[AEB3D98A69A59B49]) [ ] o.a.s.SolrTestCaseJ4 ###Ending testMixedFloats
[junit4] OK 0.00s J0 | ParsingFieldUpdateProcessorsTest.testMixedFloats
[junit4] 2> 16076 INFO (TEST-ParsingFieldUpdateProcessorsTest.testParseTrieLongRoundTrip-seed#[AEB3D98A69A59B49]) [ ] o.a.s.SolrTestCaseJ4 ###Starting testParseTrieLongRoundTrip
[junit4] 2> 16077 INFO (TEST-ParsingFieldUpdateProcessorsTest.testParseTrieLongRoundTrip-seed#[AEB3D98A69A59B49]) [ ] o.a.s.u.DirectUpdateHandler2 start commit{,optimize=false,openSearcher=true,waitSearcher=true,expungeDeletes=false,softCommit=false,prepareCommit=false}
[junit4] 2> 16077 INFO (TEST-ParsingFieldUpdateProcessorsTest.testParseTrieLongRoundTrip-seed#[AEB3D98A69A59B49]) [ ] o.a.s.u.SolrIndexWriter Calling setCommitData with IW:org.apache.solr.update.SolrIndexWriter@e269e55 commitCommandVersion:0
[junit4] 2> 16082 INFO (TEST-ParsingFieldUpdateProcessorsTest.testParseTrieLongRoundTrip-seed#[AEB3D98A69A59B49]) [ ] o.a.s.s.SolrIndexSearcher Opening [Searcher@17ae6212[collection1] main]
[junit4] 2> 16085 INFO (searcherExecutor-25-thread-1) [ ] o.a.s.c.SolrCore [collection1] Registered new searcher Searcher@17ae6212[collection1] main{ExitableDirectoryReader(UninvertingDirectoryReader(Uninverting(_f(8.2.0):C15/3:[diagnostics={os=Linux, java.version=13-ea, os.arch=amd64, java.runtime.version=13-ea+26, source=merge, os.version=4.18.0-17-generic, java.vendor=Oracle Corporation, java.vm.version=13-ea+26, lucene.version=8.2.0, mergeMaxNumSegments=-1, mergeFactor=5, timestamp=1561258045834}]:[attributes={Lucene50StoredFieldsFormat.mode=BEST_SPEED}]:delGen=2) Uninverting(_g(8.2.0):C1:[diagnostics={os=Linux, java.vendor=Oracle Corporation, java.version=13-ea, java.vm.version=13-ea+26, lucene.version=8.2.0, os.arch=amd64, java.runtime.version=13-ea+26, source=flush, os.version=4.18.0-17-generic, timestamp=1561258045862}]:[attributes={Lucene50StoredFieldsFormat.mode=BEST_SPEED}]) Uninverting(_i(8.2.0):C2/1:[diagnostics={os=Linux, java.vendor=Oracle Corporation, java.version=13-ea, java.vm.version=13-ea+26, lucene.version=8.2.0, os.arch=amd64, java.runtime.version=13-ea+26, source=flush, os.version=4.18.0-17-generic, timestamp=1561258045934}]:[attributes={Lucene50StoredFieldsFormat.mode=BEST_SPEED}]:delGen=1) Uninverting(_j(8.2.0):C2:[diagnostics={os=Linux, java.vendor=Oracle Corporation, java.version=13-ea, java.vm.version=13-ea+26, lucene.version=8.2.0, os.arch=amd64, java.runtime.version=13-ea+26, source=flush, os.version=4.18.0-17-generic, timestamp=1561258045963}]:[attributes={Lucene50StoredFieldsFormat.mode=BEST_SPEED}])))}
[junit4] 2> 16088 INFO (TEST-ParsingFieldUpdateProcessorsTest.testParseTrieLongRoundTrip-seed#[AEB3D98A69A59B49]) [ ] o.a.s.u.DirectUpdateHandler2 end_commit_flush
[junit4] 2> 16088 INFO (TEST-ParsingFieldUpdateProcessorsTest.testParseTrieLongRoundTrip-seed#[AEB3D98A69A59B49]) [ ] o.a.s.u.p.LogUpdateProcessorFactory [collection1] webapp=null path=null params={}{commit=} 0 11
[junit4] 2> 16092 INFO (TEST-ParsingFieldUpdateProcessorsTest.testParseTrieLongRoundTrip-seed#[AEB3D98A69A59B49]) [ ] o.a.s.c.S.Request [collection1] webapp=null path=null params={q=id:113&qt=&start=0&rows=20&version=2.2} hits=1 status=0 QTime=2
[junit4] 2> 16093 INFO (TEST-ParsingFieldUpdateProcessorsTest.testParseTrieLongRoundTrip-seed#[AEB3D98A69A59B49]) [ ] o.a.s.SolrTestCaseJ4 ###Ending testParseTrieLongRoundTrip
[junit4] OK 0.02s J0 | ParsingFieldUpdateProcessorsTest.testParseTrieLongRoundTrip
[junit4] 2> 16093 INFO (SUITE-ParsingFieldUpdateProcessorsTest-seed#[AEB3D98A69A59B49]-worker) [ ] o.a.s.SolrTestCaseJ4 ###deleteCore
[junit4] 2> 16093 INFO (SUITE-ParsingFieldUpdateProcessorsTest-seed#[AEB3D98A69A59B49]-worker) [ ] o.a.s.c.CoreContainer Shutting down CoreContainer instance=762860329
[junit4] 2> 16099 INFO (coreCloseExecutor-29-thread-1) [ x:collection1 ] o.a.s.c.SolrCore [collection1] CLOSING SolrCore org.apache.solr.core.SolrCore@812dedc
[junit4] 2> 16099 INFO (coreCloseExecutor-29-thread-1) [ x:collection1 ] o.a.s.m.SolrMetricManager Closing metric reporters for registry=solr.core.collection1, tag=812dedc
[junit4] 2> 16099 INFO (coreCloseExecutor-29-thread-1) [ x:collection1 ] o.a.s.m.r.SolrJmxReporter Closing reporter [org.apache.solr.metrics.reporters.SolrJmxReporter@12e21d10: rootName = null, domain = solr.core.collection1, service url = null, agent id = null] for registry solr.core.collection1 / com.codahale.metrics.MetricRegistry@7a31d976
[junit4] 2> 16124 INFO (SUITE-ParsingFieldUpdateProcessorsTest-seed#[AEB3D98A69A59B49]-worker) [ ] o.a.s.m.SolrMetricManager Closing metric reporters for registry=solr.node, tag=null
[junit4] 2> 16124 INFO (SUITE-ParsingFieldUpdateProcessorsTest-seed#[AEB3D98A69A59B49]-worker) [ ] o.a.s.m.r.SolrJmxReporter Closing reporter [org.apache.solr.metrics.reporters.SolrJmxReporter@6ed53633: rootName = null, domain = solr.node, service url = null, agent id = null] for registry solr.node / com.codahale.metrics.MetricRegistry@53ab7b74
[junit4] 2> 16129 INFO (SUITE-ParsingFieldUpdateProcessorsTest-seed#[AEB3D98A69A59B49]-worker) [ ] o.a.s.m.SolrMetricManager Closing metric reporters for registry=solr.jvm, tag=null
[junit4] 2> 16129 INFO (SUITE-ParsingFieldUpdateProcessorsTest-seed#[AEB3D98A69A59B49]-worker) [ ] o.a.s.m.r.SolrJmxReporter Closing reporter [org.apache.solr.metrics.reporters.SolrJmxReporter@3e0d315: rootName = null, domain = solr.jvm, service url = null, agent id = null] for registry solr.jvm / com.codahale.metrics.MetricRegistry@5a568ca5
[junit4] 2> 16129 INFO (SUITE-ParsingFieldUpdateProcessorsTest-seed#[AEB3D98A69A59B49]-worker) [ ] o.a.s.m.SolrMetricManager Closing metric reporters for registry=solr.jetty, tag=null
[junit4] 2> 16129 INFO (SUITE-ParsingFieldUpdateProcessorsTest-seed#[AEB3D98A69A59B49]-worker) [ ] o.a.s.m.r.SolrJmxReporter Closing reporter [org.apache.solr.metrics.reporters.SolrJmxReporter@39d5ec75: rootName = null, domain = solr.jetty, service url = null, agent id = null] for registry solr.jetty / com.codahale.metrics.MetricRegistry@a9479f5
[junit4] 2> NOTE: leaving temporary files on disk at: /home/jenkins/workspace/Lucene-Solr-8.x-Linux/solr/build/solr-core/test/J0/temp/solr.update.processor.ParsingFieldUpdateProcessorsTest_AEB3D98A69A59B49-002
[junit4] 2> NOTE: test params are: codec=CheapBastard, sim=Asserting(org.apache.lucene.search.similarities.AssertingSimilarity@10e0ce38), locale=ar-EG, timezone=SystemV/MST7
[junit4] 2> NOTE: Linux 4.18.0-17-generic amd64/Oracle Corporation 13-ea (64-bit)/cpus=8,threads=1,free=323513368,total=518979584
[junit4] 2> NOTE: All tests run in this JVM: [ParsingFieldUpdateProcessorsTest, ParsingFieldUpdateProcessorsTest]
[junit4] Completed [5/5 (5!)] on J0 in 2.76s, 42 tests, 2 failures <<< FAILURES!
[...truncated 20 lines...]
BUILD FAILED
/home/jenkins/workspace/Lucene-Solr-8.x-Linux/lucene/common-build.xml:1572: The following error occurred while executing this line:
/home/jenkins/workspace/Lucene-Solr-8.x-Linux/lucene/common-build.xml:1099: There were test failures: 5 suites, 210 tests, 10 failures [seed: AEB3D98A69A59B49]
Total time: 19 seconds
[repro] Setting last failure code to 256
[repro] Failures:
[repro] 5/5 failed: org.apache.solr.update.processor.ParsingFieldUpdateProcessorsTest
[repro] Exiting with code 256
+ mv lucene/build lucene/build.repro
+ mv solr/build solr/build.repro
+ mv lucene/build.orig lucene/build
+ mv solr/build.orig solr/build
Archiving artifacts
Setting ANT_1_8_2_HOME=/home/jenkins/tools/hudson.tasks.Ant_AntInstallation/ANT_1.8.2
[WARNINGS] Parsing warnings in console log with parser Java Compiler (javac)
Setting ANT_1_8_2_HOME=/home/jenkins/tools/hudson.tasks.Ant_AntInstallation/ANT_1.8.2
No credentials specified
Setting ANT_1_8_2_HOME=/home/jenkins/tools/hudson.tasks.Ant_AntInstallation/ANT_1.8.2
<Git Blamer> Using GitBlamer to create author and commit information for all warnings.
<Git Blamer> GIT_COMMIT=d1678a3a68685acd1432dfadcd5f49fa817273ad, workspace=/home/jenkins/workspace/Lucene-Solr-8.x-Linux
[WARNINGS] Computing warning deltas based on reference build #748
Recording test results
Setting ANT_1_8_2_HOME=/home/jenkins/tools/hudson.tasks.Ant_AntInstallation/ANT_1.8.2
Build step 'Publish JUnit test result report' changed build result to UNSTABLE
Email was triggered for: Unstable (Test Failures)
Sending email for trigger: Unstable (Test Failures)
Setting ANT_1_8_2_HOME=/home/jenkins/tools/hudson.tasks.Ant_AntInstallation/ANT_1.8.2
Setting ANT_1_8_2_HOME=/home/jenkins/tools/hudson.tasks.Ant_AntInstallation/ANT_1.8.2
Setting ANT_1_8_2_HOME=/home/jenkins/tools/hudson.tasks.Ant_AntInstallation/ANT_1.8.2
Setting ANT_1_8_2_HOME=/home/jenkins/tools/hudson.tasks.Ant_AntInstallation/ANT_1.8.2
Setting ANT_1_8_2_HOME=/home/jenkins/tools/hudson.tasks.Ant_AntInstallation/ANT_1.8.2
Setting ANT_1_8_2_HOME=/home/jenkins/tools/hudson.tasks.Ant_AntInstallation/ANT_1.8.2