You are viewing a plain text version of this content. The canonical link for it is here.
Posted to builds@beam.apache.org by Apache Jenkins Server <je...@builds.apache.org> on 2020/02/27 18:36:12 UTC
Build failed in Jenkins: beam_PostCommit_Py_VR_Dataflow #5880
See <https://builds.apache.org/job/beam_PostCommit_Py_VR_Dataflow/5880/display/redirect?page=changes>
Changes:
[michal.walenia] [BEAM-9258] Add integration test for Cloud DLP
------------------------------------------
[...truncated 20.71 MB...]
File "<https://builds.apache.org/job/beam_PostCommit_Py_VR_Dataflow/ws/src/sdks/python/apache_beam/runners/pipeline_context.py",> line 103, in get_by_id
self._id_to_proto[id], self._pipeline_context)
File "<https://builds.apache.org/job/beam_PostCommit_Py_VR_Dataflow/ws/src/sdks/python/apache_beam/pipeline.py",> line 1104, in from_runner_api
transform = ptransform.PTransform.from_runner_api(proto, context)
File "<https://builds.apache.org/job/beam_PostCommit_Py_VR_Dataflow/ws/src/sdks/python/apache_beam/transforms/ptransform.py",> line 684, in from_runner_api
context)
File "<https://builds.apache.org/job/beam_PostCommit_Py_VR_Dataflow/ws/src/sdks/python/apache_beam/testing/test_stream.py",> line 316, in from_runner_api_parameter
output_tags=output_tags)
File "<https://builds.apache.org/job/beam_PostCommit_Py_VR_Dataflow/ws/src/sdks/python/apache_beam/testing/test_stream.py",> line 200, in __init__
assert event_tags.issubset(self.output_tags)
AssertionError:
-------------------- >> begin captured logging << --------------------
root: INFO: Missing pipeline option (runner). Executing pipeline using the default runner: DirectRunner.
root: DEBUG: Unhandled type_constraint: Union[]
root: DEBUG: Unhandled type_constraint: Union[]
root: DEBUG: Unhandled type_constraint: Union[]
root: DEBUG: Unhandled type_constraint: Union[]
--------------------- >> end captured logging << ---------------------
----------------------------------------------------------------------
XML: nosetests-validatesRunnerStreamingTests-df-py37.xml
----------------------------------------------------------------------
XML: <https://builds.apache.org/job/beam_PostCommit_Py_VR_Dataflow/ws/src/sdks/python/nosetests.xml>
----------------------------------------------------------------------
Ran 28 tests in 1815.308s
FAILED (failures=1)
> Task :sdks:python:test-suites:dataflow:py36:validatesRunnerStreamingTests
INFO:apache_beam.runners.dataflow.dataflow_runner:Job 2020-02-27_10_29_15-14200958665280821076 is in state JOB_STATE_DONE
Worker logs: https://console.cloud.google.com/dataflow/jobs/us-central1/2020-02-27_10_05_28-10674086533534150169?project=apache-beam-testing
Worker logs: https://console.cloud.google.com/dataflow/jobs/us-central1/2020-02-27_10_13_16-9065184670715037653?project=apache-beam-testing
Worker logs: https://console.cloud.google.com/dataflow/jobs/us-central1/2020-02-27_10_05_31-6491715387279351091?project=apache-beam-testing
Worker logs: https://console.cloud.google.com/dataflow/jobs/us-central1/2020-02-27_10_12_24-8169239912870152370?project=apache-beam-testing
Worker logs: https://console.cloud.google.com/dataflow/jobs/us-central1/2020-02-27_10_19_55-4786138854866638088?project=apache-beam-testing
Worker logs: https://console.cloud.google.com/dataflow/jobs/us-central1/2020-02-27_10_05_29-7823727876207022230?project=apache-beam-testing
Worker logs: https://console.cloud.google.com/dataflow/jobs/us-central1/2020-02-27_10_13_06-5862476350847082493?project=apache-beam-testing
Worker logs: https://console.cloud.google.com/dataflow/jobs/us-central1/2020-02-27_10_21_01-15510835539042972765?project=apache-beam-testing
Worker logs: https://console.cloud.google.com/dataflow/jobs/us-central1/2020-02-27_10_29_15-14200958665280821076?project=apache-beam-testing
Worker logs: https://console.cloud.google.com/dataflow/jobs/us-central1/2020-02-27_10_05_27-11867342355149844498?project=apache-beam-testing
Worker logs: https://console.cloud.google.com/dataflow/jobs/us-central1/2020-02-27_10_12_51-15325946579740741712?project=apache-beam-testing
Worker logs: https://console.cloud.google.com/dataflow/jobs/us-central1/2020-02-27_10_19_48-9273717411980883716?project=apache-beam-testing
Worker logs: https://console.cloud.google.com/dataflow/jobs/us-central1/2020-02-27_10_05_29-11420042415949929451?project=apache-beam-testing
Worker logs: https://console.cloud.google.com/dataflow/jobs/us-central1/2020-02-27_10_12_40-15636429447764086015?project=apache-beam-testing
Worker logs: https://console.cloud.google.com/dataflow/jobs/us-central1/2020-02-27_10_20_12-15565425914343815083?project=apache-beam-testing
Worker logs: https://console.cloud.google.com/dataflow/jobs/us-central1/2020-02-27_10_05_29-16134441868758855489?project=apache-beam-testing
Worker logs: https://console.cloud.google.com/dataflow/jobs/us-central1/2020-02-27_10_13_05-12619049959720090539?project=apache-beam-testing
Worker logs: https://console.cloud.google.com/dataflow/jobs/us-central1/2020-02-27_10_20_27-16469472915241593975?project=apache-beam-testing
Worker logs: https://console.cloud.google.com/dataflow/jobs/us-central1/2020-02-27_10_05_28-9702682572534506517?project=apache-beam-testing
Worker logs: https://console.cloud.google.com/dataflow/jobs/us-central1/2020-02-27_10_12_50-5378157694956200528?project=apache-beam-testing
Worker logs: https://console.cloud.google.com/dataflow/jobs/us-central1/2020-02-27_10_20_43-15507036471348731553?project=apache-beam-testing
Worker logs: https://console.cloud.google.com/dataflow/jobs/us-central1/2020-02-27_10_05_28-10631675998199897208?project=apache-beam-testing
Worker logs: https://console.cloud.google.com/dataflow/jobs/us-central1/2020-02-27_10_13_24-14059014984798300321?project=apache-beam-testing
Worker logs: https://console.cloud.google.com/dataflow/jobs/us-central1/2020-02-27_10_20_41-4970661354388571384?project=apache-beam-testing
test_gbk_many_values (apache_beam.runners.portability.fn_api_runner_test.FnApiBasedStateBackedCoderTest) ... ok
Test TimestampCombiner with EARLIEST. ... ok
Test TimestampCombiner with LATEST. ... ok
Runs streaming Dataflow job and verifies that user metrics are reported ... ok
test_impulse (apache_beam.transforms.ptransform_test.PTransformTest) ... ok
test_dofn_lifecycle (apache_beam.transforms.dofn_lifecycle_test.DoFnLifecycleTest) ... ok
test_flatten_a_flattened_pcollection (apache_beam.transforms.ptransform_test.PTransformTest) ... ok
test_flatten_pcollections (apache_beam.transforms.ptransform_test.PTransformTest) ... ok
test_flatten_multiple_pcollections_having_multiple_consumers (apache_beam.transforms.ptransform_test.PTransformTest) ... ok
test_user_counter_using_pardo (apache_beam.metrics.metric_test.MetricsTest) ... ok
test_flatten_one_single_pcollection (apache_beam.transforms.ptransform_test.PTransformTest) ... ok
test_par_do_with_multiple_outputs_and_using_yield (apache_beam.transforms.ptransform_test.PTransformTest) ... ok
test_multiple_empty_outputs (apache_beam.transforms.ptransform_test.PTransformTest) ... ok
test_par_do_with_multiple_outputs_and_using_return (apache_beam.transforms.ptransform_test.PTransformTest) ... ok
test_as_list_and_as_dict_side_inputs (apache_beam.transforms.sideinputs_test.SideInputsTest) ... ok
test_as_singleton_with_different_defaults (apache_beam.transforms.sideinputs_test.SideInputsTest) ... ok
test_undeclared_outputs (apache_beam.transforms.ptransform_test.PTransformTest) ... ok
Test a GBK sideinput, with multiple triggering. ... FAIL
test_as_dict_twice (apache_beam.transforms.sideinputs_test.SideInputsTest) ... ok
test_as_list_twice (apache_beam.transforms.sideinputs_test.SideInputsTest) ... ok
test_default_value_singleton_side_input (apache_beam.transforms.sideinputs_test.SideInputsTest) ... ok
test_as_singleton_without_unique_labels (apache_beam.transforms.sideinputs_test.SideInputsTest) ... ok
test_flattened_side_input (apache_beam.transforms.sideinputs_test.SideInputsTest) ... ok
test_empty_singleton_side_input (apache_beam.transforms.sideinputs_test.SideInputsTest) ... ok
test_reshuffle_preserves_timestamps (apache_beam.transforms.util_test.ReshuffleTest) ... ok
test_iterable_side_input (apache_beam.transforms.sideinputs_test.SideInputsTest) ... ok
test_element_param (apache_beam.pipeline_test.DoFnTest) ... ok
test_key_param (apache_beam.pipeline_test.DoFnTest) ... ok
======================================================================
FAIL: Test a GBK sideinput, with multiple triggering.
----------------------------------------------------------------------
Traceback (most recent call last):
File "<https://builds.apache.org/job/beam_PostCommit_Py_VR_Dataflow/ws/src/sdks/python/apache_beam/transforms/sideinputs_test.py",> line 401, in test_multi_triggered_gbk_side_input
p.run()
File "<https://builds.apache.org/job/beam_PostCommit_Py_VR_Dataflow/ws/src/sdks/python/apache_beam/testing/test_pipeline.py",> line 112, in run
False if self.not_use_test_runner_api else test_runner_api))
File "<https://builds.apache.org/job/beam_PostCommit_Py_VR_Dataflow/ws/src/sdks/python/apache_beam/pipeline.py",> line 483, in run
self._options).run(False)
File "<https://builds.apache.org/job/beam_PostCommit_Py_VR_Dataflow/ws/src/sdks/python/apache_beam/pipeline.py",> line 809, in from_runner_api
p.transforms_stack = [context.transforms.get_by_id(root_transform_id)]
File "<https://builds.apache.org/job/beam_PostCommit_Py_VR_Dataflow/ws/src/sdks/python/apache_beam/runners/pipeline_context.py",> line 103, in get_by_id
self._id_to_proto[id], self._pipeline_context)
File "<https://builds.apache.org/job/beam_PostCommit_Py_VR_Dataflow/ws/src/sdks/python/apache_beam/pipeline.py",> line 1117, in from_runner_api
part = context.transforms.get_by_id(transform_id)
File "<https://builds.apache.org/job/beam_PostCommit_Py_VR_Dataflow/ws/src/sdks/python/apache_beam/runners/pipeline_context.py",> line 103, in get_by_id
self._id_to_proto[id], self._pipeline_context)
File "<https://builds.apache.org/job/beam_PostCommit_Py_VR_Dataflow/ws/src/sdks/python/apache_beam/pipeline.py",> line 1104, in from_runner_api
transform = ptransform.PTransform.from_runner_api(proto, context)
File "<https://builds.apache.org/job/beam_PostCommit_Py_VR_Dataflow/ws/src/sdks/python/apache_beam/transforms/ptransform.py",> line 684, in from_runner_api
context)
File "<https://builds.apache.org/job/beam_PostCommit_Py_VR_Dataflow/ws/src/sdks/python/apache_beam/testing/test_stream.py",> line 316, in from_runner_api_parameter
output_tags=output_tags)
File "<https://builds.apache.org/job/beam_PostCommit_Py_VR_Dataflow/ws/src/sdks/python/apache_beam/testing/test_stream.py",> line 200, in __init__
assert event_tags.issubset(self.output_tags)
AssertionError:
-------------------- >> begin captured logging << --------------------
root: INFO: Missing pipeline option (runner). Executing pipeline using the default runner: DirectRunner.
root: DEBUG: Unhandled type_constraint: Union[]
root: DEBUG: Unhandled type_constraint: Union[]
root: DEBUG: Unhandled type_constraint: Union[]
root: DEBUG: Unhandled type_constraint: Union[]
--------------------- >> end captured logging << ---------------------
----------------------------------------------------------------------
XML: nosetests-validatesRunnerStreamingTests-df-py36.xml
----------------------------------------------------------------------
XML: <https://builds.apache.org/job/beam_PostCommit_Py_VR_Dataflow/ws/src/sdks/python/nosetests.xml>
----------------------------------------------------------------------
Ran 28 tests in 1862.727s
FAILED (failures=1)
> Task :sdks:python:test-suites:dataflow:py36:validatesRunnerStreamingTests FAILED
FAILURE: Build completed with 8 failures.
1: Task failed with an exception.
-----------
* Where:
Build file '<https://builds.apache.org/job/beam_PostCommit_Py_VR_Dataflow/ws/src/sdks/python/test-suites/dataflow/py2/build.gradle'> line: 107
* What went wrong:
Execution failed for task ':sdks:python:test-suites:dataflow:py2:validatesRunnerBatchTests'.
> Process 'command 'sh'' finished with non-zero exit value 1
* Try:
Run with --stacktrace option to get the stack trace. Run with --info or --debug option to get more log output. Run with --scan to get full insights.
==============================================================================
2: Task failed with an exception.
-----------
* Where:
Build file '<https://builds.apache.org/job/beam_PostCommit_Py_VR_Dataflow/ws/src/sdks/python/test-suites/dataflow/py35/build.gradle'> line: 78
* What went wrong:
Execution failed for task ':sdks:python:test-suites:dataflow:py35:validatesRunnerBatchTests'.
> Process 'command 'sh'' finished with non-zero exit value 1
* Try:
Run with --stacktrace option to get the stack trace. Run with --info or --debug option to get more log output. Run with --scan to get full insights.
==============================================================================
3: Task failed with an exception.
-----------
* Where:
Build file '<https://builds.apache.org/job/beam_PostCommit_Py_VR_Dataflow/ws/src/sdks/python/test-suites/dataflow/py36/build.gradle'> line: 78
* What went wrong:
Execution failed for task ':sdks:python:test-suites:dataflow:py36:validatesRunnerBatchTests'.
> Process 'command 'sh'' finished with non-zero exit value 1
* Try:
Run with --stacktrace option to get the stack trace. Run with --info or --debug option to get more log output. Run with --scan to get full insights.
==============================================================================
4: Task failed with an exception.
-----------
* Where:
Build file '<https://builds.apache.org/job/beam_PostCommit_Py_VR_Dataflow/ws/src/sdks/python/test-suites/dataflow/py37/build.gradle'> line: 111
* What went wrong:
Execution failed for task ':sdks:python:test-suites:dataflow:py37:validatesRunnerBatchTests'.
> Process 'command 'sh'' finished with non-zero exit value 1
* Try:
Run with --stacktrace option to get the stack trace. Run with --info or --debug option to get more log output. Run with --scan to get full insights.
==============================================================================
5: Task failed with an exception.
-----------
* Where:
Build file '<https://builds.apache.org/job/beam_PostCommit_Py_VR_Dataflow/ws/src/sdks/python/test-suites/dataflow/py2/build.gradle'> line: 135
* What went wrong:
Execution failed for task ':sdks:python:test-suites:dataflow:py2:validatesRunnerStreamingTests'.
> Process 'command 'sh'' finished with non-zero exit value 1
* Try:
Run with --stacktrace option to get the stack trace. Run with --info or --debug option to get more log output. Run with --scan to get full insights.
==============================================================================
6: Task failed with an exception.
-----------
* Where:
Build file '<https://builds.apache.org/job/beam_PostCommit_Py_VR_Dataflow/ws/src/sdks/python/test-suites/dataflow/py35/build.gradle'> line: 101
* What went wrong:
Execution failed for task ':sdks:python:test-suites:dataflow:py35:validatesRunnerStreamingTests'.
> Process 'command 'sh'' finished with non-zero exit value 1
* Try:
Run with --stacktrace option to get the stack trace. Run with --info or --debug option to get more log output. Run with --scan to get full insights.
==============================================================================
7: Task failed with an exception.
-----------
* Where:
Build file '<https://builds.apache.org/job/beam_PostCommit_Py_VR_Dataflow/ws/src/sdks/python/test-suites/dataflow/py37/build.gradle'> line: 134
* What went wrong:
Execution failed for task ':sdks:python:test-suites:dataflow:py37:validatesRunnerStreamingTests'.
> Process 'command 'sh'' finished with non-zero exit value 1
* Try:
Run with --stacktrace option to get the stack trace. Run with --info or --debug option to get more log output. Run with --scan to get full insights.
==============================================================================
8: Task failed with an exception.
-----------
* Where:
Build file '<https://builds.apache.org/job/beam_PostCommit_Py_VR_Dataflow/ws/src/sdks/python/test-suites/dataflow/py36/build.gradle'> line: 101
* What went wrong:
Execution failed for task ':sdks:python:test-suites:dataflow:py36:validatesRunnerStreamingTests'.
> Process 'command 'sh'' finished with non-zero exit value 1
* Try:
Run with --stacktrace option to get the stack trace. Run with --info or --debug option to get more log output. Run with --scan to get full insights.
==============================================================================
* Get more help at https://help.gradle.org
Deprecated Gradle features were used in this build, making it incompatible with Gradle 6.0.
Use '--warning-mode all' to show the individual deprecation warnings.
See https://docs.gradle.org/5.2.1/userguide/command_line_interface.html#sec:command_line_warnings
BUILD FAILED in 1h 6m 15s
74 actionable tasks: 57 executed, 17 from cache
Publishing build scan...
https://gradle.com/s/hk53nasarjmy6
Build step 'Invoke Gradle script' changed build result to FAILURE
Build step 'Invoke Gradle script' marked build as failure
---------------------------------------------------------------------
To unsubscribe, e-mail: builds-unsubscribe@beam.apache.org
For additional commands, e-mail: builds-help@beam.apache.org
Jenkins build is back to normal : beam_PostCommit_Py_VR_Dataflow
#5887
Posted by Apache Jenkins Server <je...@builds.apache.org>.
See <https://builds.apache.org/job/beam_PostCommit_Py_VR_Dataflow/5887/display/redirect?page=changes>
---------------------------------------------------------------------
To unsubscribe, e-mail: builds-unsubscribe@beam.apache.org
For additional commands, e-mail: builds-help@beam.apache.org
Build failed in Jenkins: beam_PostCommit_Py_VR_Dataflow #5886
Posted by Apache Jenkins Server <je...@builds.apache.org>.
See <https://builds.apache.org/job/beam_PostCommit_Py_VR_Dataflow/5886/display/redirect?page=changes>
Changes:
[github] [BEAM-9396] Match Docker image names in Jenkins jobs with those
------------------------------------------
[...truncated 20.70 MB...]
File "<https://builds.apache.org/job/beam_PostCommit_Py_VR_Dataflow/ws/src/sdks/python/apache_beam/transforms/ptransform.py",> line 684, in from_runner_api
context)
File "<https://builds.apache.org/job/beam_PostCommit_Py_VR_Dataflow/ws/src/sdks/python/apache_beam/testing/test_stream.py",> line 316, in from_runner_api_parameter
output_tags=output_tags)
File "<https://builds.apache.org/job/beam_PostCommit_Py_VR_Dataflow/ws/src/sdks/python/apache_beam/testing/test_stream.py",> line 200, in __init__
assert event_tags.issubset(self.output_tags)
AssertionError:
-------------------- >> begin captured logging << --------------------
root: INFO: Missing pipeline option (runner). Executing pipeline using the default runner: DirectRunner.
root: DEBUG: Unhandled type_constraint: Union[]
root: DEBUG: Unhandled type_constraint: Union[]
root: DEBUG: Unhandled type_constraint: Union[]
root: DEBUG: Unhandled type_constraint: Union[]
--------------------- >> end captured logging << ---------------------
----------------------------------------------------------------------
XML: nosetests-validatesRunnerStreamingTests-df-py36.xml
----------------------------------------------------------------------
XML: <https://builds.apache.org/job/beam_PostCommit_Py_VR_Dataflow/ws/src/sdks/python/nosetests.xml>
----------------------------------------------------------------------
Ran 28 tests in 1799.363s
FAILED (failures=1)
> Task :sdks:python:test-suites:dataflow:py36:validatesRunnerStreamingTests FAILED
> Task :sdks:python:test-suites:dataflow:py37:validatesRunnerStreamingTests
INFO:apache_beam.runners.dataflow.dataflow_runner:2020-02-28T11:21:21.469Z: JOB_MESSAGE_DETAILED: Checking permissions granted to controller Service Account.
INFO:apache_beam.runners.dataflow.dataflow_runner:2020-02-28T11:22:15.856Z: JOB_MESSAGE_BASIC: Worker pool stopped.
INFO:apache_beam.runners.dataflow.dataflow_runner:Job 2020-02-28_03_14_50-12182530021977681484 is in state JOB_STATE_DONE
Worker logs: https://console.cloud.google.com/dataflow/jobs/us-central1/2020-02-28_02_51_50-7644527405032932970?project=apache-beam-testing
Worker logs: https://console.cloud.google.com/dataflow/jobs/us-central1/2020-02-28_02_59_01-9725377375994306503?project=apache-beam-testing
Worker logs: https://console.cloud.google.com/dataflow/jobs/us-central1/2020-02-28_03_06_24-1148037827862816401?project=apache-beam-testing
Worker logs: https://console.cloud.google.com/dataflow/jobs/us-central1/2020-02-28_02_51_52-2581797250362944385?project=apache-beam-testing
Worker logs: https://console.cloud.google.com/dataflow/jobs/us-central1/2020-02-28_02_58_41-9861450405942868658?project=apache-beam-testing
Worker logs: https://console.cloud.google.com/dataflow/jobs/us-central1/2020-02-28_03_06_18-13266238077893665514?project=apache-beam-testing
Worker logs: https://console.cloud.google.com/dataflow/jobs/us-central1/2020-02-28_02_51_51-107152884639360100?project=apache-beam-testing
Worker logs: https://console.cloud.google.com/dataflow/jobs/us-central1/2020-02-28_02_59_16-17785041088133128883?project=apache-beam-testing
Worker logs: https://console.cloud.google.com/dataflow/jobs/us-central1/2020-02-28_03_06_25-1940553318341217460?project=apache-beam-testing
Worker logs: https://console.cloud.google.com/dataflow/jobs/us-central1/2020-02-28_02_51_50-5438874373446626785?project=apache-beam-testing
Worker logs: https://console.cloud.google.com/dataflow/jobs/us-central1/2020-02-28_02_59_13-6396117957790842863?project=apache-beam-testing
Worker logs: https://console.cloud.google.com/dataflow/jobs/us-central1/2020-02-28_03_06_14-13524268292424459061?project=apache-beam-testing
Worker logs: https://console.cloud.google.com/dataflow/jobs/us-central1/2020-02-28_02_51_50-5176210179333585246?project=apache-beam-testing
Worker logs: https://console.cloud.google.com/dataflow/jobs/us-central1/2020-02-28_02_59_54-11337111666351470548?project=apache-beam-testing
Worker logs: https://console.cloud.google.com/dataflow/jobs/us-central1/2020-02-28_03_07_18-4917106807454378854?project=apache-beam-testing
Worker logs: https://console.cloud.google.com/dataflow/jobs/us-central1/2020-02-28_02_51_51-14730834848702177186?project=apache-beam-testing
Worker logs: https://console.cloud.google.com/dataflow/jobs/us-central1/2020-02-28_02_59_51-4035165982459675191?project=apache-beam-testing
Worker logs: https://console.cloud.google.com/dataflow/jobs/us-central1/2020-02-28_03_07_20-15427120857686442163?project=apache-beam-testing
Worker logs: https://console.cloud.google.com/dataflow/jobs/us-central1/2020-02-28_03_14_50-12182530021977681484?project=apache-beam-testing
Worker logs: https://console.cloud.google.com/dataflow/jobs/us-central1/2020-02-28_02_51_52-11032146218994051663?project=apache-beam-testing
Worker logs: https://console.cloud.google.com/dataflow/jobs/us-central1/2020-02-28_02_59_57-11005928143527372531?project=apache-beam-testing
Worker logs: https://console.cloud.google.com/dataflow/jobs/us-central1/2020-02-28_02_51_50-5150781918282713658?project=apache-beam-testing
Worker logs: https://console.cloud.google.com/dataflow/jobs/us-central1/2020-02-28_02_59_15-17421682270312946166?project=apache-beam-testing
Worker logs: https://console.cloud.google.com/dataflow/jobs/us-central1/2020-02-28_03_06_36-14736412609325061941?project=apache-beam-testing
test_gbk_many_values (apache_beam.runners.portability.fn_api_runner_test.FnApiBasedStateBackedCoderTest) ... ok
Test TimestampCombiner with EARLIEST. ... ok
Test TimestampCombiner with LATEST. ... ok
Runs streaming Dataflow job and verifies that user metrics are reported ... ok
test_user_counter_using_pardo (apache_beam.metrics.metric_test.MetricsTest) ... ok
test_impulse (apache_beam.transforms.ptransform_test.PTransformTest) ... ok
test_flatten_one_single_pcollection (apache_beam.transforms.ptransform_test.PTransformTest) ... ok
test_flatten_pcollections (apache_beam.transforms.ptransform_test.PTransformTest) ... ok
test_flatten_a_flattened_pcollection (apache_beam.transforms.ptransform_test.PTransformTest) ... ok
test_dofn_lifecycle (apache_beam.transforms.dofn_lifecycle_test.DoFnLifecycleTest) ... ok
test_flatten_multiple_pcollections_having_multiple_consumers (apache_beam.transforms.ptransform_test.PTransformTest) ... ok
test_par_do_with_multiple_outputs_and_using_yield (apache_beam.transforms.ptransform_test.PTransformTest) ... ok
test_multiple_empty_outputs (apache_beam.transforms.ptransform_test.PTransformTest) ... ok
test_as_dict_twice (apache_beam.transforms.sideinputs_test.SideInputsTest) ... ok
test_par_do_with_multiple_outputs_and_using_return (apache_beam.transforms.ptransform_test.PTransformTest) ... ok
test_undeclared_outputs (apache_beam.transforms.ptransform_test.PTransformTest) ... ok
test_as_list_twice (apache_beam.transforms.sideinputs_test.SideInputsTest) ... ok
Test a GBK sideinput, with multiple triggering. ... FAIL
test_as_list_and_as_dict_side_inputs (apache_beam.transforms.sideinputs_test.SideInputsTest) ... ok
test_as_singleton_with_different_defaults (apache_beam.transforms.sideinputs_test.SideInputsTest) ... ok
test_as_singleton_without_unique_labels (apache_beam.transforms.sideinputs_test.SideInputsTest) ... ok
test_flattened_side_input (apache_beam.transforms.sideinputs_test.SideInputsTest) ... ok
test_default_value_singleton_side_input (apache_beam.transforms.sideinputs_test.SideInputsTest) ... ok
test_empty_singleton_side_input (apache_beam.transforms.sideinputs_test.SideInputsTest) ... ok
test_iterable_side_input (apache_beam.transforms.sideinputs_test.SideInputsTest) ... ok
test_reshuffle_preserves_timestamps (apache_beam.transforms.util_test.ReshuffleTest) ... ok
test_element_param (apache_beam.pipeline_test.DoFnTest) ... ok
test_key_param (apache_beam.pipeline_test.DoFnTest) ... ok
======================================================================
FAIL: Test a GBK sideinput, with multiple triggering.
----------------------------------------------------------------------
Traceback (most recent call last):
File "<https://builds.apache.org/job/beam_PostCommit_Py_VR_Dataflow/ws/src/sdks/python/apache_beam/transforms/sideinputs_test.py",> line 401, in test_multi_triggered_gbk_side_input
p.run()
File "<https://builds.apache.org/job/beam_PostCommit_Py_VR_Dataflow/ws/src/sdks/python/apache_beam/testing/test_pipeline.py",> line 112, in run
False if self.not_use_test_runner_api else test_runner_api))
File "<https://builds.apache.org/job/beam_PostCommit_Py_VR_Dataflow/ws/src/sdks/python/apache_beam/pipeline.py",> line 483, in run
self._options).run(False)
File "<https://builds.apache.org/job/beam_PostCommit_Py_VR_Dataflow/ws/src/sdks/python/apache_beam/pipeline.py",> line 809, in from_runner_api
p.transforms_stack = [context.transforms.get_by_id(root_transform_id)]
File "<https://builds.apache.org/job/beam_PostCommit_Py_VR_Dataflow/ws/src/sdks/python/apache_beam/runners/pipeline_context.py",> line 103, in get_by_id
self._id_to_proto[id], self._pipeline_context)
File "<https://builds.apache.org/job/beam_PostCommit_Py_VR_Dataflow/ws/src/sdks/python/apache_beam/pipeline.py",> line 1117, in from_runner_api
part = context.transforms.get_by_id(transform_id)
File "<https://builds.apache.org/job/beam_PostCommit_Py_VR_Dataflow/ws/src/sdks/python/apache_beam/runners/pipeline_context.py",> line 103, in get_by_id
self._id_to_proto[id], self._pipeline_context)
File "<https://builds.apache.org/job/beam_PostCommit_Py_VR_Dataflow/ws/src/sdks/python/apache_beam/pipeline.py",> line 1104, in from_runner_api
transform = ptransform.PTransform.from_runner_api(proto, context)
File "<https://builds.apache.org/job/beam_PostCommit_Py_VR_Dataflow/ws/src/sdks/python/apache_beam/transforms/ptransform.py",> line 684, in from_runner_api
context)
File "<https://builds.apache.org/job/beam_PostCommit_Py_VR_Dataflow/ws/src/sdks/python/apache_beam/testing/test_stream.py",> line 316, in from_runner_api_parameter
output_tags=output_tags)
File "<https://builds.apache.org/job/beam_PostCommit_Py_VR_Dataflow/ws/src/sdks/python/apache_beam/testing/test_stream.py",> line 200, in __init__
assert event_tags.issubset(self.output_tags)
AssertionError:
-------------------- >> begin captured logging << --------------------
root: INFO: Missing pipeline option (runner). Executing pipeline using the default runner: DirectRunner.
root: DEBUG: Unhandled type_constraint: Union[]
root: DEBUG: Unhandled type_constraint: Union[]
root: DEBUG: Unhandled type_constraint: Union[]
root: DEBUG: Unhandled type_constraint: Union[]
--------------------- >> end captured logging << ---------------------
----------------------------------------------------------------------
XML: nosetests-validatesRunnerStreamingTests-df-py37.xml
----------------------------------------------------------------------
XML: <https://builds.apache.org/job/beam_PostCommit_Py_VR_Dataflow/ws/src/sdks/python/nosetests.xml>
----------------------------------------------------------------------
Ran 28 tests in 1856.854s
FAILED (failures=1)
> Task :sdks:python:test-suites:dataflow:py37:validatesRunnerStreamingTests FAILED
FAILURE: Build completed with 8 failures.
1: Task failed with an exception.
-----------
* Where:
Build file '<https://builds.apache.org/job/beam_PostCommit_Py_VR_Dataflow/ws/src/sdks/python/test-suites/dataflow/py2/build.gradle'> line: 107
* What went wrong:
Execution failed for task ':sdks:python:test-suites:dataflow:py2:validatesRunnerBatchTests'.
> Process 'command 'sh'' finished with non-zero exit value 1
* Try:
Run with --stacktrace option to get the stack trace. Run with --info or --debug option to get more log output. Run with --scan to get full insights.
==============================================================================
2: Task failed with an exception.
-----------
* Where:
Build file '<https://builds.apache.org/job/beam_PostCommit_Py_VR_Dataflow/ws/src/sdks/python/test-suites/dataflow/py35/build.gradle'> line: 78
* What went wrong:
Execution failed for task ':sdks:python:test-suites:dataflow:py35:validatesRunnerBatchTests'.
> Process 'command 'sh'' finished with non-zero exit value 1
* Try:
Run with --stacktrace option to get the stack trace. Run with --info or --debug option to get more log output. Run with --scan to get full insights.
==============================================================================
3: Task failed with an exception.
-----------
* Where:
Build file '<https://builds.apache.org/job/beam_PostCommit_Py_VR_Dataflow/ws/src/sdks/python/test-suites/dataflow/py36/build.gradle'> line: 78
* What went wrong:
Execution failed for task ':sdks:python:test-suites:dataflow:py36:validatesRunnerBatchTests'.
> Process 'command 'sh'' finished with non-zero exit value 1
* Try:
Run with --stacktrace option to get the stack trace. Run with --info or --debug option to get more log output. Run with --scan to get full insights.
==============================================================================
4: Task failed with an exception.
-----------
* Where:
Build file '<https://builds.apache.org/job/beam_PostCommit_Py_VR_Dataflow/ws/src/sdks/python/test-suites/dataflow/py37/build.gradle'> line: 111
* What went wrong:
Execution failed for task ':sdks:python:test-suites:dataflow:py37:validatesRunnerBatchTests'.
> Process 'command 'sh'' finished with non-zero exit value 1
* Try:
Run with --stacktrace option to get the stack trace. Run with --info or --debug option to get more log output. Run with --scan to get full insights.
==============================================================================
5: Task failed with an exception.
-----------
* Where:
Build file '<https://builds.apache.org/job/beam_PostCommit_Py_VR_Dataflow/ws/src/sdks/python/test-suites/dataflow/py2/build.gradle'> line: 135
* What went wrong:
Execution failed for task ':sdks:python:test-suites:dataflow:py2:validatesRunnerStreamingTests'.
> Process 'command 'sh'' finished with non-zero exit value 1
* Try:
Run with --stacktrace option to get the stack trace. Run with --info or --debug option to get more log output. Run with --scan to get full insights.
==============================================================================
6: Task failed with an exception.
-----------
* Where:
Build file '<https://builds.apache.org/job/beam_PostCommit_Py_VR_Dataflow/ws/src/sdks/python/test-suites/dataflow/py35/build.gradle'> line: 101
* What went wrong:
Execution failed for task ':sdks:python:test-suites:dataflow:py35:validatesRunnerStreamingTests'.
> Process 'command 'sh'' finished with non-zero exit value 1
* Try:
Run with --stacktrace option to get the stack trace. Run with --info or --debug option to get more log output. Run with --scan to get full insights.
==============================================================================
7: Task failed with an exception.
-----------
* Where:
Build file '<https://builds.apache.org/job/beam_PostCommit_Py_VR_Dataflow/ws/src/sdks/python/test-suites/dataflow/py36/build.gradle'> line: 101
* What went wrong:
Execution failed for task ':sdks:python:test-suites:dataflow:py36:validatesRunnerStreamingTests'.
> Process 'command 'sh'' finished with non-zero exit value 1
* Try:
Run with --stacktrace option to get the stack trace. Run with --info or --debug option to get more log output. Run with --scan to get full insights.
==============================================================================
8: Task failed with an exception.
-----------
* Where:
Build file '<https://builds.apache.org/job/beam_PostCommit_Py_VR_Dataflow/ws/src/sdks/python/test-suites/dataflow/py37/build.gradle'> line: 134
* What went wrong:
Execution failed for task ':sdks:python:test-suites:dataflow:py37:validatesRunnerStreamingTests'.
> Process 'command 'sh'' finished with non-zero exit value 1
* Try:
Run with --stacktrace option to get the stack trace. Run with --info or --debug option to get more log output. Run with --scan to get full insights.
==============================================================================
* Get more help at https://help.gradle.org
Deprecated Gradle features were used in this build, making it incompatible with Gradle 6.0.
Use '--warning-mode all' to show the individual deprecation warnings.
See https://docs.gradle.org/5.2.1/userguide/command_line_interface.html#sec:command_line_warnings
BUILD FAILED in 1h 6m 28s
74 actionable tasks: 57 executed, 17 from cache
Publishing build scan...
https://gradle.com/s/ok3ojznu3tklu
Build step 'Invoke Gradle script' changed build result to FAILURE
Build step 'Invoke Gradle script' marked build as failure
---------------------------------------------------------------------
To unsubscribe, e-mail: builds-unsubscribe@beam.apache.org
For additional commands, e-mail: builds-help@beam.apache.org
Build failed in Jenkins: beam_PostCommit_Py_VR_Dataflow #5885
Posted by Apache Jenkins Server <je...@builds.apache.org>.
See <https://builds.apache.org/job/beam_PostCommit_Py_VR_Dataflow/5885/display/redirect>
Changes:
------------------------------------------
[...truncated 20.71 MB...]
File "<https://builds.apache.org/job/beam_PostCommit_Py_VR_Dataflow/ws/src/sdks/python/apache_beam/transforms/ptransform.py",> line 684, in from_runner_api
context)
File "<https://builds.apache.org/job/beam_PostCommit_Py_VR_Dataflow/ws/src/sdks/python/apache_beam/testing/test_stream.py",> line 316, in from_runner_api_parameter
output_tags=output_tags)
File "<https://builds.apache.org/job/beam_PostCommit_Py_VR_Dataflow/ws/src/sdks/python/apache_beam/testing/test_stream.py",> line 200, in __init__
assert event_tags.issubset(self.output_tags)
AssertionError:
-------------------- >> begin captured logging << --------------------
root: INFO: Missing pipeline option (runner). Executing pipeline using the default runner: DirectRunner.
root: DEBUG: Unhandled type_constraint: Union[]
root: DEBUG: Unhandled type_constraint: Union[]
root: DEBUG: Unhandled type_constraint: Union[]
root: DEBUG: Unhandled type_constraint: Union[]
--------------------- >> end captured logging << ---------------------
----------------------------------------------------------------------
XML: nosetests-validatesRunnerStreamingTests-df-py37.xml
----------------------------------------------------------------------
XML: <https://builds.apache.org/job/beam_PostCommit_Py_VR_Dataflow/ws/src/sdks/python/nosetests.xml>
----------------------------------------------------------------------
Ran 28 tests in 1786.909s
FAILED (failures=1)
> Task :sdks:python:test-suites:dataflow:py37:validatesRunnerStreamingTests FAILED
> Task :sdks:python:test-suites:dataflow:py36:validatesRunnerStreamingTests
INFO:apache_beam.runners.dataflow.dataflow_runner:2020-02-28T07:04:23.368Z: JOB_MESSAGE_DETAILED: Checking permissions granted to controller Service Account.
INFO:apache_beam.runners.dataflow.dataflow_runner:2020-02-28T07:04:50.299Z: JOB_MESSAGE_BASIC: Worker pool stopped.
INFO:apache_beam.runners.dataflow.dataflow_runner:Job 2020-02-27_22_57_46-11431975096701466880 is in state JOB_STATE_DONE
Worker logs: https://console.cloud.google.com/dataflow/jobs/us-central1/2020-02-27_22_35_31-6748597651958025329?project=apache-beam-testing
Worker logs: https://console.cloud.google.com/dataflow/jobs/us-central1/2020-02-27_22_42_59-17744368514502528259?project=apache-beam-testing
Worker logs: https://console.cloud.google.com/dataflow/jobs/us-central1/2020-02-27_22_50_21-7242126104155280474?project=apache-beam-testing
Worker logs: https://console.cloud.google.com/dataflow/jobs/us-central1/2020-02-27_22_35_34-10998558037107853888?project=apache-beam-testing
Worker logs: https://console.cloud.google.com/dataflow/jobs/us-central1/2020-02-27_22_42_07-11108153764094707452?project=apache-beam-testing
Worker logs: https://console.cloud.google.com/dataflow/jobs/us-central1/2020-02-27_22_49_13-17505009312992087973?project=apache-beam-testing
Worker logs: https://console.cloud.google.com/dataflow/jobs/us-central1/2020-02-27_22_35_34-6285311659517973607?project=apache-beam-testing
Worker logs: https://console.cloud.google.com/dataflow/jobs/us-central1/2020-02-27_22_43_04-8250248701973004412?project=apache-beam-testing
Worker logs: https://console.cloud.google.com/dataflow/jobs/us-central1/2020-02-27_22_50_27-17858259118576965910?project=apache-beam-testing
Worker logs: https://console.cloud.google.com/dataflow/jobs/us-central1/2020-02-27_22_57_46-11431975096701466880?project=apache-beam-testing
Worker logs: https://console.cloud.google.com/dataflow/jobs/us-central1/2020-02-27_22_35_33-11568080893864290600?project=apache-beam-testing
Worker logs: https://console.cloud.google.com/dataflow/jobs/us-central1/2020-02-27_22_43_17-3250441830403122865?project=apache-beam-testing
Worker logs: https://console.cloud.google.com/dataflow/jobs/us-central1/2020-02-27_22_35_31-14288505414787713351?project=apache-beam-testing
Worker logs: https://console.cloud.google.com/dataflow/jobs/us-central1/2020-02-27_22_42_56-11159132609436221141?project=apache-beam-testing
Worker logs: https://console.cloud.google.com/dataflow/jobs/us-central1/2020-02-27_22_50_25-12075631737968194164?project=apache-beam-testing
Worker logs: https://console.cloud.google.com/dataflow/jobs/us-central1/2020-02-27_22_35_34-8493509980689770390?project=apache-beam-testing
Worker logs: https://console.cloud.google.com/dataflow/jobs/us-central1/2020-02-27_22_42_58-3722595941447378219?project=apache-beam-testing
Worker logs: https://console.cloud.google.com/dataflow/jobs/us-central1/2020-02-27_22_50_13-11250858931370288021?project=apache-beam-testing
Worker logs: https://console.cloud.google.com/dataflow/jobs/us-central1/2020-02-27_22_35_32-6875812124790184161?project=apache-beam-testing
Worker logs: https://console.cloud.google.com/dataflow/jobs/us-central1/2020-02-27_22_42_58-17211364735389874241?project=apache-beam-testing
Worker logs: https://console.cloud.google.com/dataflow/jobs/us-central1/2020-02-27_22_50_19-12268214255334384517?project=apache-beam-testing
Worker logs: https://console.cloud.google.com/dataflow/jobs/us-central1/2020-02-27_22_35_32-1770761463796345142?project=apache-beam-testing
Worker logs: https://console.cloud.google.com/dataflow/jobs/us-central1/2020-02-27_22_43_02-4612249273516721086?project=apache-beam-testing
Worker logs: https://console.cloud.google.com/dataflow/jobs/us-central1/2020-02-27_22_50_22-1361063675790103106?project=apache-beam-testing
test_gbk_many_values (apache_beam.runners.portability.fn_api_runner_test.FnApiBasedStateBackedCoderTest) ... ok
Test TimestampCombiner with EARLIEST. ... ok
Test TimestampCombiner with LATEST. ... ok
Runs streaming Dataflow job and verifies that user metrics are reported ... ok
test_dofn_lifecycle (apache_beam.transforms.dofn_lifecycle_test.DoFnLifecycleTest) ... ok
test_flatten_multiple_pcollections_having_multiple_consumers (apache_beam.transforms.ptransform_test.PTransformTest) ... ok
test_flatten_a_flattened_pcollection (apache_beam.transforms.ptransform_test.PTransformTest) ... ok
test_user_counter_using_pardo (apache_beam.metrics.metric_test.MetricsTest) ... ok
test_flatten_one_single_pcollection (apache_beam.transforms.ptransform_test.PTransformTest) ... ok
test_flatten_pcollections (apache_beam.transforms.ptransform_test.PTransformTest) ... ok
test_impulse (apache_beam.transforms.ptransform_test.PTransformTest) ... ok
test_multiple_empty_outputs (apache_beam.transforms.ptransform_test.PTransformTest) ... ok
test_undeclared_outputs (apache_beam.transforms.ptransform_test.PTransformTest) ... ok
test_par_do_with_multiple_outputs_and_using_yield (apache_beam.transforms.ptransform_test.PTransformTest) ... ok
test_as_dict_twice (apache_beam.transforms.sideinputs_test.SideInputsTest) ... ok
test_as_list_and_as_dict_side_inputs (apache_beam.transforms.sideinputs_test.SideInputsTest) ... ok
test_par_do_with_multiple_outputs_and_using_return (apache_beam.transforms.ptransform_test.PTransformTest) ... ok
Test a GBK sideinput, with multiple triggering. ... FAIL
test_as_list_twice (apache_beam.transforms.sideinputs_test.SideInputsTest) ... ok
test_as_singleton_with_different_defaults (apache_beam.transforms.sideinputs_test.SideInputsTest) ... ok
test_as_singleton_without_unique_labels (apache_beam.transforms.sideinputs_test.SideInputsTest) ... ok
test_default_value_singleton_side_input (apache_beam.transforms.sideinputs_test.SideInputsTest) ... ok
test_reshuffle_preserves_timestamps (apache_beam.transforms.util_test.ReshuffleTest) ... ok
test_iterable_side_input (apache_beam.transforms.sideinputs_test.SideInputsTest) ... ok
test_empty_singleton_side_input (apache_beam.transforms.sideinputs_test.SideInputsTest) ... ok
test_flattened_side_input (apache_beam.transforms.sideinputs_test.SideInputsTest) ... ok
test_element_param (apache_beam.pipeline_test.DoFnTest) ... ok
test_key_param (apache_beam.pipeline_test.DoFnTest) ... ok
======================================================================
FAIL: Test a GBK sideinput, with multiple triggering.
----------------------------------------------------------------------
Traceback (most recent call last):
File "<https://builds.apache.org/job/beam_PostCommit_Py_VR_Dataflow/ws/src/sdks/python/apache_beam/transforms/sideinputs_test.py",> line 401, in test_multi_triggered_gbk_side_input
p.run()
File "<https://builds.apache.org/job/beam_PostCommit_Py_VR_Dataflow/ws/src/sdks/python/apache_beam/testing/test_pipeline.py",> line 112, in run
False if self.not_use_test_runner_api else test_runner_api))
File "<https://builds.apache.org/job/beam_PostCommit_Py_VR_Dataflow/ws/src/sdks/python/apache_beam/pipeline.py",> line 483, in run
self._options).run(False)
File "<https://builds.apache.org/job/beam_PostCommit_Py_VR_Dataflow/ws/src/sdks/python/apache_beam/pipeline.py",> line 809, in from_runner_api
p.transforms_stack = [context.transforms.get_by_id(root_transform_id)]
File "<https://builds.apache.org/job/beam_PostCommit_Py_VR_Dataflow/ws/src/sdks/python/apache_beam/runners/pipeline_context.py",> line 103, in get_by_id
self._id_to_proto[id], self._pipeline_context)
File "<https://builds.apache.org/job/beam_PostCommit_Py_VR_Dataflow/ws/src/sdks/python/apache_beam/pipeline.py",> line 1117, in from_runner_api
part = context.transforms.get_by_id(transform_id)
File "<https://builds.apache.org/job/beam_PostCommit_Py_VR_Dataflow/ws/src/sdks/python/apache_beam/runners/pipeline_context.py",> line 103, in get_by_id
self._id_to_proto[id], self._pipeline_context)
File "<https://builds.apache.org/job/beam_PostCommit_Py_VR_Dataflow/ws/src/sdks/python/apache_beam/pipeline.py",> line 1104, in from_runner_api
transform = ptransform.PTransform.from_runner_api(proto, context)
File "<https://builds.apache.org/job/beam_PostCommit_Py_VR_Dataflow/ws/src/sdks/python/apache_beam/transforms/ptransform.py",> line 684, in from_runner_api
context)
File "<https://builds.apache.org/job/beam_PostCommit_Py_VR_Dataflow/ws/src/sdks/python/apache_beam/testing/test_stream.py",> line 316, in from_runner_api_parameter
output_tags=output_tags)
File "<https://builds.apache.org/job/beam_PostCommit_Py_VR_Dataflow/ws/src/sdks/python/apache_beam/testing/test_stream.py",> line 200, in __init__
assert event_tags.issubset(self.output_tags)
AssertionError:
-------------------- >> begin captured logging << --------------------
root: INFO: Missing pipeline option (runner). Executing pipeline using the default runner: DirectRunner.
root: DEBUG: Unhandled type_constraint: Union[]
root: DEBUG: Unhandled type_constraint: Union[]
root: DEBUG: Unhandled type_constraint: Union[]
root: DEBUG: Unhandled type_constraint: Union[]
--------------------- >> end captured logging << ---------------------
----------------------------------------------------------------------
XML: nosetests-validatesRunnerStreamingTests-df-py36.xml
----------------------------------------------------------------------
XML: <https://builds.apache.org/job/beam_PostCommit_Py_VR_Dataflow/ws/src/sdks/python/nosetests.xml>
----------------------------------------------------------------------
Ran 28 tests in 1787.282s
FAILED (failures=1)
> Task :sdks:python:test-suites:dataflow:py36:validatesRunnerStreamingTests FAILED
FAILURE: Build completed with 8 failures.
1: Task failed with an exception.
-----------
* Where:
Build file '<https://builds.apache.org/job/beam_PostCommit_Py_VR_Dataflow/ws/src/sdks/python/test-suites/dataflow/py2/build.gradle'> line: 107
* What went wrong:
Execution failed for task ':sdks:python:test-suites:dataflow:py2:validatesRunnerBatchTests'.
> Process 'command 'sh'' finished with non-zero exit value 1
* Try:
Run with --stacktrace option to get the stack trace. Run with --info or --debug option to get more log output. Run with --scan to get full insights.
==============================================================================
2: Task failed with an exception.
-----------
* Where:
Build file '<https://builds.apache.org/job/beam_PostCommit_Py_VR_Dataflow/ws/src/sdks/python/test-suites/dataflow/py37/build.gradle'> line: 111
* What went wrong:
Execution failed for task ':sdks:python:test-suites:dataflow:py37:validatesRunnerBatchTests'.
> Process 'command 'sh'' finished with non-zero exit value 1
* Try:
Run with --stacktrace option to get the stack trace. Run with --info or --debug option to get more log output. Run with --scan to get full insights.
==============================================================================
3: Task failed with an exception.
-----------
* Where:
Build file '<https://builds.apache.org/job/beam_PostCommit_Py_VR_Dataflow/ws/src/sdks/python/test-suites/dataflow/py35/build.gradle'> line: 78
* What went wrong:
Execution failed for task ':sdks:python:test-suites:dataflow:py35:validatesRunnerBatchTests'.
> Process 'command 'sh'' finished with non-zero exit value 1
* Try:
Run with --stacktrace option to get the stack trace. Run with --info or --debug option to get more log output. Run with --scan to get full insights.
==============================================================================
4: Task failed with an exception.
-----------
* Where:
Build file '<https://builds.apache.org/job/beam_PostCommit_Py_VR_Dataflow/ws/src/sdks/python/test-suites/dataflow/py36/build.gradle'> line: 78
* What went wrong:
Execution failed for task ':sdks:python:test-suites:dataflow:py36:validatesRunnerBatchTests'.
> Process 'command 'sh'' finished with non-zero exit value 1
* Try:
Run with --stacktrace option to get the stack trace. Run with --info or --debug option to get more log output. Run with --scan to get full insights.
==============================================================================
5: Task failed with an exception.
-----------
* Where:
Build file '<https://builds.apache.org/job/beam_PostCommit_Py_VR_Dataflow/ws/src/sdks/python/test-suites/dataflow/py2/build.gradle'> line: 135
* What went wrong:
Execution failed for task ':sdks:python:test-suites:dataflow:py2:validatesRunnerStreamingTests'.
> Process 'command 'sh'' finished with non-zero exit value 1
* Try:
Run with --stacktrace option to get the stack trace. Run with --info or --debug option to get more log output. Run with --scan to get full insights.
==============================================================================
6: Task failed with an exception.
-----------
* Where:
Build file '<https://builds.apache.org/job/beam_PostCommit_Py_VR_Dataflow/ws/src/sdks/python/test-suites/dataflow/py35/build.gradle'> line: 101
* What went wrong:
Execution failed for task ':sdks:python:test-suites:dataflow:py35:validatesRunnerStreamingTests'.
> Process 'command 'sh'' finished with non-zero exit value 1
* Try:
Run with --stacktrace option to get the stack trace. Run with --info or --debug option to get more log output. Run with --scan to get full insights.
==============================================================================
7: Task failed with an exception.
-----------
* Where:
Build file '<https://builds.apache.org/job/beam_PostCommit_Py_VR_Dataflow/ws/src/sdks/python/test-suites/dataflow/py37/build.gradle'> line: 134
* What went wrong:
Execution failed for task ':sdks:python:test-suites:dataflow:py37:validatesRunnerStreamingTests'.
> Process 'command 'sh'' finished with non-zero exit value 1
* Try:
Run with --stacktrace option to get the stack trace. Run with --info or --debug option to get more log output. Run with --scan to get full insights.
==============================================================================
8: Task failed with an exception.
-----------
* Where:
Build file '<https://builds.apache.org/job/beam_PostCommit_Py_VR_Dataflow/ws/src/sdks/python/test-suites/dataflow/py36/build.gradle'> line: 101
* What went wrong:
Execution failed for task ':sdks:python:test-suites:dataflow:py36:validatesRunnerStreamingTests'.
> Process 'command 'sh'' finished with non-zero exit value 1
* Try:
Run with --stacktrace option to get the stack trace. Run with --info or --debug option to get more log output. Run with --scan to get full insights.
==============================================================================
* Get more help at https://help.gradle.org
Deprecated Gradle features were used in this build, making it incompatible with Gradle 6.0.
Use '--warning-mode all' to show the individual deprecation warnings.
See https://docs.gradle.org/5.2.1/userguide/command_line_interface.html#sec:command_line_warnings
BUILD FAILED in 1h 4m 35s
74 actionable tasks: 57 executed, 17 from cache
Publishing build scan...
https://gradle.com/s/xhrdm4jzvlf26
Build step 'Invoke Gradle script' changed build result to FAILURE
Build step 'Invoke Gradle script' marked build as failure
---------------------------------------------------------------------
To unsubscribe, e-mail: builds-unsubscribe@beam.apache.org
For additional commands, e-mail: builds-help@beam.apache.org
Build failed in Jenkins: beam_PostCommit_Py_VR_Dataflow #5884
Posted by Apache Jenkins Server <je...@builds.apache.org>.
See <https://builds.apache.org/job/beam_PostCommit_Py_VR_Dataflow/5884/display/redirect?page=changes>
Changes:
[kcweaver] [BEAM-9300] convert struct literal in ZetaSQL
[kcweaver] Test schema does not need to be nullable.
------------------------------------------
[...truncated 20.71 MB...]
part = context.transforms.get_by_id(transform_id)
File "<https://builds.apache.org/job/beam_PostCommit_Py_VR_Dataflow/ws/src/sdks/python/apache_beam/runners/pipeline_context.py",> line 103, in get_by_id
self._id_to_proto[id], self._pipeline_context)
File "<https://builds.apache.org/job/beam_PostCommit_Py_VR_Dataflow/ws/src/sdks/python/apache_beam/pipeline.py",> line 1104, in from_runner_api
transform = ptransform.PTransform.from_runner_api(proto, context)
File "<https://builds.apache.org/job/beam_PostCommit_Py_VR_Dataflow/ws/src/sdks/python/apache_beam/transforms/ptransform.py",> line 684, in from_runner_api
context)
File "<https://builds.apache.org/job/beam_PostCommit_Py_VR_Dataflow/ws/src/sdks/python/apache_beam/testing/test_stream.py",> line 316, in from_runner_api_parameter
output_tags=output_tags)
File "<https://builds.apache.org/job/beam_PostCommit_Py_VR_Dataflow/ws/src/sdks/python/apache_beam/testing/test_stream.py",> line 200, in __init__
assert event_tags.issubset(self.output_tags)
AssertionError:
-------------------- >> begin captured logging << --------------------
root: INFO: Missing pipeline option (runner). Executing pipeline using the default runner: DirectRunner.
--------------------- >> end captured logging << ---------------------
----------------------------------------------------------------------
XML: nosetests-validatesRunnerStreamingTests-df-py35.xml
----------------------------------------------------------------------
XML: <https://builds.apache.org/job/beam_PostCommit_Py_VR_Dataflow/ws/src/sdks/python/nosetests.xml>
----------------------------------------------------------------------
Ran 28 tests in 1880.819s
FAILED (failures=1)
> Task :sdks:python:test-suites:dataflow:py35:validatesRunnerStreamingTests FAILED
> Task :sdks:python:test-suites:dataflow:py36:validatesRunnerStreamingTests
INFO:apache_beam.runners.dataflow.dataflow_runner:2020-02-28T01:42:46.363Z: JOB_MESSAGE_BASIC: Worker pool stopped.
INFO:apache_beam.runners.dataflow.dataflow_runner:Job 2020-02-27_17_35_32-17407293109737634702 is in state JOB_STATE_DONE
Worker logs: https://console.cloud.google.com/dataflow/jobs/us-central1/2020-02-27_17_12_42-10318941495168858975?project=apache-beam-testing
Worker logs: https://console.cloud.google.com/dataflow/jobs/us-central1/2020-02-27_17_20_36-13550470494211476681?project=apache-beam-testing
Worker logs: https://console.cloud.google.com/dataflow/jobs/us-central1/2020-02-27_17_28_17-314604241377896964?project=apache-beam-testing
Worker logs: https://console.cloud.google.com/dataflow/jobs/us-central1/2020-02-27_17_35_32-17407293109737634702?project=apache-beam-testing
Worker logs: https://console.cloud.google.com/dataflow/jobs/us-central1/2020-02-27_17_12_43-4335286202757571041?project=apache-beam-testing
Worker logs: https://console.cloud.google.com/dataflow/jobs/us-central1/2020-02-27_17_19_18-17396531971817294586?project=apache-beam-testing
Worker logs: https://console.cloud.google.com/dataflow/jobs/us-central1/2020-02-27_17_27_04-2549301869116578115?project=apache-beam-testing
Worker logs: https://console.cloud.google.com/dataflow/jobs/us-central1/2020-02-27_17_12_43-5616363637706447904?project=apache-beam-testing
Worker logs: https://console.cloud.google.com/dataflow/jobs/us-central1/2020-02-27_17_19_40-16575393876936191812?project=apache-beam-testing
Worker logs: https://console.cloud.google.com/dataflow/jobs/us-central1/2020-02-27_17_26_50-5242497705242789995?project=apache-beam-testing
Worker logs: https://console.cloud.google.com/dataflow/jobs/us-central1/2020-02-27_17_12_42-1972991529902252926?project=apache-beam-testing
Worker logs: https://console.cloud.google.com/dataflow/jobs/us-central1/2020-02-27_17_20_47-12784130848673599052?project=apache-beam-testing
Worker logs: https://console.cloud.google.com/dataflow/jobs/us-central1/2020-02-27_17_12_41-14447847256546271126?project=apache-beam-testing
Worker logs: https://console.cloud.google.com/dataflow/jobs/us-central1/2020-02-27_17_19_59-13998455177441147490?project=apache-beam-testing
Worker logs: https://console.cloud.google.com/dataflow/jobs/us-central1/2020-02-27_17_27_29-12833728045051553131?project=apache-beam-testing
Worker logs: https://console.cloud.google.com/dataflow/jobs/us-central1/2020-02-27_17_12_42-479862279536660682?project=apache-beam-testing
Worker logs: https://console.cloud.google.com/dataflow/jobs/us-central1/2020-02-27_17_20_01-17556655799866709038?project=apache-beam-testing
Worker logs: https://console.cloud.google.com/dataflow/jobs/us-central1/2020-02-27_17_27_20-12245353865844677123?project=apache-beam-testing
Worker logs: https://console.cloud.google.com/dataflow/jobs/us-central1/2020-02-27_17_12_43-17262900932231056928?project=apache-beam-testing
Worker logs: https://console.cloud.google.com/dataflow/jobs/us-central1/2020-02-27_17_20_45-644977328657096982?project=apache-beam-testing
Worker logs: https://console.cloud.google.com/dataflow/jobs/us-central1/2020-02-27_17_28_13-2377426960545155007?project=apache-beam-testing
Worker logs: https://console.cloud.google.com/dataflow/jobs/us-central1/2020-02-27_17_12_42-14978716163530750269?project=apache-beam-testing
Worker logs: https://console.cloud.google.com/dataflow/jobs/us-central1/2020-02-27_17_19_52-5129058772577413148?project=apache-beam-testing
Worker logs: https://console.cloud.google.com/dataflow/jobs/us-central1/2020-02-27_17_27_23-10566617636267152867?project=apache-beam-testing
test_gbk_many_values (apache_beam.runners.portability.fn_api_runner_test.FnApiBasedStateBackedCoderTest) ... ok
Test TimestampCombiner with EARLIEST. ... ok
Test TimestampCombiner with LATEST. ... ok
Runs streaming Dataflow job and verifies that user metrics are reported ... ok
test_flatten_pcollections (apache_beam.transforms.ptransform_test.PTransformTest) ... ok
test_flatten_one_single_pcollection (apache_beam.transforms.ptransform_test.PTransformTest) ... ok
test_flatten_a_flattened_pcollection (apache_beam.transforms.ptransform_test.PTransformTest) ... ok
test_dofn_lifecycle (apache_beam.transforms.dofn_lifecycle_test.DoFnLifecycleTest) ... ok
test_user_counter_using_pardo (apache_beam.metrics.metric_test.MetricsTest) ... ok
test_flatten_multiple_pcollections_having_multiple_consumers (apache_beam.transforms.ptransform_test.PTransformTest) ... ok
test_impulse (apache_beam.transforms.ptransform_test.PTransformTest) ... ok
test_par_do_with_multiple_outputs_and_using_return (apache_beam.transforms.ptransform_test.PTransformTest) ... ok
test_multiple_empty_outputs (apache_beam.transforms.ptransform_test.PTransformTest) ... ok
test_undeclared_outputs (apache_beam.transforms.ptransform_test.PTransformTest) ... ok
test_par_do_with_multiple_outputs_and_using_yield (apache_beam.transforms.ptransform_test.PTransformTest) ... ok
test_as_dict_twice (apache_beam.transforms.sideinputs_test.SideInputsTest) ... ok
test_as_list_twice (apache_beam.transforms.sideinputs_test.SideInputsTest) ... ok
Test a GBK sideinput, with multiple triggering. ... FAIL
test_as_list_and_as_dict_side_inputs (apache_beam.transforms.sideinputs_test.SideInputsTest) ... ok
test_as_singleton_with_different_defaults (apache_beam.transforms.sideinputs_test.SideInputsTest) ... ok
test_as_singleton_without_unique_labels (apache_beam.transforms.sideinputs_test.SideInputsTest) ... ok
test_default_value_singleton_side_input (apache_beam.transforms.sideinputs_test.SideInputsTest) ... ok
test_flattened_side_input (apache_beam.transforms.sideinputs_test.SideInputsTest) ... ok
test_empty_singleton_side_input (apache_beam.transforms.sideinputs_test.SideInputsTest) ... ok
test_iterable_side_input (apache_beam.transforms.sideinputs_test.SideInputsTest) ... ok
test_reshuffle_preserves_timestamps (apache_beam.transforms.util_test.ReshuffleTest) ... ok
test_element_param (apache_beam.pipeline_test.DoFnTest) ... ok
test_key_param (apache_beam.pipeline_test.DoFnTest) ... ok
======================================================================
FAIL: Test a GBK sideinput, with multiple triggering.
----------------------------------------------------------------------
Traceback (most recent call last):
File "<https://builds.apache.org/job/beam_PostCommit_Py_VR_Dataflow/ws/src/sdks/python/apache_beam/transforms/sideinputs_test.py",> line 401, in test_multi_triggered_gbk_side_input
p.run()
File "<https://builds.apache.org/job/beam_PostCommit_Py_VR_Dataflow/ws/src/sdks/python/apache_beam/testing/test_pipeline.py",> line 112, in run
False if self.not_use_test_runner_api else test_runner_api))
File "<https://builds.apache.org/job/beam_PostCommit_Py_VR_Dataflow/ws/src/sdks/python/apache_beam/pipeline.py",> line 483, in run
self._options).run(False)
File "<https://builds.apache.org/job/beam_PostCommit_Py_VR_Dataflow/ws/src/sdks/python/apache_beam/pipeline.py",> line 809, in from_runner_api
p.transforms_stack = [context.transforms.get_by_id(root_transform_id)]
File "<https://builds.apache.org/job/beam_PostCommit_Py_VR_Dataflow/ws/src/sdks/python/apache_beam/runners/pipeline_context.py",> line 103, in get_by_id
self._id_to_proto[id], self._pipeline_context)
File "<https://builds.apache.org/job/beam_PostCommit_Py_VR_Dataflow/ws/src/sdks/python/apache_beam/pipeline.py",> line 1117, in from_runner_api
part = context.transforms.get_by_id(transform_id)
File "<https://builds.apache.org/job/beam_PostCommit_Py_VR_Dataflow/ws/src/sdks/python/apache_beam/runners/pipeline_context.py",> line 103, in get_by_id
self._id_to_proto[id], self._pipeline_context)
File "<https://builds.apache.org/job/beam_PostCommit_Py_VR_Dataflow/ws/src/sdks/python/apache_beam/pipeline.py",> line 1104, in from_runner_api
transform = ptransform.PTransform.from_runner_api(proto, context)
File "<https://builds.apache.org/job/beam_PostCommit_Py_VR_Dataflow/ws/src/sdks/python/apache_beam/transforms/ptransform.py",> line 684, in from_runner_api
context)
File "<https://builds.apache.org/job/beam_PostCommit_Py_VR_Dataflow/ws/src/sdks/python/apache_beam/testing/test_stream.py",> line 316, in from_runner_api_parameter
output_tags=output_tags)
File "<https://builds.apache.org/job/beam_PostCommit_Py_VR_Dataflow/ws/src/sdks/python/apache_beam/testing/test_stream.py",> line 200, in __init__
assert event_tags.issubset(self.output_tags)
AssertionError:
-------------------- >> begin captured logging << --------------------
root: INFO: Missing pipeline option (runner). Executing pipeline using the default runner: DirectRunner.
root: DEBUG: Unhandled type_constraint: Union[]
root: DEBUG: Unhandled type_constraint: Union[]
root: DEBUG: Unhandled type_constraint: Union[]
root: DEBUG: Unhandled type_constraint: Union[]
--------------------- >> end captured logging << ---------------------
----------------------------------------------------------------------
XML: nosetests-validatesRunnerStreamingTests-df-py36.xml
----------------------------------------------------------------------
XML: <https://builds.apache.org/job/beam_PostCommit_Py_VR_Dataflow/ws/src/sdks/python/nosetests.xml>
----------------------------------------------------------------------
Ran 28 tests in 1838.587s
FAILED (failures=1)
> Task :sdks:python:test-suites:dataflow:py36:validatesRunnerStreamingTests FAILED
FAILURE: Build completed with 8 failures.
1: Task failed with an exception.
-----------
* Where:
Build file '<https://builds.apache.org/job/beam_PostCommit_Py_VR_Dataflow/ws/src/sdks/python/test-suites/dataflow/py35/build.gradle'> line: 78
* What went wrong:
Execution failed for task ':sdks:python:test-suites:dataflow:py35:validatesRunnerBatchTests'.
> Process 'command 'sh'' finished with non-zero exit value 1
* Try:
Run with --stacktrace option to get the stack trace. Run with --info or --debug option to get more log output. Run with --scan to get full insights.
==============================================================================
2: Task failed with an exception.
-----------
* Where:
Build file '<https://builds.apache.org/job/beam_PostCommit_Py_VR_Dataflow/ws/src/sdks/python/test-suites/dataflow/py2/build.gradle'> line: 107
* What went wrong:
Execution failed for task ':sdks:python:test-suites:dataflow:py2:validatesRunnerBatchTests'.
> Process 'command 'sh'' finished with non-zero exit value 1
* Try:
Run with --stacktrace option to get the stack trace. Run with --info or --debug option to get more log output. Run with --scan to get full insights.
==============================================================================
3: Task failed with an exception.
-----------
* Where:
Build file '<https://builds.apache.org/job/beam_PostCommit_Py_VR_Dataflow/ws/src/sdks/python/test-suites/dataflow/py37/build.gradle'> line: 111
* What went wrong:
Execution failed for task ':sdks:python:test-suites:dataflow:py37:validatesRunnerBatchTests'.
> Process 'command 'sh'' finished with non-zero exit value 1
* Try:
Run with --stacktrace option to get the stack trace. Run with --info or --debug option to get more log output. Run with --scan to get full insights.
==============================================================================
4: Task failed with an exception.
-----------
* Where:
Build file '<https://builds.apache.org/job/beam_PostCommit_Py_VR_Dataflow/ws/src/sdks/python/test-suites/dataflow/py36/build.gradle'> line: 78
* What went wrong:
Execution failed for task ':sdks:python:test-suites:dataflow:py36:validatesRunnerBatchTests'.
> Process 'command 'sh'' finished with non-zero exit value 1
* Try:
Run with --stacktrace option to get the stack trace. Run with --info or --debug option to get more log output. Run with --scan to get full insights.
==============================================================================
5: Task failed with an exception.
-----------
* Where:
Build file '<https://builds.apache.org/job/beam_PostCommit_Py_VR_Dataflow/ws/src/sdks/python/test-suites/dataflow/py2/build.gradle'> line: 135
* What went wrong:
Execution failed for task ':sdks:python:test-suites:dataflow:py2:validatesRunnerStreamingTests'.
> Process 'command 'sh'' finished with non-zero exit value 1
* Try:
Run with --stacktrace option to get the stack trace. Run with --info or --debug option to get more log output. Run with --scan to get full insights.
==============================================================================
6: Task failed with an exception.
-----------
* Where:
Build file '<https://builds.apache.org/job/beam_PostCommit_Py_VR_Dataflow/ws/src/sdks/python/test-suites/dataflow/py37/build.gradle'> line: 134
* What went wrong:
Execution failed for task ':sdks:python:test-suites:dataflow:py37:validatesRunnerStreamingTests'.
> Process 'command 'sh'' finished with non-zero exit value 1
* Try:
Run with --stacktrace option to get the stack trace. Run with --info or --debug option to get more log output. Run with --scan to get full insights.
==============================================================================
7: Task failed with an exception.
-----------
* Where:
Build file '<https://builds.apache.org/job/beam_PostCommit_Py_VR_Dataflow/ws/src/sdks/python/test-suites/dataflow/py35/build.gradle'> line: 101
* What went wrong:
Execution failed for task ':sdks:python:test-suites:dataflow:py35:validatesRunnerStreamingTests'.
> Process 'command 'sh'' finished with non-zero exit value 1
* Try:
Run with --stacktrace option to get the stack trace. Run with --info or --debug option to get more log output. Run with --scan to get full insights.
==============================================================================
8: Task failed with an exception.
-----------
* Where:
Build file '<https://builds.apache.org/job/beam_PostCommit_Py_VR_Dataflow/ws/src/sdks/python/test-suites/dataflow/py36/build.gradle'> line: 101
* What went wrong:
Execution failed for task ':sdks:python:test-suites:dataflow:py36:validatesRunnerStreamingTests'.
> Process 'command 'sh'' finished with non-zero exit value 1
* Try:
Run with --stacktrace option to get the stack trace. Run with --info or --debug option to get more log output. Run with --scan to get full insights.
==============================================================================
* Get more help at https://help.gradle.org
Deprecated Gradle features were used in this build, making it incompatible with Gradle 6.0.
Use '--warning-mode all' to show the individual deprecation warnings.
See https://docs.gradle.org/5.2.1/userguide/command_line_interface.html#sec:command_line_warnings
BUILD FAILED in 1h 6m 48s
74 actionable tasks: 57 executed, 17 from cache
Publishing build scan...
https://gradle.com/s/xt6onc56ugypk
Build step 'Invoke Gradle script' changed build result to FAILURE
Build step 'Invoke Gradle script' marked build as failure
---------------------------------------------------------------------
To unsubscribe, e-mail: builds-unsubscribe@beam.apache.org
For additional commands, e-mail: builds-help@beam.apache.org
Build failed in Jenkins: beam_PostCommit_Py_VR_Dataflow #5883
Posted by Apache Jenkins Server <je...@builds.apache.org>.
See <https://builds.apache.org/job/beam_PostCommit_Py_VR_Dataflow/5883/display/redirect?page=changes>
Changes:
[kcweaver] [BEAM-9373] Spark/Flink tests fix string concat
[robinyqiu] Bump Dataflow Java worker container version
------------------------------------------
[...truncated 20.99 MB...]
assert event_tags.issubset(self.output_tags)
AssertionError:
-------------------- >> begin captured logging << --------------------
root: INFO: Missing pipeline option (runner). Executing pipeline using the default runner: DirectRunner.
--------------------- >> end captured logging << ---------------------
----------------------------------------------------------------------
XML: nosetests-validatesRunnerStreamingTests-df-py35.xml
----------------------------------------------------------------------
XML: <https://builds.apache.org/job/beam_PostCommit_Py_VR_Dataflow/ws/src/sdks/python/nosetests.xml>
----------------------------------------------------------------------
Ran 28 tests in 1917.795s
FAILED (failures=1)
> Task :sdks:python:test-suites:dataflow:py35:validatesRunnerStreamingTests FAILED
> Task :sdks:python:test-suites:dataflow:py37:validatesRunnerStreamingTests
INFO:apache_beam.runners.dataflow.dataflow_runner:2020-02-28T00:12:15.951Z: JOB_MESSAGE_BASIC: Finished operation Create/Impulse+Create/FlatMap(<lambda at core.py:2639>)+Create/MaybeReshuffle/Reshuffle/AddRandomKeys+Create/MaybeReshuffle/Reshuffle/ReshufflePerKey/Map(reify_timestamps)+Create/MaybeReshuffle/Reshuffle/ReshufflePerKey/GroupByKey/WriteStream
INFO:apache_beam.runners.dataflow.dataflow_runner:2020-02-28T00:12:15.951Z: JOB_MESSAGE_BASIC: Finished operation assert_that/Create/Impulse+assert_that/Create/FlatMap(<lambda at core.py:2639>)+assert_that/Create/Map(decode)+assert_that/Group/pair_with_0+assert_that/Group/GroupByKey/WriteStream
INFO:apache_beam.runners.dataflow.dataflow_runner:2020-02-28T00:12:15.951Z: JOB_MESSAGE_BASIC: Finished operation assert_that/Group/GroupByKey/ReadStream+assert_that/Group/GroupByKey/MergeBuckets+assert_that/Group/Map(_merge_tagged_vals_under_key)+assert_that/Unkey+assert_that/Match
INFO:apache_beam.runners.dataflow.dataflow_runner:2020-02-28T00:12:15.951Z: JOB_MESSAGE_BASIC: Finished operation Create/MaybeReshuffle/Reshuffle/ReshufflePerKey/GroupByKey/ReadStream+Create/MaybeReshuffle/Reshuffle/ReshufflePerKey/GroupByKey/MergeBuckets+Create/MaybeReshuffle/Reshuffle/ReshufflePerKey/FlatMap(restore_timestamps)+Create/MaybeReshuffle/Reshuffle/RemoveRandomKeys+Create/Map(decode)+Key param+assert_that/WindowInto(WindowIntoFn)+assert_that/ToVoidKey+assert_that/Group/pair_with_1+assert_that/Group/GroupByKey/WriteStream
INFO:apache_beam.runners.dataflow.dataflow_runner:2020-02-28T00:12:16.095Z: JOB_MESSAGE_DETAILED: Cleaning up.
INFO:apache_beam.runners.dataflow.dataflow_runner:2020-02-28T00:12:16.125Z: JOB_MESSAGE_BASIC: Worker pool stopped.
INFO:apache_beam.runners.dataflow.dataflow_runner:2020-02-28T00:12:16.129Z: JOB_MESSAGE_DEBUG: Tearing down pending resources...
INFO:apache_beam.runners.dataflow.dataflow_runner:2020-02-28T00:12:16.130Z: JOB_MESSAGE_DEBUG: Starting worker pool teardown.
INFO:apache_beam.runners.dataflow.dataflow_runner:2020-02-28T00:12:16.138Z: JOB_MESSAGE_BASIC: Stopping worker pool...
INFO:apache_beam.runners.dataflow.dataflow_runner:2020-02-28T00:13:00.922Z: JOB_MESSAGE_DETAILED: Checking permissions granted to controller Service Account.
INFO:apache_beam.runners.dataflow.dataflow_runner:2020-02-28T00:13:35.562Z: JOB_MESSAGE_BASIC: Worker pool stopped.
INFO:apache_beam.runners.dataflow.dataflow_runner:Job 2020-02-27_16_06_20-3490817538798460618 is in state JOB_STATE_DONE
Worker logs: https://console.cloud.google.com/dataflow/jobs/us-central1/2020-02-27_15_40_47-11144427792824224627?project=apache-beam-testing
Worker logs: https://console.cloud.google.com/dataflow/jobs/us-central1/2020-02-27_15_49_00-7563574736356991938?project=apache-beam-testing
Worker logs: https://console.cloud.google.com/dataflow/jobs/us-central1/2020-02-27_15_56_35-12710681248402894989?project=apache-beam-testing
Worker logs: https://console.cloud.google.com/dataflow/jobs/us-central1/2020-02-27_15_40_48-16184068730582941598?project=apache-beam-testing
Worker logs: https://console.cloud.google.com/dataflow/jobs/us-central1/2020-02-27_15_48_54-3555259071948701238?project=apache-beam-testing
Worker logs: https://console.cloud.google.com/dataflow/jobs/us-central1/2020-02-27_15_56_33-18358308329124358327?project=apache-beam-testing
Worker logs: https://console.cloud.google.com/dataflow/jobs/us-central1/2020-02-27_15_40_49-4026230327762997342?project=apache-beam-testing
Worker logs: https://console.cloud.google.com/dataflow/jobs/us-central1/2020-02-27_15_49_02-7080076056141909775?project=apache-beam-testing
Worker logs: https://console.cloud.google.com/dataflow/jobs/us-central1/2020-02-27_15_56_12-18261007389524736150?project=apache-beam-testing
Worker logs: https://console.cloud.google.com/dataflow/jobs/us-central1/2020-02-27_15_40_47-13073387731200575476?project=apache-beam-testing
Worker logs: https://console.cloud.google.com/dataflow/jobs/us-central1/2020-02-27_15_49_00-14157951773439797359?project=apache-beam-testing
Worker logs: https://console.cloud.google.com/dataflow/jobs/us-central1/2020-02-27_15_56_29-13523169359374462089?project=apache-beam-testing
Worker logs: https://console.cloud.google.com/dataflow/jobs/us-central1/2020-02-27_15_40_46-16782631910576845419?project=apache-beam-testing
Worker logs: https://console.cloud.google.com/dataflow/jobs/us-central1/2020-02-27_15_49_00-15196256978488955405?project=apache-beam-testing
Worker logs: https://console.cloud.google.com/dataflow/jobs/us-central1/2020-02-27_15_55_55-15301501172935774143?project=apache-beam-testing
Worker logs: https://console.cloud.google.com/dataflow/jobs/us-central1/2020-02-27_15_40_48-7144573450618076959?project=apache-beam-testing
Worker logs: https://console.cloud.google.com/dataflow/jobs/us-central1/2020-02-27_15_50_52-7978443062754009083?project=apache-beam-testing
Worker logs: https://console.cloud.google.com/dataflow/jobs/us-central1/2020-02-27_15_58_41-569998800735454790?project=apache-beam-testing
Worker logs: https://console.cloud.google.com/dataflow/jobs/us-central1/2020-02-27_16_06_20-3490817538798460618?project=apache-beam-testing
Worker logs: https://console.cloud.google.com/dataflow/jobs/us-central1/2020-02-27_15_40_48-2647866951801997306?project=apache-beam-testing
Worker logs: https://console.cloud.google.com/dataflow/jobs/us-central1/2020-02-27_15_48_58-11456440633358707314?project=apache-beam-testing
Worker logs: https://console.cloud.google.com/dataflow/jobs/us-central1/2020-02-27_15_56_16-484723899029269992?project=apache-beam-testing
Worker logs: https://console.cloud.google.com/dataflow/jobs/us-central1/2020-02-27_15_40_46-16415258722973782323?project=apache-beam-testing
Worker logs: https://console.cloud.google.com/dataflow/jobs/us-central1/2020-02-27_15_49_20-16917608472964221886?project=apache-beam-testing
test_gbk_many_values (apache_beam.runners.portability.fn_api_runner_test.FnApiBasedStateBackedCoderTest) ... ok
Test TimestampCombiner with EARLIEST. ... ok
Test TimestampCombiner with LATEST. ... ok
Runs streaming Dataflow job and verifies that user metrics are reported ... ok
test_flatten_multiple_pcollections_having_multiple_consumers (apache_beam.transforms.ptransform_test.PTransformTest) ... ok
test_dofn_lifecycle (apache_beam.transforms.dofn_lifecycle_test.DoFnLifecycleTest) ... ok
test_user_counter_using_pardo (apache_beam.metrics.metric_test.MetricsTest) ... ok
test_impulse (apache_beam.transforms.ptransform_test.PTransformTest) ... ok
test_flatten_pcollections (apache_beam.transforms.ptransform_test.PTransformTest) ... ok
test_flatten_one_single_pcollection (apache_beam.transforms.ptransform_test.PTransformTest) ... ok
test_flatten_a_flattened_pcollection (apache_beam.transforms.ptransform_test.PTransformTest) ... ok
test_par_do_with_multiple_outputs_and_using_yield (apache_beam.transforms.ptransform_test.PTransformTest) ... ok
test_as_list_and_as_dict_side_inputs (apache_beam.transforms.sideinputs_test.SideInputsTest) ... ok
test_par_do_with_multiple_outputs_and_using_return (apache_beam.transforms.ptransform_test.PTransformTest) ... ok
test_as_dict_twice (apache_beam.transforms.sideinputs_test.SideInputsTest) ... ok
test_multiple_empty_outputs (apache_beam.transforms.ptransform_test.PTransformTest) ... ok
test_undeclared_outputs (apache_beam.transforms.ptransform_test.PTransformTest) ... ok
Test a GBK sideinput, with multiple triggering. ... FAIL
test_as_singleton_with_different_defaults (apache_beam.transforms.sideinputs_test.SideInputsTest) ... ok
test_as_list_twice (apache_beam.transforms.sideinputs_test.SideInputsTest) ... ok
test_as_singleton_without_unique_labels (apache_beam.transforms.sideinputs_test.SideInputsTest) ... ok
test_default_value_singleton_side_input (apache_beam.transforms.sideinputs_test.SideInputsTest) ... ok
test_empty_singleton_side_input (apache_beam.transforms.sideinputs_test.SideInputsTest) ... ok
test_flattened_side_input (apache_beam.transforms.sideinputs_test.SideInputsTest) ... ok
test_reshuffle_preserves_timestamps (apache_beam.transforms.util_test.ReshuffleTest) ... ok
test_iterable_side_input (apache_beam.transforms.sideinputs_test.SideInputsTest) ... ok
test_element_param (apache_beam.pipeline_test.DoFnTest) ... ok
test_key_param (apache_beam.pipeline_test.DoFnTest) ... ok
======================================================================
FAIL: Test a GBK sideinput, with multiple triggering.
----------------------------------------------------------------------
Traceback (most recent call last):
File "<https://builds.apache.org/job/beam_PostCommit_Py_VR_Dataflow/ws/src/sdks/python/apache_beam/transforms/sideinputs_test.py",> line 401, in test_multi_triggered_gbk_side_input
p.run()
File "<https://builds.apache.org/job/beam_PostCommit_Py_VR_Dataflow/ws/src/sdks/python/apache_beam/testing/test_pipeline.py",> line 112, in run
False if self.not_use_test_runner_api else test_runner_api))
File "<https://builds.apache.org/job/beam_PostCommit_Py_VR_Dataflow/ws/src/sdks/python/apache_beam/pipeline.py",> line 483, in run
self._options).run(False)
File "<https://builds.apache.org/job/beam_PostCommit_Py_VR_Dataflow/ws/src/sdks/python/apache_beam/pipeline.py",> line 809, in from_runner_api
p.transforms_stack = [context.transforms.get_by_id(root_transform_id)]
File "<https://builds.apache.org/job/beam_PostCommit_Py_VR_Dataflow/ws/src/sdks/python/apache_beam/runners/pipeline_context.py",> line 103, in get_by_id
self._id_to_proto[id], self._pipeline_context)
File "<https://builds.apache.org/job/beam_PostCommit_Py_VR_Dataflow/ws/src/sdks/python/apache_beam/pipeline.py",> line 1117, in from_runner_api
part = context.transforms.get_by_id(transform_id)
File "<https://builds.apache.org/job/beam_PostCommit_Py_VR_Dataflow/ws/src/sdks/python/apache_beam/runners/pipeline_context.py",> line 103, in get_by_id
self._id_to_proto[id], self._pipeline_context)
File "<https://builds.apache.org/job/beam_PostCommit_Py_VR_Dataflow/ws/src/sdks/python/apache_beam/pipeline.py",> line 1104, in from_runner_api
transform = ptransform.PTransform.from_runner_api(proto, context)
File "<https://builds.apache.org/job/beam_PostCommit_Py_VR_Dataflow/ws/src/sdks/python/apache_beam/transforms/ptransform.py",> line 684, in from_runner_api
context)
File "<https://builds.apache.org/job/beam_PostCommit_Py_VR_Dataflow/ws/src/sdks/python/apache_beam/testing/test_stream.py",> line 316, in from_runner_api_parameter
output_tags=output_tags)
File "<https://builds.apache.org/job/beam_PostCommit_Py_VR_Dataflow/ws/src/sdks/python/apache_beam/testing/test_stream.py",> line 200, in __init__
assert event_tags.issubset(self.output_tags)
AssertionError:
-------------------- >> begin captured logging << --------------------
root: INFO: Missing pipeline option (runner). Executing pipeline using the default runner: DirectRunner.
root: DEBUG: Unhandled type_constraint: Union[]
root: DEBUG: Unhandled type_constraint: Union[]
root: DEBUG: Unhandled type_constraint: Union[]
root: DEBUG: Unhandled type_constraint: Union[]
--------------------- >> end captured logging << ---------------------
----------------------------------------------------------------------
XML: nosetests-validatesRunnerStreamingTests-df-py37.xml
----------------------------------------------------------------------
XML: <https://builds.apache.org/job/beam_PostCommit_Py_VR_Dataflow/ws/src/sdks/python/nosetests.xml>
----------------------------------------------------------------------
Ran 28 tests in 2000.838s
FAILED (failures=1)
> Task :sdks:python:test-suites:dataflow:py37:validatesRunnerStreamingTests FAILED
FAILURE: Build completed with 8 failures.
1: Task failed with an exception.
-----------
* Where:
Build file '<https://builds.apache.org/job/beam_PostCommit_Py_VR_Dataflow/ws/src/sdks/python/test-suites/dataflow/py36/build.gradle'> line: 78
* What went wrong:
Execution failed for task ':sdks:python:test-suites:dataflow:py36:validatesRunnerBatchTests'.
> Process 'command 'sh'' finished with non-zero exit value 1
* Try:
Run with --stacktrace option to get the stack trace. Run with --info or --debug option to get more log output. Run with --scan to get full insights.
==============================================================================
2: Task failed with an exception.
-----------
* Where:
Build file '<https://builds.apache.org/job/beam_PostCommit_Py_VR_Dataflow/ws/src/sdks/python/test-suites/dataflow/py2/build.gradle'> line: 107
* What went wrong:
Execution failed for task ':sdks:python:test-suites:dataflow:py2:validatesRunnerBatchTests'.
> Process 'command 'sh'' finished with non-zero exit value 1
* Try:
Run with --stacktrace option to get the stack trace. Run with --info or --debug option to get more log output. Run with --scan to get full insights.
==============================================================================
3: Task failed with an exception.
-----------
* Where:
Build file '<https://builds.apache.org/job/beam_PostCommit_Py_VR_Dataflow/ws/src/sdks/python/test-suites/dataflow/py35/build.gradle'> line: 78
* What went wrong:
Execution failed for task ':sdks:python:test-suites:dataflow:py35:validatesRunnerBatchTests'.
> Process 'command 'sh'' finished with non-zero exit value 1
* Try:
Run with --stacktrace option to get the stack trace. Run with --info or --debug option to get more log output. Run with --scan to get full insights.
==============================================================================
4: Task failed with an exception.
-----------
* Where:
Build file '<https://builds.apache.org/job/beam_PostCommit_Py_VR_Dataflow/ws/src/sdks/python/test-suites/dataflow/py37/build.gradle'> line: 111
* What went wrong:
Execution failed for task ':sdks:python:test-suites:dataflow:py37:validatesRunnerBatchTests'.
> Process 'command 'sh'' finished with non-zero exit value 1
* Try:
Run with --stacktrace option to get the stack trace. Run with --info or --debug option to get more log output. Run with --scan to get full insights.
==============================================================================
5: Task failed with an exception.
-----------
* Where:
Build file '<https://builds.apache.org/job/beam_PostCommit_Py_VR_Dataflow/ws/src/sdks/python/test-suites/dataflow/py2/build.gradle'> line: 135
* What went wrong:
Execution failed for task ':sdks:python:test-suites:dataflow:py2:validatesRunnerStreamingTests'.
> Process 'command 'sh'' finished with non-zero exit value 1
* Try:
Run with --stacktrace option to get the stack trace. Run with --info or --debug option to get more log output. Run with --scan to get full insights.
==============================================================================
6: Task failed with an exception.
-----------
* Where:
Build file '<https://builds.apache.org/job/beam_PostCommit_Py_VR_Dataflow/ws/src/sdks/python/test-suites/dataflow/py36/build.gradle'> line: 101
* What went wrong:
Execution failed for task ':sdks:python:test-suites:dataflow:py36:validatesRunnerStreamingTests'.
> Process 'command 'sh'' finished with non-zero exit value 1
* Try:
Run with --stacktrace option to get the stack trace. Run with --info or --debug option to get more log output. Run with --scan to get full insights.
==============================================================================
7: Task failed with an exception.
-----------
* Where:
Build file '<https://builds.apache.org/job/beam_PostCommit_Py_VR_Dataflow/ws/src/sdks/python/test-suites/dataflow/py35/build.gradle'> line: 101
* What went wrong:
Execution failed for task ':sdks:python:test-suites:dataflow:py35:validatesRunnerStreamingTests'.
> Process 'command 'sh'' finished with non-zero exit value 1
* Try:
Run with --stacktrace option to get the stack trace. Run with --info or --debug option to get more log output. Run with --scan to get full insights.
==============================================================================
8: Task failed with an exception.
-----------
* Where:
Build file '<https://builds.apache.org/job/beam_PostCommit_Py_VR_Dataflow/ws/src/sdks/python/test-suites/dataflow/py37/build.gradle'> line: 134
* What went wrong:
Execution failed for task ':sdks:python:test-suites:dataflow:py37:validatesRunnerStreamingTests'.
> Process 'command 'sh'' finished with non-zero exit value 1
* Try:
Run with --stacktrace option to get the stack trace. Run with --info or --debug option to get more log output. Run with --scan to get full insights.
==============================================================================
* Get more help at https://help.gradle.org
Deprecated Gradle features were used in this build, making it incompatible with Gradle 6.0.
Use '--warning-mode all' to show the individual deprecation warnings.
See https://docs.gradle.org/5.2.1/userguide/command_line_interface.html#sec:command_line_warnings
BUILD FAILED in 1h 12m 28s
74 actionable tasks: 57 executed, 17 from cache
Publishing build scan...
https://gradle.com/s/fvqjhropir2cw
Build step 'Invoke Gradle script' changed build result to FAILURE
Build step 'Invoke Gradle script' marked build as failure
---------------------------------------------------------------------
To unsubscribe, e-mail: builds-unsubscribe@beam.apache.org
For additional commands, e-mail: builds-help@beam.apache.org
Build failed in Jenkins: beam_PostCommit_Py_VR_Dataflow #5882
Posted by Apache Jenkins Server <je...@builds.apache.org>.
See <https://builds.apache.org/job/beam_PostCommit_Py_VR_Dataflow/5882/display/redirect?page=changes>
Changes:
[suztomo] Linkage Checker 1.1.4
------------------------------------------
[...truncated 20.73 MB...]
transform = ptransform.PTransform.from_runner_api(proto, context)
File "<https://builds.apache.org/job/beam_PostCommit_Py_VR_Dataflow/ws/src/sdks/python/apache_beam/transforms/ptransform.py",> line 684, in from_runner_api
context)
File "<https://builds.apache.org/job/beam_PostCommit_Py_VR_Dataflow/ws/src/sdks/python/apache_beam/testing/test_stream.py",> line 316, in from_runner_api_parameter
output_tags=output_tags)
File "<https://builds.apache.org/job/beam_PostCommit_Py_VR_Dataflow/ws/src/sdks/python/apache_beam/testing/test_stream.py",> line 200, in __init__
assert event_tags.issubset(self.output_tags)
AssertionError:
-------------------- >> begin captured logging << --------------------
root: INFO: Missing pipeline option (runner). Executing pipeline using the default runner: DirectRunner.
root: DEBUG: Unhandled type_constraint: Union[]
root: DEBUG: Unhandled type_constraint: Union[]
root: DEBUG: Unhandled type_constraint: Union[]
root: DEBUG: Unhandled type_constraint: Union[]
--------------------- >> end captured logging << ---------------------
----------------------------------------------------------------------
XML: nosetests-validatesRunnerStreamingTests-df-py37.xml
----------------------------------------------------------------------
XML: <https://builds.apache.org/job/beam_PostCommit_Py_VR_Dataflow/ws/src/sdks/python/nosetests.xml>
----------------------------------------------------------------------
Ran 28 tests in 1781.722s
FAILED (failures=1)
> Task :sdks:python:test-suites:dataflow:py35:validatesRunnerStreamingTests FAILED
> Task :sdks:python:test-suites:dataflow:py36:validatesRunnerStreamingTests
INFO:apache_beam.runners.dataflow.dataflow_runner:2020-02-27T22:39:34.463Z: JOB_MESSAGE_BASIC: Worker pool stopped.
INFO:apache_beam.runners.dataflow.dataflow_runner:Job 2020-02-27_14_32_23-912154997608633077 is in state JOB_STATE_DONE
Worker logs: https://console.cloud.google.com/dataflow/jobs/us-central1/2020-02-27_14_09_27-16541605851079977648?project=apache-beam-testing
Worker logs: https://console.cloud.google.com/dataflow/jobs/us-central1/2020-02-27_14_16_27-15292022339591027088?project=apache-beam-testing
Worker logs: https://console.cloud.google.com/dataflow/jobs/us-central1/2020-02-27_14_24_33-16401849153960145096?project=apache-beam-testing
Worker logs: https://console.cloud.google.com/dataflow/jobs/us-central1/2020-02-27_14_09_28-842038803787314688?project=apache-beam-testing
Worker logs: https://console.cloud.google.com/dataflow/jobs/us-central1/2020-02-27_14_16_31-18007006245151467872?project=apache-beam-testing
Worker logs: https://console.cloud.google.com/dataflow/jobs/us-central1/2020-02-27_14_23_57-2278172282150740987?project=apache-beam-testing
Worker logs: https://console.cloud.google.com/dataflow/jobs/us-central1/2020-02-27_14_09_26-10138629957437639984?project=apache-beam-testing
Worker logs: https://console.cloud.google.com/dataflow/jobs/us-central1/2020-02-27_14_16_36-7387933271784737305?project=apache-beam-testing
Worker logs: https://console.cloud.google.com/dataflow/jobs/us-central1/2020-02-27_14_24_20-2207664378236767539?project=apache-beam-testing
Worker logs: https://console.cloud.google.com/dataflow/jobs/us-central1/2020-02-27_14_09_28-692813772788627223?project=apache-beam-testing
Worker logs: https://console.cloud.google.com/dataflow/jobs/us-central1/2020-02-27_14_17_01-868194473942294976?project=apache-beam-testing
Worker logs: https://console.cloud.google.com/dataflow/jobs/us-central1/2020-02-27_14_09_25-10753683926091931817?project=apache-beam-testing
Worker logs: https://console.cloud.google.com/dataflow/jobs/us-central1/2020-02-27_14_16_34-12328340921592423815?project=apache-beam-testing
Worker logs: https://console.cloud.google.com/dataflow/jobs/us-central1/2020-02-27_14_24_34-10534675886834810989?project=apache-beam-testing
Worker logs: https://console.cloud.google.com/dataflow/jobs/us-central1/2020-02-27_14_32_23-912154997608633077?project=apache-beam-testing
Worker logs: https://console.cloud.google.com/dataflow/jobs/us-central1/2020-02-27_14_09_27-1332664585703433451?project=apache-beam-testing
Worker logs: https://console.cloud.google.com/dataflow/jobs/us-central1/2020-02-27_14_17_01-13971716217413650691?project=apache-beam-testing
Worker logs: https://console.cloud.google.com/dataflow/jobs/us-central1/2020-02-27_14_24_15-5488082448993214546?project=apache-beam-testing
Worker logs: https://console.cloud.google.com/dataflow/jobs/us-central1/2020-02-27_14_09_26-12681914677552409972?project=apache-beam-testing
Worker logs: https://console.cloud.google.com/dataflow/jobs/us-central1/2020-02-27_14_16_45-2226706097278246081?project=apache-beam-testing
Worker logs: https://console.cloud.google.com/dataflow/jobs/us-central1/2020-02-27_14_23_58-2328407675078898807?project=apache-beam-testing
Worker logs: https://console.cloud.google.com/dataflow/jobs/us-central1/2020-02-27_14_09_27-4909470834331321068?project=apache-beam-testing
Worker logs: https://console.cloud.google.com/dataflow/jobs/us-central1/2020-02-27_14_16_35-15196650070300850508?project=apache-beam-testing
Worker logs: https://console.cloud.google.com/dataflow/jobs/us-central1/2020-02-27_14_24_21-991443637907310391?project=apache-beam-testing
test_gbk_many_values (apache_beam.runners.portability.fn_api_runner_test.FnApiBasedStateBackedCoderTest) ... ok
Test TimestampCombiner with EARLIEST. ... ok
Test TimestampCombiner with LATEST. ... ok
test_user_counter_using_pardo (apache_beam.metrics.metric_test.MetricsTest) ... ok
Runs streaming Dataflow job and verifies that user metrics are reported ... ok
test_dofn_lifecycle (apache_beam.transforms.dofn_lifecycle_test.DoFnLifecycleTest) ... ok
test_flatten_pcollections (apache_beam.transforms.ptransform_test.PTransformTest) ... ok
test_flatten_one_single_pcollection (apache_beam.transforms.ptransform_test.PTransformTest) ... ok
test_flatten_a_flattened_pcollection (apache_beam.transforms.ptransform_test.PTransformTest) ... ok
test_flatten_multiple_pcollections_having_multiple_consumers (apache_beam.transforms.ptransform_test.PTransformTest) ... ok
test_impulse (apache_beam.transforms.ptransform_test.PTransformTest) ... ok
test_par_do_with_multiple_outputs_and_using_return (apache_beam.transforms.ptransform_test.PTransformTest) ... ok
test_as_list_and_as_dict_side_inputs (apache_beam.transforms.sideinputs_test.SideInputsTest) ... ok
test_as_list_twice (apache_beam.transforms.sideinputs_test.SideInputsTest) ... ok
test_as_dict_twice (apache_beam.transforms.sideinputs_test.SideInputsTest) ... ok
test_undeclared_outputs (apache_beam.transforms.ptransform_test.PTransformTest) ... ok
test_multiple_empty_outputs (apache_beam.transforms.ptransform_test.PTransformTest) ... ok
Test a GBK sideinput, with multiple triggering. ... FAIL
test_par_do_with_multiple_outputs_and_using_yield (apache_beam.transforms.ptransform_test.PTransformTest) ... ok
test_as_singleton_with_different_defaults (apache_beam.transforms.sideinputs_test.SideInputsTest) ... ok
test_as_singleton_without_unique_labels (apache_beam.transforms.sideinputs_test.SideInputsTest) ... ok
test_reshuffle_preserves_timestamps (apache_beam.transforms.util_test.ReshuffleTest) ... ok
test_empty_singleton_side_input (apache_beam.transforms.sideinputs_test.SideInputsTest) ... ok
test_iterable_side_input (apache_beam.transforms.sideinputs_test.SideInputsTest) ... ok
test_flattened_side_input (apache_beam.transforms.sideinputs_test.SideInputsTest) ... ok
test_default_value_singleton_side_input (apache_beam.transforms.sideinputs_test.SideInputsTest) ... ok
test_element_param (apache_beam.pipeline_test.DoFnTest) ... ok
test_key_param (apache_beam.pipeline_test.DoFnTest) ... ok
======================================================================
FAIL: Test a GBK sideinput, with multiple triggering.
----------------------------------------------------------------------
Traceback (most recent call last):
File "<https://builds.apache.org/job/beam_PostCommit_Py_VR_Dataflow/ws/src/sdks/python/apache_beam/transforms/sideinputs_test.py",> line 401, in test_multi_triggered_gbk_side_input
p.run()
File "<https://builds.apache.org/job/beam_PostCommit_Py_VR_Dataflow/ws/src/sdks/python/apache_beam/testing/test_pipeline.py",> line 112, in run
False if self.not_use_test_runner_api else test_runner_api))
File "<https://builds.apache.org/job/beam_PostCommit_Py_VR_Dataflow/ws/src/sdks/python/apache_beam/pipeline.py",> line 483, in run
self._options).run(False)
File "<https://builds.apache.org/job/beam_PostCommit_Py_VR_Dataflow/ws/src/sdks/python/apache_beam/pipeline.py",> line 809, in from_runner_api
p.transforms_stack = [context.transforms.get_by_id(root_transform_id)]
File "<https://builds.apache.org/job/beam_PostCommit_Py_VR_Dataflow/ws/src/sdks/python/apache_beam/runners/pipeline_context.py",> line 103, in get_by_id
self._id_to_proto[id], self._pipeline_context)
File "<https://builds.apache.org/job/beam_PostCommit_Py_VR_Dataflow/ws/src/sdks/python/apache_beam/pipeline.py",> line 1117, in from_runner_api
part = context.transforms.get_by_id(transform_id)
File "<https://builds.apache.org/job/beam_PostCommit_Py_VR_Dataflow/ws/src/sdks/python/apache_beam/runners/pipeline_context.py",> line 103, in get_by_id
self._id_to_proto[id], self._pipeline_context)
File "<https://builds.apache.org/job/beam_PostCommit_Py_VR_Dataflow/ws/src/sdks/python/apache_beam/pipeline.py",> line 1104, in from_runner_api
transform = ptransform.PTransform.from_runner_api(proto, context)
File "<https://builds.apache.org/job/beam_PostCommit_Py_VR_Dataflow/ws/src/sdks/python/apache_beam/transforms/ptransform.py",> line 684, in from_runner_api
context)
File "<https://builds.apache.org/job/beam_PostCommit_Py_VR_Dataflow/ws/src/sdks/python/apache_beam/testing/test_stream.py",> line 316, in from_runner_api_parameter
output_tags=output_tags)
File "<https://builds.apache.org/job/beam_PostCommit_Py_VR_Dataflow/ws/src/sdks/python/apache_beam/testing/test_stream.py",> line 200, in __init__
assert event_tags.issubset(self.output_tags)
AssertionError:
-------------------- >> begin captured logging << --------------------
root: INFO: Missing pipeline option (runner). Executing pipeline using the default runner: DirectRunner.
root: DEBUG: Unhandled type_constraint: Union[]
root: DEBUG: Unhandled type_constraint: Union[]
root: DEBUG: Unhandled type_constraint: Union[]
root: DEBUG: Unhandled type_constraint: Union[]
--------------------- >> end captured logging << ---------------------
----------------------------------------------------------------------
XML: nosetests-validatesRunnerStreamingTests-df-py36.xml
----------------------------------------------------------------------
XML: <https://builds.apache.org/job/beam_PostCommit_Py_VR_Dataflow/ws/src/sdks/python/nosetests.xml>
----------------------------------------------------------------------
Ran 28 tests in 1844.169s
FAILED (failures=1)
> Task :sdks:python:test-suites:dataflow:py36:validatesRunnerStreamingTests FAILED
FAILURE: Build completed with 8 failures.
1: Task failed with an exception.
-----------
* Where:
Build file '<https://builds.apache.org/job/beam_PostCommit_Py_VR_Dataflow/ws/src/sdks/python/test-suites/dataflow/py2/build.gradle'> line: 107
* What went wrong:
Execution failed for task ':sdks:python:test-suites:dataflow:py2:validatesRunnerBatchTests'.
> Process 'command 'sh'' finished with non-zero exit value 1
* Try:
Run with --stacktrace option to get the stack trace. Run with --info or --debug option to get more log output. Run with --scan to get full insights.
==============================================================================
2: Task failed with an exception.
-----------
* Where:
Build file '<https://builds.apache.org/job/beam_PostCommit_Py_VR_Dataflow/ws/src/sdks/python/test-suites/dataflow/py35/build.gradle'> line: 78
* What went wrong:
Execution failed for task ':sdks:python:test-suites:dataflow:py35:validatesRunnerBatchTests'.
> Process 'command 'sh'' finished with non-zero exit value 1
* Try:
Run with --stacktrace option to get the stack trace. Run with --info or --debug option to get more log output. Run with --scan to get full insights.
==============================================================================
3: Task failed with an exception.
-----------
* Where:
Build file '<https://builds.apache.org/job/beam_PostCommit_Py_VR_Dataflow/ws/src/sdks/python/test-suites/dataflow/py36/build.gradle'> line: 78
* What went wrong:
Execution failed for task ':sdks:python:test-suites:dataflow:py36:validatesRunnerBatchTests'.
> Process 'command 'sh'' finished with non-zero exit value 1
* Try:
Run with --stacktrace option to get the stack trace. Run with --info or --debug option to get more log output. Run with --scan to get full insights.
==============================================================================
4: Task failed with an exception.
-----------
* Where:
Build file '<https://builds.apache.org/job/beam_PostCommit_Py_VR_Dataflow/ws/src/sdks/python/test-suites/dataflow/py37/build.gradle'> line: 111
* What went wrong:
Execution failed for task ':sdks:python:test-suites:dataflow:py37:validatesRunnerBatchTests'.
> Process 'command 'sh'' finished with non-zero exit value 1
* Try:
Run with --stacktrace option to get the stack trace. Run with --info or --debug option to get more log output. Run with --scan to get full insights.
==============================================================================
5: Task failed with an exception.
-----------
* Where:
Build file '<https://builds.apache.org/job/beam_PostCommit_Py_VR_Dataflow/ws/src/sdks/python/test-suites/dataflow/py2/build.gradle'> line: 135
* What went wrong:
Execution failed for task ':sdks:python:test-suites:dataflow:py2:validatesRunnerStreamingTests'.
> Process 'command 'sh'' finished with non-zero exit value 1
* Try:
Run with --stacktrace option to get the stack trace. Run with --info or --debug option to get more log output. Run with --scan to get full insights.
==============================================================================
6: Task failed with an exception.
-----------
* Where:
Build file '<https://builds.apache.org/job/beam_PostCommit_Py_VR_Dataflow/ws/src/sdks/python/test-suites/dataflow/py37/build.gradle'> line: 134
* What went wrong:
Execution failed for task ':sdks:python:test-suites:dataflow:py37:validatesRunnerStreamingTests'.
> Process 'command 'sh'' finished with non-zero exit value 1
* Try:
Run with --stacktrace option to get the stack trace. Run with --info or --debug option to get more log output. Run with --scan to get full insights.
==============================================================================
7: Task failed with an exception.
-----------
* Where:
Build file '<https://builds.apache.org/job/beam_PostCommit_Py_VR_Dataflow/ws/src/sdks/python/test-suites/dataflow/py35/build.gradle'> line: 101
* What went wrong:
Execution failed for task ':sdks:python:test-suites:dataflow:py35:validatesRunnerStreamingTests'.
> Process 'command 'sh'' finished with non-zero exit value 1
* Try:
Run with --stacktrace option to get the stack trace. Run with --info or --debug option to get more log output. Run with --scan to get full insights.
==============================================================================
8: Task failed with an exception.
-----------
* Where:
Build file '<https://builds.apache.org/job/beam_PostCommit_Py_VR_Dataflow/ws/src/sdks/python/test-suites/dataflow/py36/build.gradle'> line: 101
* What went wrong:
Execution failed for task ':sdks:python:test-suites:dataflow:py36:validatesRunnerStreamingTests'.
> Process 'command 'sh'' finished with non-zero exit value 1
* Try:
Run with --stacktrace option to get the stack trace. Run with --info or --debug option to get more log output. Run with --scan to get full insights.
==============================================================================
* Get more help at https://help.gradle.org
Deprecated Gradle features were used in this build, making it incompatible with Gradle 6.0.
Use '--warning-mode all' to show the individual deprecation warnings.
See https://docs.gradle.org/5.2.1/userguide/command_line_interface.html#sec:command_line_warnings
BUILD FAILED in 1h 5m 37s
74 actionable tasks: 57 executed, 17 from cache
Publishing build scan...
https://gradle.com/s/j32i3s2j35k4q
Build step 'Invoke Gradle script' changed build result to FAILURE
Build step 'Invoke Gradle script' marked build as failure
---------------------------------------------------------------------
To unsubscribe, e-mail: builds-unsubscribe@beam.apache.org
For additional commands, e-mail: builds-help@beam.apache.org
Build failed in Jenkins: beam_PostCommit_Py_VR_Dataflow #5881
Posted by Apache Jenkins Server <je...@builds.apache.org>.
See <https://builds.apache.org/job/beam_PostCommit_Py_VR_Dataflow/5881/display/redirect?page=changes>
Changes:
[lcwik] [BEAM-5524] Fix minor issue in style guide.
[github] [BEAM-8201] Pass all other endpoints through provisioning service.
------------------------------------------
[...truncated 20.84 MB...]
File "<https://builds.apache.org/job/beam_PostCommit_Py_VR_Dataflow/ws/src/sdks/python/apache_beam/pipeline.py",> line 1104, in from_runner_api
transform = ptransform.PTransform.from_runner_api(proto, context)
File "<https://builds.apache.org/job/beam_PostCommit_Py_VR_Dataflow/ws/src/sdks/python/apache_beam/transforms/ptransform.py",> line 684, in from_runner_api
context)
File "<https://builds.apache.org/job/beam_PostCommit_Py_VR_Dataflow/ws/src/sdks/python/apache_beam/testing/test_stream.py",> line 316, in from_runner_api_parameter
output_tags=output_tags)
File "<https://builds.apache.org/job/beam_PostCommit_Py_VR_Dataflow/ws/src/sdks/python/apache_beam/testing/test_stream.py",> line 200, in __init__
assert event_tags.issubset(self.output_tags)
AssertionError:
-------------------- >> begin captured logging << --------------------
root: INFO: Missing pipeline option (runner). Executing pipeline using the default runner: DirectRunner.
root: DEBUG: Unhandled type_constraint: Union[]
root: DEBUG: Unhandled type_constraint: Union[]
root: DEBUG: Unhandled type_constraint: Union[]
root: DEBUG: Unhandled type_constraint: Union[]
--------------------- >> end captured logging << ---------------------
----------------------------------------------------------------------
XML: nosetests-validatesRunnerStreamingTests-df-py37.xml
----------------------------------------------------------------------
XML: <https://builds.apache.org/job/beam_PostCommit_Py_VR_Dataflow/ws/src/sdks/python/nosetests.xml>
----------------------------------------------------------------------
Ran 28 tests in 1833.696s
FAILED (failures=1)
> Task :sdks:python:test-suites:dataflow:py36:validatesRunnerStreamingTests
INFO:apache_beam.runners.dataflow.dataflow_runner:2020-02-27T20:07:45.984Z: JOB_MESSAGE_DETAILED: Checking permissions granted to controller Service Account.
INFO:apache_beam.runners.dataflow.dataflow_runner:2020-02-27T20:07:47.344Z: JOB_MESSAGE_BASIC: Worker pool stopped.
INFO:apache_beam.runners.dataflow.dataflow_runner:Job 2020-02-27_12_01_10-8990490300131461334 is in state JOB_STATE_DONE
Worker logs: https://console.cloud.google.com/dataflow/jobs/us-central1/2020-02-27_11_38_03-16503199328370311688?project=apache-beam-testing
Worker logs: https://console.cloud.google.com/dataflow/jobs/us-central1/2020-02-27_11_45_16-15960537161910813462?project=apache-beam-testing
Worker logs: https://console.cloud.google.com/dataflow/jobs/us-central1/2020-02-27_11_53_11-10238755127287781576?project=apache-beam-testing
Worker logs: https://console.cloud.google.com/dataflow/jobs/us-central1/2020-02-27_11_38_04-883973356976832960?project=apache-beam-testing
Worker logs: https://console.cloud.google.com/dataflow/jobs/us-central1/2020-02-27_11_45_06-13723843969946625838?project=apache-beam-testing
Worker logs: https://console.cloud.google.com/dataflow/jobs/us-central1/2020-02-27_11_52_05-10944070307720495523?project=apache-beam-testing
Worker logs: https://console.cloud.google.com/dataflow/jobs/us-central1/2020-02-27_11_38_03-8202812520909676160?project=apache-beam-testing
Worker logs: https://console.cloud.google.com/dataflow/jobs/us-central1/2020-02-27_11_45_24-13101970050026953807?project=apache-beam-testing
Worker logs: https://console.cloud.google.com/dataflow/jobs/us-central1/2020-02-27_11_53_12-16240999556762544557?project=apache-beam-testing
Worker logs: https://console.cloud.google.com/dataflow/jobs/us-central1/2020-02-27_12_01_10-8990490300131461334?project=apache-beam-testing
Worker logs: https://console.cloud.google.com/dataflow/jobs/us-central1/2020-02-27_11_38_02-6741751638690778239?project=apache-beam-testing
Worker logs: https://console.cloud.google.com/dataflow/jobs/us-central1/2020-02-27_11_46_13-5224608862207786861?project=apache-beam-testing
Worker logs: https://console.cloud.google.com/dataflow/jobs/us-central1/2020-02-27_11_38_01-8891292522915530016?project=apache-beam-testing
Worker logs: https://console.cloud.google.com/dataflow/jobs/us-central1/2020-02-27_11_45_36-16839348255216071187?project=apache-beam-testing
Worker logs: https://console.cloud.google.com/dataflow/jobs/us-central1/2020-02-27_11_52_45-15185061477269868772?project=apache-beam-testing
Worker logs: https://console.cloud.google.com/dataflow/jobs/us-central1/2020-02-27_11_38_03-18057229719556789389?project=apache-beam-testing
Worker logs: https://console.cloud.google.com/dataflow/jobs/us-central1/2020-02-27_11_45_40-3824114668898168158?project=apache-beam-testing
Worker logs: https://console.cloud.google.com/dataflow/jobs/us-central1/2020-02-27_11_52_55-172132994724881047?project=apache-beam-testing
Worker logs: https://console.cloud.google.com/dataflow/jobs/us-central1/2020-02-27_11_38_07-17501834988199621278?project=apache-beam-testing
Worker logs: https://console.cloud.google.com/dataflow/jobs/us-central1/2020-02-27_11_45_33-5344298943749101097?project=apache-beam-testing
Worker logs: https://console.cloud.google.com/dataflow/jobs/us-central1/2020-02-27_11_53_09-484552391734411180?project=apache-beam-testing
Worker logs: https://console.cloud.google.com/dataflow/jobs/us-central1/2020-02-27_11_38_03-14269224532320143413?project=apache-beam-testing
Worker logs: https://console.cloud.google.com/dataflow/jobs/us-central1/2020-02-27_11_45_48-11154071007373065725?project=apache-beam-testing
Worker logs: https://console.cloud.google.com/dataflow/jobs/us-central1/2020-02-27_11_53_00-7232440153886433119?project=apache-beam-testing
test_gbk_many_values (apache_beam.runners.portability.fn_api_runner_test.FnApiBasedStateBackedCoderTest) ... ok
Test TimestampCombiner with EARLIEST. ... ok
Test TimestampCombiner with LATEST. ... ok
Runs streaming Dataflow job and verifies that user metrics are reported ... ok
test_user_counter_using_pardo (apache_beam.metrics.metric_test.MetricsTest) ... ok
test_flatten_pcollections (apache_beam.transforms.ptransform_test.PTransformTest) ... ok
test_dofn_lifecycle (apache_beam.transforms.dofn_lifecycle_test.DoFnLifecycleTest) ... ok
test_flatten_multiple_pcollections_having_multiple_consumers (apache_beam.transforms.ptransform_test.PTransformTest) ... ok
test_flatten_a_flattened_pcollection (apache_beam.transforms.ptransform_test.PTransformTest) ... ok
test_flatten_one_single_pcollection (apache_beam.transforms.ptransform_test.PTransformTest) ... ok
test_impulse (apache_beam.transforms.ptransform_test.PTransformTest) ... ok
test_multiple_empty_outputs (apache_beam.transforms.ptransform_test.PTransformTest) ... ok
test_undeclared_outputs (apache_beam.transforms.ptransform_test.PTransformTest) ... ok
test_as_list_and_as_dict_side_inputs (apache_beam.transforms.sideinputs_test.SideInputsTest) ... ok
test_as_list_twice (apache_beam.transforms.sideinputs_test.SideInputsTest) ... ok
test_as_dict_twice (apache_beam.transforms.sideinputs_test.SideInputsTest) ... ok
test_par_do_with_multiple_outputs_and_using_return (apache_beam.transforms.ptransform_test.PTransformTest) ... ok
Test a GBK sideinput, with multiple triggering. ... FAIL
test_par_do_with_multiple_outputs_and_using_yield (apache_beam.transforms.ptransform_test.PTransformTest) ... ok
test_as_singleton_with_different_defaults (apache_beam.transforms.sideinputs_test.SideInputsTest) ... ok
test_as_singleton_without_unique_labels (apache_beam.transforms.sideinputs_test.SideInputsTest) ... ok
test_default_value_singleton_side_input (apache_beam.transforms.sideinputs_test.SideInputsTest) ... ok
test_empty_singleton_side_input (apache_beam.transforms.sideinputs_test.SideInputsTest) ... ok
test_iterable_side_input (apache_beam.transforms.sideinputs_test.SideInputsTest) ... ok
test_flattened_side_input (apache_beam.transforms.sideinputs_test.SideInputsTest) ... ok
test_reshuffle_preserves_timestamps (apache_beam.transforms.util_test.ReshuffleTest) ... ok
test_element_param (apache_beam.pipeline_test.DoFnTest) ... ok
test_key_param (apache_beam.pipeline_test.DoFnTest) ... ok
======================================================================
FAIL: Test a GBK sideinput, with multiple triggering.
----------------------------------------------------------------------
Traceback (most recent call last):
File "<https://builds.apache.org/job/beam_PostCommit_Py_VR_Dataflow/ws/src/sdks/python/apache_beam/transforms/sideinputs_test.py",> line 401, in test_multi_triggered_gbk_side_input
p.run()
File "<https://builds.apache.org/job/beam_PostCommit_Py_VR_Dataflow/ws/src/sdks/python/apache_beam/testing/test_pipeline.py",> line 112, in run
False if self.not_use_test_runner_api else test_runner_api))
File "<https://builds.apache.org/job/beam_PostCommit_Py_VR_Dataflow/ws/src/sdks/python/apache_beam/pipeline.py",> line 483, in run
self._options).run(False)
File "<https://builds.apache.org/job/beam_PostCommit_Py_VR_Dataflow/ws/src/sdks/python/apache_beam/pipeline.py",> line 809, in from_runner_api
p.transforms_stack = [context.transforms.get_by_id(root_transform_id)]
File "<https://builds.apache.org/job/beam_PostCommit_Py_VR_Dataflow/ws/src/sdks/python/apache_beam/runners/pipeline_context.py",> line 103, in get_by_id
self._id_to_proto[id], self._pipeline_context)
File "<https://builds.apache.org/job/beam_PostCommit_Py_VR_Dataflow/ws/src/sdks/python/apache_beam/pipeline.py",> line 1117, in from_runner_api
part = context.transforms.get_by_id(transform_id)
File "<https://builds.apache.org/job/beam_PostCommit_Py_VR_Dataflow/ws/src/sdks/python/apache_beam/runners/pipeline_context.py",> line 103, in get_by_id
self._id_to_proto[id], self._pipeline_context)
File "<https://builds.apache.org/job/beam_PostCommit_Py_VR_Dataflow/ws/src/sdks/python/apache_beam/pipeline.py",> line 1104, in from_runner_api
transform = ptransform.PTransform.from_runner_api(proto, context)
File "<https://builds.apache.org/job/beam_PostCommit_Py_VR_Dataflow/ws/src/sdks/python/apache_beam/transforms/ptransform.py",> line 684, in from_runner_api
context)
File "<https://builds.apache.org/job/beam_PostCommit_Py_VR_Dataflow/ws/src/sdks/python/apache_beam/testing/test_stream.py",> line 316, in from_runner_api_parameter
output_tags=output_tags)
File "<https://builds.apache.org/job/beam_PostCommit_Py_VR_Dataflow/ws/src/sdks/python/apache_beam/testing/test_stream.py",> line 200, in __init__
assert event_tags.issubset(self.output_tags)
AssertionError:
-------------------- >> begin captured logging << --------------------
root: INFO: Missing pipeline option (runner). Executing pipeline using the default runner: DirectRunner.
root: DEBUG: Unhandled type_constraint: Union[]
root: DEBUG: Unhandled type_constraint: Union[]
root: DEBUG: Unhandled type_constraint: Union[]
root: DEBUG: Unhandled type_constraint: Union[]
--------------------- >> end captured logging << ---------------------
----------------------------------------------------------------------
XML: nosetests-validatesRunnerStreamingTests-df-py36.xml
----------------------------------------------------------------------
XML: <https://builds.apache.org/job/beam_PostCommit_Py_VR_Dataflow/ws/src/sdks/python/nosetests.xml>
----------------------------------------------------------------------
Ran 28 tests in 1819.612s
FAILED (failures=1)
> Task :sdks:python:test-suites:dataflow:py36:validatesRunnerStreamingTests FAILED
FAILURE: Build completed with 8 failures.
1: Task failed with an exception.
-----------
* Where:
Build file '<https://builds.apache.org/job/beam_PostCommit_Py_VR_Dataflow/ws/src/sdks/python/test-suites/dataflow/py2/build.gradle'> line: 107
* What went wrong:
Execution failed for task ':sdks:python:test-suites:dataflow:py2:validatesRunnerBatchTests'.
> Process 'command 'sh'' finished with non-zero exit value 1
* Try:
Run with --stacktrace option to get the stack trace. Run with --info or --debug option to get more log output. Run with --scan to get full insights.
==============================================================================
2: Task failed with an exception.
-----------
* Where:
Build file '<https://builds.apache.org/job/beam_PostCommit_Py_VR_Dataflow/ws/src/sdks/python/test-suites/dataflow/py35/build.gradle'> line: 78
* What went wrong:
Execution failed for task ':sdks:python:test-suites:dataflow:py35:validatesRunnerBatchTests'.
> Process 'command 'sh'' finished with non-zero exit value 1
* Try:
Run with --stacktrace option to get the stack trace. Run with --info or --debug option to get more log output. Run with --scan to get full insights.
==============================================================================
3: Task failed with an exception.
-----------
* Where:
Build file '<https://builds.apache.org/job/beam_PostCommit_Py_VR_Dataflow/ws/src/sdks/python/test-suites/dataflow/py37/build.gradle'> line: 111
* What went wrong:
Execution failed for task ':sdks:python:test-suites:dataflow:py37:validatesRunnerBatchTests'.
> Process 'command 'sh'' finished with non-zero exit value 1
* Try:
Run with --stacktrace option to get the stack trace. Run with --info or --debug option to get more log output. Run with --scan to get full insights.
==============================================================================
4: Task failed with an exception.
-----------
* Where:
Build file '<https://builds.apache.org/job/beam_PostCommit_Py_VR_Dataflow/ws/src/sdks/python/test-suites/dataflow/py36/build.gradle'> line: 78
* What went wrong:
Execution failed for task ':sdks:python:test-suites:dataflow:py36:validatesRunnerBatchTests'.
> Process 'command 'sh'' finished with non-zero exit value 1
* Try:
Run with --stacktrace option to get the stack trace. Run with --info or --debug option to get more log output. Run with --scan to get full insights.
==============================================================================
5: Task failed with an exception.
-----------
* Where:
Build file '<https://builds.apache.org/job/beam_PostCommit_Py_VR_Dataflow/ws/src/sdks/python/test-suites/dataflow/py2/build.gradle'> line: 135
* What went wrong:
Execution failed for task ':sdks:python:test-suites:dataflow:py2:validatesRunnerStreamingTests'.
> Process 'command 'sh'' finished with non-zero exit value 1
* Try:
Run with --stacktrace option to get the stack trace. Run with --info or --debug option to get more log output. Run with --scan to get full insights.
==============================================================================
6: Task failed with an exception.
-----------
* Where:
Build file '<https://builds.apache.org/job/beam_PostCommit_Py_VR_Dataflow/ws/src/sdks/python/test-suites/dataflow/py35/build.gradle'> line: 101
* What went wrong:
Execution failed for task ':sdks:python:test-suites:dataflow:py35:validatesRunnerStreamingTests'.
> Process 'command 'sh'' finished with non-zero exit value 1
* Try:
Run with --stacktrace option to get the stack trace. Run with --info or --debug option to get more log output. Run with --scan to get full insights.
==============================================================================
7: Task failed with an exception.
-----------
* Where:
Build file '<https://builds.apache.org/job/beam_PostCommit_Py_VR_Dataflow/ws/src/sdks/python/test-suites/dataflow/py37/build.gradle'> line: 134
* What went wrong:
Execution failed for task ':sdks:python:test-suites:dataflow:py37:validatesRunnerStreamingTests'.
> Process 'command 'sh'' finished with non-zero exit value 1
* Try:
Run with --stacktrace option to get the stack trace. Run with --info or --debug option to get more log output. Run with --scan to get full insights.
==============================================================================
8: Task failed with an exception.
-----------
* Where:
Build file '<https://builds.apache.org/job/beam_PostCommit_Py_VR_Dataflow/ws/src/sdks/python/test-suites/dataflow/py36/build.gradle'> line: 101
* What went wrong:
Execution failed for task ':sdks:python:test-suites:dataflow:py36:validatesRunnerStreamingTests'.
> Process 'command 'sh'' finished with non-zero exit value 1
* Try:
Run with --stacktrace option to get the stack trace. Run with --info or --debug option to get more log output. Run with --scan to get full insights.
==============================================================================
* Get more help at https://help.gradle.org
Deprecated Gradle features were used in this build, making it incompatible with Gradle 6.0.
Use '--warning-mode all' to show the individual deprecation warnings.
See https://docs.gradle.org/5.2.1/userguide/command_line_interface.html#sec:command_line_warnings
BUILD FAILED in 1h 7m 13s
74 actionable tasks: 57 executed, 17 from cache
Publishing build scan...
https://gradle.com/s/3ca5wsiwhmqg2
Build step 'Invoke Gradle script' changed build result to FAILURE
Build step 'Invoke Gradle script' marked build as failure
---------------------------------------------------------------------
To unsubscribe, e-mail: builds-unsubscribe@beam.apache.org
For additional commands, e-mail: builds-help@beam.apache.org