You are viewing a plain text version of this content. The canonical link for it is here.
Posted to builds@beam.apache.org by Apache Jenkins Server <je...@builds.apache.org> on 2023/06/09 21:25:28 UTC

Build failed in Jenkins: beam_PostCommit_Python39 #1922

See <https://ci-beam.apache.org/job/beam_PostCommit_Python39/1922/display/redirect>

Changes:


------------------------------------------
[...truncated 14.24 MB...]
../../build/gradleenv/-1734967050/lib/python3.9/site-packages/pkg_resources/__init__.py:2870
../../build/gradleenv/-1734967050/lib/python3.9/site-packages/pkg_resources/__init__.py:2870
../../build/gradleenv/-1734967050/lib/python3.9/site-packages/pkg_resources/__init__.py:2870
../../build/gradleenv/-1734967050/lib/python3.9/site-packages/pkg_resources/__init__.py:2870
../../build/gradleenv/-1734967050/lib/python3.9/site-packages/pkg_resources/__init__.py:2870
  <https://ci-beam.apache.org/job/beam_PostCommit_Python39/ws/src/build/gradleenv/-1734967050/lib/python3.9/site-packages/pkg_resources/__init__.py>:2870: DeprecationWarning: Deprecated call to `pkg_resources.declare_namespace('google.logging')`.
  Implementing implicit namespace packages (as specified in PEP 420) is preferred to `pkg_resources.declare_namespace`. See https://setuptools.pypa.io/en/latest/references/keywords.html#keyword-namespace-packages
    declare_namespace(pkg)

../../build/gradleenv/-1734967050/lib/python3.9/site-packages/pkg_resources/__init__.py:2870
../../build/gradleenv/-1734967050/lib/python3.9/site-packages/pkg_resources/__init__.py:2870
../../build/gradleenv/-1734967050/lib/python3.9/site-packages/pkg_resources/__init__.py:2870
../../build/gradleenv/-1734967050/lib/python3.9/site-packages/pkg_resources/__init__.py:2870
../../build/gradleenv/-1734967050/lib/python3.9/site-packages/pkg_resources/__init__.py:2870
../../build/gradleenv/-1734967050/lib/python3.9/site-packages/pkg_resources/__init__.py:2870
../../build/gradleenv/-1734967050/lib/python3.9/site-packages/pkg_resources/__init__.py:2870
../../build/gradleenv/-1734967050/lib/python3.9/site-packages/pkg_resources/__init__.py:2870
../../build/gradleenv/-1734967050/lib/python3.9/site-packages/pkg_resources/__init__.py:2870
  <https://ci-beam.apache.org/job/beam_PostCommit_Python39/ws/src/build/gradleenv/-1734967050/lib/python3.9/site-packages/pkg_resources/__init__.py>:2870: DeprecationWarning: Deprecated call to `pkg_resources.declare_namespace('google.iam')`.
  Implementing implicit namespace packages (as specified in PEP 420) is preferred to `pkg_resources.declare_namespace`. See https://setuptools.pypa.io/en/latest/references/keywords.html#keyword-namespace-packages
    declare_namespace(pkg)

../../build/gradleenv/-1734967050/lib/python3.9/site-packages/google/rpc/__init__.py:20
../../build/gradleenv/-1734967050/lib/python3.9/site-packages/google/rpc/__init__.py:20
../../build/gradleenv/-1734967050/lib/python3.9/site-packages/google/rpc/__init__.py:20
../../build/gradleenv/-1734967050/lib/python3.9/site-packages/google/rpc/__init__.py:20
../../build/gradleenv/-1734967050/lib/python3.9/site-packages/google/rpc/__init__.py:20
../../build/gradleenv/-1734967050/lib/python3.9/site-packages/google/rpc/__init__.py:20
../../build/gradleenv/-1734967050/lib/python3.9/site-packages/google/rpc/__init__.py:20
../../build/gradleenv/-1734967050/lib/python3.9/site-packages/google/rpc/__init__.py:20
../../build/gradleenv/-1734967050/lib/python3.9/site-packages/google/rpc/__init__.py:20
  <https://ci-beam.apache.org/job/beam_PostCommit_Python39/ws/src/build/gradleenv/-1734967050/lib/python3.9/site-packages/google/rpc/__init__.py>:20: DeprecationWarning: Deprecated call to `pkg_resources.declare_namespace('google.rpc')`.
  Implementing implicit namespace packages (as specified in PEP 420) is preferred to `pkg_resources.declare_namespace`. See https://setuptools.pypa.io/en/latest/references/keywords.html#keyword-namespace-packages
    pkg_resources.declare_namespace(__name__)

apache_beam/typehints/pandas_type_compatibility_test.py:67
apache_beam/typehints/pandas_type_compatibility_test.py:67
apache_beam/typehints/pandas_type_compatibility_test.py:67
apache_beam/typehints/pandas_type_compatibility_test.py:67
apache_beam/typehints/pandas_type_compatibility_test.py:67
apache_beam/typehints/pandas_type_compatibility_test.py:67
apache_beam/typehints/pandas_type_compatibility_test.py:67
apache_beam/typehints/pandas_type_compatibility_test.py:67
  <https://ci-beam.apache.org/job/beam_PostCommit_Python39/ws/src/sdks/python/apache_beam/typehints/pandas_type_compatibility_test.py>:67: FutureWarning: pandas.Int64Index is deprecated and will be removed from pandas in a future version. Use pandas.Index with the appropriate dtype instead.
    }).set_index(pd.Int64Index(range(123, 223), name='an_index')),

apache_beam/typehints/pandas_type_compatibility_test.py:90
apache_beam/typehints/pandas_type_compatibility_test.py:90
apache_beam/typehints/pandas_type_compatibility_test.py:90
apache_beam/typehints/pandas_type_compatibility_test.py:90
apache_beam/typehints/pandas_type_compatibility_test.py:90
apache_beam/typehints/pandas_type_compatibility_test.py:90
apache_beam/typehints/pandas_type_compatibility_test.py:90
apache_beam/typehints/pandas_type_compatibility_test.py:90
  <https://ci-beam.apache.org/job/beam_PostCommit_Python39/ws/src/sdks/python/apache_beam/typehints/pandas_type_compatibility_test.py>:90: FutureWarning: pandas.Int64Index is deprecated and will be removed from pandas in a future version. Use pandas.Index with the appropriate dtype instead.
    pd.Int64Index(range(123, 223), name='an_index'),

apache_beam/typehints/pandas_type_compatibility_test.py:91
apache_beam/typehints/pandas_type_compatibility_test.py:91
apache_beam/typehints/pandas_type_compatibility_test.py:91
apache_beam/typehints/pandas_type_compatibility_test.py:91
apache_beam/typehints/pandas_type_compatibility_test.py:91
apache_beam/typehints/pandas_type_compatibility_test.py:91
apache_beam/typehints/pandas_type_compatibility_test.py:91
apache_beam/typehints/pandas_type_compatibility_test.py:91
  <https://ci-beam.apache.org/job/beam_PostCommit_Python39/ws/src/sdks/python/apache_beam/typehints/pandas_type_compatibility_test.py>:91: FutureWarning: pandas.Int64Index is deprecated and will be removed from pandas in a future version. Use pandas.Index with the appropriate dtype instead.
    pd.Int64Index(range(475, 575), name='another_index'),

apache_beam/dataframe/io_it_test.py: 3 warnings
apache_beam/examples/cookbook/bigquery_tornadoes_it_test.py: 1 warning
apache_beam/examples/dataframe/flight_delays_it_test.py: 1 warning
apache_beam/io/gcp/big_query_query_to_table_it_test.py: 4 warnings
apache_beam/io/gcp/bigquery_io_read_it_test.py: 2 warnings
apache_beam/io/gcp/bigquery_read_it_test.py: 7 warnings
apache_beam/io/gcp/bigquery_json_it_test.py: 3 warnings
  <https://ci-beam.apache.org/job/beam_PostCommit_Python39/ws/src/sdks/python/apache_beam/io/gcp/bigquery.py>:2664: BeamDeprecationWarning: options is deprecated since First stable release. References to <pipeline>.options will not be supported
    temp_location = pcoll.pipeline.options.view_as(

apache_beam/dataframe/io_it_test.py: 3 warnings
apache_beam/examples/cookbook/bigquery_tornadoes_it_test.py: 1 warning
apache_beam/examples/dataframe/flight_delays_it_test.py: 1 warning
apache_beam/io/gcp/big_query_query_to_table_it_test.py: 4 warnings
apache_beam/io/gcp/bigquery_io_read_it_test.py: 2 warnings
apache_beam/io/gcp/bigquery_read_it_test.py: 7 warnings
apache_beam/io/gcp/bigquery_json_it_test.py: 3 warnings
  <https://ci-beam.apache.org/job/beam_PostCommit_Python39/ws/src/sdks/python/apache_beam/io/gcp/bigquery.py>:2666: BeamDeprecationWarning: options is deprecated since First stable release. References to <pipeline>.options will not be supported
    job_name = pcoll.pipeline.options.view_as(GoogleCloudOptions).job_name

apache_beam/dataframe/io_it_test.py: 3 warnings
apache_beam/examples/cookbook/bigquery_tornadoes_it_test.py: 1 warning
apache_beam/examples/dataframe/flight_delays_it_test.py: 1 warning
apache_beam/io/gcp/big_query_query_to_table_it_test.py: 4 warnings
apache_beam/io/gcp/bigquery_io_read_it_test.py: 2 warnings
apache_beam/io/gcp/bigquery_read_it_test.py: 7 warnings
apache_beam/io/gcp/bigquery_json_it_test.py: 3 warnings
  <https://ci-beam.apache.org/job/beam_PostCommit_Python39/ws/src/sdks/python/apache_beam/io/gcp/bigquery.py>:2690: BeamDeprecationWarning: options is deprecated since First stable release. References to <pipeline>.options will not be supported
    pipeline_options=pcoll.pipeline.options,

apache_beam/dataframe/io_it_test.py: 2 warnings
apache_beam/io/gcp/bigquery_json_it_test.py: 1 warning
apache_beam/io/gcp/bigquery_read_it_test.py: 9 warnings
  <https://ci-beam.apache.org/job/beam_PostCommit_Python39/ws/src/sdks/python/apache_beam/io/gcp/bigquery.py>:2708: BeamDeprecationWarning: options is deprecated since First stable release. References to <pipeline>.options will not be supported
    project_id = pcoll.pipeline.options.view_as(GoogleCloudOptions).project

apache_beam/dataframe/io_it_test.py: 2 warnings
apache_beam/io/gcp/bigquery_json_it_test.py: 1 warning
apache_beam/io/gcp/bigquery_read_it_test.py: 9 warnings
  <https://ci-beam.apache.org/job/beam_PostCommit_Python39/ws/src/sdks/python/apache_beam/io/gcp/bigquery.py>:2729: BeamDeprecationWarning: options is deprecated since First stable release. References to <pipeline>.options will not be supported
    pipeline_options=pcoll.pipeline.options,

apache_beam/examples/cookbook/bigquery_tornadoes_it_test.py: 1 warning
apache_beam/io/gcp/big_query_query_to_table_it_test.py: 4 warnings
apache_beam/io/gcp/bigquery_write_it_test.py: 4 warnings
apache_beam/io/gcp/bigquery_test.py: 2 warnings
  <https://ci-beam.apache.org/job/beam_PostCommit_Python39/ws/src/sdks/python/apache_beam/io/gcp/bigquery.py>:2024: BeamDeprecationWarning: options is deprecated since First stable release. References to <pipeline>.options will not be supported
    self.table_reference.projectId = pcoll.pipeline.options.view_as(

apache_beam/examples/cookbook/bigquery_tornadoes_it_test.py: 1 warning
apache_beam/examples/complete/game/game_stats_it_test.py: 2 warnings
apache_beam/examples/complete/game/hourly_team_score_it_test.py: 1 warning
apache_beam/io/gcp/big_query_query_to_table_it_test.py: 4 warnings
apache_beam/examples/complete/game/leader_board_it_test.py: 2 warnings
apache_beam/io/gcp/bigquery_write_it_test.py: 4 warnings
apache_beam/io/gcp/bigquery_json_it_test.py: 2 warnings
apache_beam/io/gcp/bigquery_test.py: 6 warnings
apache_beam/io/gcp/bigquery_file_loads_test.py: 3 warnings
  <https://ci-beam.apache.org/job/beam_PostCommit_Python39/ws/src/sdks/python/apache_beam/io/gcp/bigquery.py>:2028: BeamDeprecationWarning: options is deprecated since First stable release. References to <pipeline>.options will not be supported
    is_streaming_pipeline = p.options.view_as(StandardOptions).streaming

apache_beam/examples/cookbook/bigquery_tornadoes_it_test.py: 1 warning
apache_beam/examples/complete/game/game_stats_it_test.py: 2 warnings
apache_beam/examples/complete/game/hourly_team_score_it_test.py: 1 warning
apache_beam/io/gcp/big_query_query_to_table_it_test.py: 4 warnings
apache_beam/examples/complete/game/leader_board_it_test.py: 2 warnings
apache_beam/io/gcp/bigquery_write_it_test.py: 4 warnings
apache_beam/io/gcp/bigquery_json_it_test.py: 2 warnings
apache_beam/io/gcp/bigquery_test.py: 6 warnings
apache_beam/io/gcp/bigquery_file_loads_test.py: 3 warnings
  <https://ci-beam.apache.org/job/beam_PostCommit_Python39/ws/src/sdks/python/apache_beam/io/gcp/bigquery.py>:2034: BeamDeprecationWarning: options is deprecated since First stable release. References to <pipeline>.options will not be supported
    experiments = p.options.view_as(DebugOptions).experiments or []

apache_beam/examples/cookbook/bigquery_tornadoes_it_test.py: 1 warning
apache_beam/io/gcp/big_query_query_to_table_it_test.py: 4 warnings
apache_beam/io/gcp/bigquery_write_it_test.py: 3 warnings
apache_beam/io/gcp/bigquery_test.py: 3 warnings
apache_beam/io/gcp/bigquery_file_loads_test.py: 3 warnings
  <https://ci-beam.apache.org/job/beam_PostCommit_Python39/ws/src/sdks/python/apache_beam/io/gcp/bigquery_file_loads.py>:1169: BeamDeprecationWarning: options is deprecated since First stable release. References to <pipeline>.options will not be supported
    self.project = self.project or p.options.view_as(GoogleCloudOptions).project

apache_beam/examples/cookbook/bigquery_tornadoes_it_test.py: 1 warning
apache_beam/examples/complete/game/hourly_team_score_it_test.py: 1 warning
apache_beam/io/gcp/big_query_query_to_table_it_test.py: 4 warnings
apache_beam/io/gcp/bigquery_write_it_test.py: 3 warnings
apache_beam/io/gcp/bigquery_test.py: 3 warnings
apache_beam/io/gcp/bigquery_file_loads_test.py: 3 warnings
  <https://ci-beam.apache.org/job/beam_PostCommit_Python39/ws/src/sdks/python/apache_beam/io/gcp/bigquery_file_loads.py>:1176: BeamDeprecationWarning: options is deprecated since First stable release. References to <pipeline>.options will not be supported
    temp_location = p.options.view_as(GoogleCloudOptions).temp_location

apache_beam/examples/cookbook/bigquery_tornadoes_it_test.py: 1 warning
apache_beam/examples/complete/game/hourly_team_score_it_test.py: 1 warning
apache_beam/io/gcp/big_query_query_to_table_it_test.py: 4 warnings
apache_beam/io/gcp/bigquery_write_it_test.py: 3 warnings
apache_beam/io/gcp/bigquery_test.py: 3 warnings
apache_beam/io/gcp/bigquery_file_loads_test.py: 3 warnings
  <https://ci-beam.apache.org/job/beam_PostCommit_Python39/ws/src/sdks/python/apache_beam/io/gcp/bigquery_file_loads.py>:1178: BeamDeprecationWarning: options is deprecated since First stable release. References to <pipeline>.options will not be supported
    p.options.view_as(GoogleCloudOptions).job_name or 'AUTOMATIC_JOB_NAME')

apache_beam/examples/cookbook/bigquery_tornadoes_it_test.py::BigqueryTornadoesIT::test_bigquery_tornadoes_it
  <https://ci-beam.apache.org/job/beam_PostCommit_Python39/ws/src/sdks/python/apache_beam/io/gcp/tests/utils.py>:100: PendingDeprecationWarning: Client.dataset is deprecated and will be removed in a future version. Use a string like 'my_project.my_dataset' or a cloud.google.bigquery.DatasetReference object, instead.
    table_ref = client.dataset(dataset_id).table(table_id)

apache_beam/examples/complete/game/game_stats_it_test.py::GameStatsIT::test_game_stats_it
apache_beam/examples/complete/game/hourly_team_score_it_test.py::HourlyTeamScoreIT::test_hourly_team_score_it
apache_beam/examples/complete/game/leader_board_it_test.py::LeaderBoardIT::test_leader_board_it
apache_beam/io/gcp/bigquery_test.py::PubSubBigQueryIT::test_file_loads
apache_beam/io/gcp/bigquery_test.py::PubSubBigQueryIT::test_streaming_inserts
  <https://ci-beam.apache.org/job/beam_PostCommit_Python39/ws/src/sdks/python/apache_beam/io/gcp/tests/utils.py>:63: PendingDeprecationWarning: Client.dataset is deprecated and will be removed in a future version. Use a string like 'my_project.my_dataset' or a cloud.google.bigquery.DatasetReference object, instead.
    dataset_ref = client.dataset(unique_dataset_name, project=project)

apache_beam/examples/dataframe/flight_delays_it_test.py::FlightDelaysTest::test_flight_delays
  <https://ci-beam.apache.org/job/beam_PostCommit_Python39/ws/src/sdks/python/apache_beam/examples/dataframe/flight_delays.py>:47: FutureWarning: The default value of numeric_only in DataFrame.mean is deprecated. In a future version, it will default to False. In addition, specifying 'numeric_only=None' is deprecated. Select only valid columns or specify the value of numeric_only to silence this warning.
    return airline_df[at_top_airports].mean()

apache_beam/examples/dataframe/flight_delays_it_test.py::FlightDelaysTest::test_flight_delays
apache_beam/examples/dataframe/taxiride_it_test.py::TaxirideIT::test_aggregation
apache_beam/examples/dataframe/taxiride_it_test.py::TaxirideIT::test_enrich
  <https://ci-beam.apache.org/job/beam_PostCommit_Python39/ws/src/sdks/python/apache_beam/io/fileio.py>:593: BeamDeprecationWarning: options is deprecated since First stable release. References to <pipeline>.options will not be supported
    p.options.view_as(GoogleCloudOptions).temp_location or

apache_beam/io/gcp/bigquery_test.py::BigQueryStreamingInsertTransformIntegrationTests::test_multiple_destinations_transform
  <https://ci-beam.apache.org/job/beam_PostCommit_Python39/ws/src/sdks/python/apache_beam/io/gcp/bigquery_test.py>:1694: BeamDeprecationWarning: options is deprecated since First stable release. References to <pipeline>.options will not be supported
    streaming = self.test_pipeline.options.view_as(StandardOptions).streaming

apache_beam/io/gcp/bigquery_read_it_test.py::ReadTests::test_native_source
  <https://ci-beam.apache.org/job/beam_PostCommit_Python39/ws/src/sdks/python/apache_beam/io/gcp/bigquery_read_it_test.py>:170: BeamDeprecationWarning: BigQuerySource is deprecated since 2.25.0. Use ReadFromBigQuery instead.
    beam.io.BigQuerySource(query=self.query, use_standard_sql=True)))

apache_beam/io/gcp/bigquery_read_it_test.py::ReadNewTypesTests::test_native_source
  <https://ci-beam.apache.org/job/beam_PostCommit_Python39/ws/src/sdks/python/apache_beam/io/gcp/bigquery_read_it_test.py>:693: BeamDeprecationWarning: BigQuerySource is deprecated since 2.25.0. Use ReadFromBigQuery instead.
    beam.io.BigQuerySource(query=self.query, use_standard_sql=True)))

apache_beam/io/gcp/bigquery_read_it_test.py::ReadAllBQTests::test_read_queries
  <https://ci-beam.apache.org/job/beam_PostCommit_Python39/ws/src/sdks/python/apache_beam/io/gcp/bigquery.py>:2836: BeamDeprecationWarning: options is deprecated since First stable release. References to <pipeline>.options will not be supported
    job_name = pcoll.pipeline.options.view_as(GoogleCloudOptions).job_name

apache_beam/io/gcp/bigquery_read_it_test.py::ReadAllBQTests::test_read_queries
  <https://ci-beam.apache.org/job/beam_PostCommit_Python39/ws/src/sdks/python/apache_beam/io/gcp/bigquery.py>:2837: BeamDeprecationWarning: options is deprecated since First stable release. References to <pipeline>.options will not be supported
    project = pcoll.pipeline.options.view_as(GoogleCloudOptions).project

apache_beam/io/gcp/bigquery_read_it_test.py::ReadAllBQTests::test_read_queries
  <https://ci-beam.apache.org/job/beam_PostCommit_Python39/ws/src/sdks/python/apache_beam/io/gcp/bigquery.py>:2850: BeamDeprecationWarning: options is deprecated since First stable release. References to <pipeline>.options will not be supported
    options=pcoll.pipeline.options,

-- Docs: https://docs.pytest.org/en/stable/how-to/capture-warnings.html
- generated xml file: <https://ci-beam.apache.org/job/beam_PostCommit_Python39/ws/src/sdks/python/pytest_postCommitIT-df-py39.xml> -
========== 83 passed, 39 skipped, 592 warnings in 9336.34s (2:35:36) ===========

FAILURE: Build failed with an exception.

* Where:
Script '<https://ci-beam.apache.org/job/beam_PostCommit_Python39/ws/src/sdks/python/test-suites/direct/common.gradle'> line: 186

* What went wrong:
Execution failed for task ':sdks:python:test-suites:direct:py39:hdfsIntegrationTest'.
> Process 'command 'sh'' finished with non-zero exit value 1

* Try:
> Run with --stacktrace option to get the stack trace.
> Run with --info or --debug option to get more log output.

* Get more help at https://help.gradle.org

Deprecated Gradle features were used in this build, making it incompatible with Gradle 8.0.

You can use '--warning-mode all' to show the individual deprecation warnings and determine if they come from your own scripts or plugins.

See https://docs.gradle.org/7.5.1/userguide/command_line_interface.html#sec:command_line_warnings

Execution optimizations have been disabled for 1 invalid unit(s) of work during this build to ensure correctness.
Please consult deprecation warnings for more details.

BUILD FAILED in 2h 42m 6s
213 actionable tasks: 154 executed, 53 from cache, 6 up-to-date

Publishing build scan...
https://ge.apache.org/s/dpb33oz7qpk72

Build step 'Invoke Gradle script' changed build result to FAILURE
Build step 'Invoke Gradle script' marked build as failure

---------------------------------------------------------------------
To unsubscribe, e-mail: builds-unsubscribe@beam.apache.org
For additional commands, e-mail: builds-help@beam.apache.org


Jenkins build is back to normal : beam_PostCommit_Python39 #1929

Posted by Apache Jenkins Server <je...@builds.apache.org>.
See <https://ci-beam.apache.org/job/beam_PostCommit_Python39/1929/display/redirect?page=changes>


---------------------------------------------------------------------
To unsubscribe, e-mail: builds-unsubscribe@beam.apache.org
For additional commands, e-mail: builds-help@beam.apache.org


Build failed in Jenkins: beam_PostCommit_Python39 #1928

Posted by Apache Jenkins Server <je...@builds.apache.org>.
See <https://ci-beam.apache.org/job/beam_PostCommit_Python39/1928/display/redirect>

Changes:


------------------------------------------
[...truncated 16.41 MB...]
../../build/gradleenv/-1734967050/lib/python3.9/site-packages/pkg_resources/__init__.py:2870
../../build/gradleenv/-1734967050/lib/python3.9/site-packages/pkg_resources/__init__.py:2870
../../build/gradleenv/-1734967050/lib/python3.9/site-packages/pkg_resources/__init__.py:2870
../../build/gradleenv/-1734967050/lib/python3.9/site-packages/pkg_resources/__init__.py:2870
../../build/gradleenv/-1734967050/lib/python3.9/site-packages/pkg_resources/__init__.py:2870
  <https://ci-beam.apache.org/job/beam_PostCommit_Python39/ws/src/build/gradleenv/-1734967050/lib/python3.9/site-packages/pkg_resources/__init__.py>:2870: DeprecationWarning: Deprecated call to `pkg_resources.declare_namespace('google.logging')`.
  Implementing implicit namespace packages (as specified in PEP 420) is preferred to `pkg_resources.declare_namespace`. See https://setuptools.pypa.io/en/latest/references/keywords.html#keyword-namespace-packages
    declare_namespace(pkg)

../../build/gradleenv/-1734967050/lib/python3.9/site-packages/pkg_resources/__init__.py:2870
../../build/gradleenv/-1734967050/lib/python3.9/site-packages/pkg_resources/__init__.py:2870
../../build/gradleenv/-1734967050/lib/python3.9/site-packages/pkg_resources/__init__.py:2870
../../build/gradleenv/-1734967050/lib/python3.9/site-packages/pkg_resources/__init__.py:2870
../../build/gradleenv/-1734967050/lib/python3.9/site-packages/pkg_resources/__init__.py:2870
../../build/gradleenv/-1734967050/lib/python3.9/site-packages/pkg_resources/__init__.py:2870
../../build/gradleenv/-1734967050/lib/python3.9/site-packages/pkg_resources/__init__.py:2870
../../build/gradleenv/-1734967050/lib/python3.9/site-packages/pkg_resources/__init__.py:2870
../../build/gradleenv/-1734967050/lib/python3.9/site-packages/pkg_resources/__init__.py:2870
  <https://ci-beam.apache.org/job/beam_PostCommit_Python39/ws/src/build/gradleenv/-1734967050/lib/python3.9/site-packages/pkg_resources/__init__.py>:2870: DeprecationWarning: Deprecated call to `pkg_resources.declare_namespace('google.iam')`.
  Implementing implicit namespace packages (as specified in PEP 420) is preferred to `pkg_resources.declare_namespace`. See https://setuptools.pypa.io/en/latest/references/keywords.html#keyword-namespace-packages
    declare_namespace(pkg)

../../build/gradleenv/-1734967050/lib/python3.9/site-packages/google/rpc/__init__.py:20
../../build/gradleenv/-1734967050/lib/python3.9/site-packages/google/rpc/__init__.py:20
../../build/gradleenv/-1734967050/lib/python3.9/site-packages/google/rpc/__init__.py:20
../../build/gradleenv/-1734967050/lib/python3.9/site-packages/google/rpc/__init__.py:20
../../build/gradleenv/-1734967050/lib/python3.9/site-packages/google/rpc/__init__.py:20
../../build/gradleenv/-1734967050/lib/python3.9/site-packages/google/rpc/__init__.py:20
../../build/gradleenv/-1734967050/lib/python3.9/site-packages/google/rpc/__init__.py:20
../../build/gradleenv/-1734967050/lib/python3.9/site-packages/google/rpc/__init__.py:20
../../build/gradleenv/-1734967050/lib/python3.9/site-packages/google/rpc/__init__.py:20
  <https://ci-beam.apache.org/job/beam_PostCommit_Python39/ws/src/build/gradleenv/-1734967050/lib/python3.9/site-packages/google/rpc/__init__.py>:20: DeprecationWarning: Deprecated call to `pkg_resources.declare_namespace('google.rpc')`.
  Implementing implicit namespace packages (as specified in PEP 420) is preferred to `pkg_resources.declare_namespace`. See https://setuptools.pypa.io/en/latest/references/keywords.html#keyword-namespace-packages
    pkg_resources.declare_namespace(__name__)

apache_beam/typehints/pandas_type_compatibility_test.py:67
apache_beam/typehints/pandas_type_compatibility_test.py:67
apache_beam/typehints/pandas_type_compatibility_test.py:67
apache_beam/typehints/pandas_type_compatibility_test.py:67
apache_beam/typehints/pandas_type_compatibility_test.py:67
apache_beam/typehints/pandas_type_compatibility_test.py:67
apache_beam/typehints/pandas_type_compatibility_test.py:67
apache_beam/typehints/pandas_type_compatibility_test.py:67
  <https://ci-beam.apache.org/job/beam_PostCommit_Python39/ws/src/sdks/python/apache_beam/typehints/pandas_type_compatibility_test.py>:67: FutureWarning: pandas.Int64Index is deprecated and will be removed from pandas in a future version. Use pandas.Index with the appropriate dtype instead.
    }).set_index(pd.Int64Index(range(123, 223), name='an_index')),

apache_beam/typehints/pandas_type_compatibility_test.py:90
apache_beam/typehints/pandas_type_compatibility_test.py:90
apache_beam/typehints/pandas_type_compatibility_test.py:90
apache_beam/typehints/pandas_type_compatibility_test.py:90
apache_beam/typehints/pandas_type_compatibility_test.py:90
apache_beam/typehints/pandas_type_compatibility_test.py:90
apache_beam/typehints/pandas_type_compatibility_test.py:90
apache_beam/typehints/pandas_type_compatibility_test.py:90
  <https://ci-beam.apache.org/job/beam_PostCommit_Python39/ws/src/sdks/python/apache_beam/typehints/pandas_type_compatibility_test.py>:90: FutureWarning: pandas.Int64Index is deprecated and will be removed from pandas in a future version. Use pandas.Index with the appropriate dtype instead.
    pd.Int64Index(range(123, 223), name='an_index'),

apache_beam/typehints/pandas_type_compatibility_test.py:91
apache_beam/typehints/pandas_type_compatibility_test.py:91
apache_beam/typehints/pandas_type_compatibility_test.py:91
apache_beam/typehints/pandas_type_compatibility_test.py:91
apache_beam/typehints/pandas_type_compatibility_test.py:91
apache_beam/typehints/pandas_type_compatibility_test.py:91
apache_beam/typehints/pandas_type_compatibility_test.py:91
apache_beam/typehints/pandas_type_compatibility_test.py:91
  <https://ci-beam.apache.org/job/beam_PostCommit_Python39/ws/src/sdks/python/apache_beam/typehints/pandas_type_compatibility_test.py>:91: FutureWarning: pandas.Int64Index is deprecated and will be removed from pandas in a future version. Use pandas.Index with the appropriate dtype instead.
    pd.Int64Index(range(475, 575), name='another_index'),

apache_beam/dataframe/io_it_test.py: 3 warnings
apache_beam/examples/cookbook/bigquery_tornadoes_it_test.py: 1 warning
apache_beam/examples/dataframe/flight_delays_it_test.py: 1 warning
apache_beam/io/gcp/big_query_query_to_table_it_test.py: 4 warnings
apache_beam/io/gcp/bigquery_io_read_it_test.py: 2 warnings
apache_beam/io/gcp/bigquery_json_it_test.py: 3 warnings
apache_beam/io/gcp/bigquery_read_it_test.py: 7 warnings
  <https://ci-beam.apache.org/job/beam_PostCommit_Python39/ws/src/sdks/python/apache_beam/io/gcp/bigquery.py>:2664: BeamDeprecationWarning: options is deprecated since First stable release. References to <pipeline>.options will not be supported
    temp_location = pcoll.pipeline.options.view_as(

apache_beam/dataframe/io_it_test.py: 3 warnings
apache_beam/examples/cookbook/bigquery_tornadoes_it_test.py: 1 warning
apache_beam/examples/dataframe/flight_delays_it_test.py: 1 warning
apache_beam/io/gcp/big_query_query_to_table_it_test.py: 4 warnings
apache_beam/io/gcp/bigquery_io_read_it_test.py: 2 warnings
apache_beam/io/gcp/bigquery_json_it_test.py: 3 warnings
apache_beam/io/gcp/bigquery_read_it_test.py: 7 warnings
  <https://ci-beam.apache.org/job/beam_PostCommit_Python39/ws/src/sdks/python/apache_beam/io/gcp/bigquery.py>:2666: BeamDeprecationWarning: options is deprecated since First stable release. References to <pipeline>.options will not be supported
    job_name = pcoll.pipeline.options.view_as(GoogleCloudOptions).job_name

apache_beam/dataframe/io_it_test.py: 3 warnings
apache_beam/examples/cookbook/bigquery_tornadoes_it_test.py: 1 warning
apache_beam/examples/dataframe/flight_delays_it_test.py: 1 warning
apache_beam/io/gcp/big_query_query_to_table_it_test.py: 4 warnings
apache_beam/io/gcp/bigquery_io_read_it_test.py: 2 warnings
apache_beam/io/gcp/bigquery_json_it_test.py: 3 warnings
apache_beam/io/gcp/bigquery_read_it_test.py: 7 warnings
  <https://ci-beam.apache.org/job/beam_PostCommit_Python39/ws/src/sdks/python/apache_beam/io/gcp/bigquery.py>:2690: BeamDeprecationWarning: options is deprecated since First stable release. References to <pipeline>.options will not be supported
    pipeline_options=pcoll.pipeline.options,

apache_beam/examples/cookbook/bigquery_tornadoes_it_test.py: 1 warning
apache_beam/io/gcp/big_query_query_to_table_it_test.py: 4 warnings
apache_beam/io/gcp/bigquery_write_it_test.py: 4 warnings
apache_beam/io/gcp/bigquery_test.py: 2 warnings
  <https://ci-beam.apache.org/job/beam_PostCommit_Python39/ws/src/sdks/python/apache_beam/io/gcp/bigquery.py>:2024: BeamDeprecationWarning: options is deprecated since First stable release. References to <pipeline>.options will not be supported
    self.table_reference.projectId = pcoll.pipeline.options.view_as(

apache_beam/examples/cookbook/bigquery_tornadoes_it_test.py: 1 warning
apache_beam/examples/complete/game/hourly_team_score_it_test.py: 1 warning
apache_beam/examples/complete/game/game_stats_it_test.py: 2 warnings
apache_beam/io/gcp/big_query_query_to_table_it_test.py: 4 warnings
apache_beam/io/gcp/bigquery_file_loads_test.py: 3 warnings
apache_beam/examples/complete/game/leader_board_it_test.py: 2 warnings
apache_beam/io/gcp/bigquery_json_it_test.py: 2 warnings
apache_beam/io/gcp/bigquery_test.py: 6 warnings
apache_beam/io/gcp/bigquery_write_it_test.py: 4 warnings
  <https://ci-beam.apache.org/job/beam_PostCommit_Python39/ws/src/sdks/python/apache_beam/io/gcp/bigquery.py>:2028: BeamDeprecationWarning: options is deprecated since First stable release. References to <pipeline>.options will not be supported
    is_streaming_pipeline = p.options.view_as(StandardOptions).streaming

apache_beam/examples/cookbook/bigquery_tornadoes_it_test.py: 1 warning
apache_beam/examples/complete/game/hourly_team_score_it_test.py: 1 warning
apache_beam/examples/complete/game/game_stats_it_test.py: 2 warnings
apache_beam/io/gcp/big_query_query_to_table_it_test.py: 4 warnings
apache_beam/io/gcp/bigquery_file_loads_test.py: 3 warnings
apache_beam/examples/complete/game/leader_board_it_test.py: 2 warnings
apache_beam/io/gcp/bigquery_json_it_test.py: 2 warnings
apache_beam/io/gcp/bigquery_test.py: 6 warnings
apache_beam/io/gcp/bigquery_write_it_test.py: 4 warnings
  <https://ci-beam.apache.org/job/beam_PostCommit_Python39/ws/src/sdks/python/apache_beam/io/gcp/bigquery.py>:2034: BeamDeprecationWarning: options is deprecated since First stable release. References to <pipeline>.options will not be supported
    experiments = p.options.view_as(DebugOptions).experiments or []

apache_beam/examples/cookbook/bigquery_tornadoes_it_test.py: 1 warning
apache_beam/io/gcp/big_query_query_to_table_it_test.py: 4 warnings
apache_beam/io/gcp/bigquery_file_loads_test.py: 3 warnings
apache_beam/io/gcp/bigquery_write_it_test.py: 3 warnings
apache_beam/io/gcp/bigquery_test.py: 3 warnings
  <https://ci-beam.apache.org/job/beam_PostCommit_Python39/ws/src/sdks/python/apache_beam/io/gcp/bigquery_file_loads.py>:1169: BeamDeprecationWarning: options is deprecated since First stable release. References to <pipeline>.options will not be supported
    self.project = self.project or p.options.view_as(GoogleCloudOptions).project

apache_beam/examples/cookbook/bigquery_tornadoes_it_test.py: 1 warning
apache_beam/examples/complete/game/hourly_team_score_it_test.py: 1 warning
apache_beam/io/gcp/big_query_query_to_table_it_test.py: 4 warnings
apache_beam/io/gcp/bigquery_file_loads_test.py: 3 warnings
apache_beam/io/gcp/bigquery_write_it_test.py: 3 warnings
apache_beam/io/gcp/bigquery_test.py: 3 warnings
  <https://ci-beam.apache.org/job/beam_PostCommit_Python39/ws/src/sdks/python/apache_beam/io/gcp/bigquery_file_loads.py>:1176: BeamDeprecationWarning: options is deprecated since First stable release. References to <pipeline>.options will not be supported
    temp_location = p.options.view_as(GoogleCloudOptions).temp_location

apache_beam/examples/cookbook/bigquery_tornadoes_it_test.py: 1 warning
apache_beam/examples/complete/game/hourly_team_score_it_test.py: 1 warning
apache_beam/io/gcp/big_query_query_to_table_it_test.py: 4 warnings
apache_beam/io/gcp/bigquery_file_loads_test.py: 3 warnings
apache_beam/io/gcp/bigquery_write_it_test.py: 3 warnings
apache_beam/io/gcp/bigquery_test.py: 3 warnings
  <https://ci-beam.apache.org/job/beam_PostCommit_Python39/ws/src/sdks/python/apache_beam/io/gcp/bigquery_file_loads.py>:1178: BeamDeprecationWarning: options is deprecated since First stable release. References to <pipeline>.options will not be supported
    p.options.view_as(GoogleCloudOptions).job_name or 'AUTOMATIC_JOB_NAME')

apache_beam/examples/cookbook/bigquery_tornadoes_it_test.py::BigqueryTornadoesIT::test_bigquery_tornadoes_it
  <https://ci-beam.apache.org/job/beam_PostCommit_Python39/ws/src/sdks/python/apache_beam/io/gcp/tests/utils.py>:100: PendingDeprecationWarning: Client.dataset is deprecated and will be removed in a future version. Use a string like 'my_project.my_dataset' or a cloud.google.bigquery.DatasetReference object, instead.
    table_ref = client.dataset(dataset_id).table(table_id)

apache_beam/dataframe/io_it_test.py: 2 warnings
apache_beam/io/gcp/bigquery_json_it_test.py: 1 warning
apache_beam/io/gcp/bigquery_read_it_test.py: 9 warnings
  <https://ci-beam.apache.org/job/beam_PostCommit_Python39/ws/src/sdks/python/apache_beam/io/gcp/bigquery.py>:2708: BeamDeprecationWarning: options is deprecated since First stable release. References to <pipeline>.options will not be supported
    project_id = pcoll.pipeline.options.view_as(GoogleCloudOptions).project

apache_beam/dataframe/io_it_test.py: 2 warnings
apache_beam/io/gcp/bigquery_json_it_test.py: 1 warning
apache_beam/io/gcp/bigquery_read_it_test.py: 9 warnings
  <https://ci-beam.apache.org/job/beam_PostCommit_Python39/ws/src/sdks/python/apache_beam/io/gcp/bigquery.py>:2729: BeamDeprecationWarning: options is deprecated since First stable release. References to <pipeline>.options will not be supported
    pipeline_options=pcoll.pipeline.options,

apache_beam/examples/complete/game/hourly_team_score_it_test.py::HourlyTeamScoreIT::test_hourly_team_score_it
apache_beam/examples/complete/game/game_stats_it_test.py::GameStatsIT::test_game_stats_it
apache_beam/examples/complete/game/leader_board_it_test.py::LeaderBoardIT::test_leader_board_it
apache_beam/io/gcp/bigquery_test.py::PubSubBigQueryIT::test_file_loads
apache_beam/io/gcp/bigquery_test.py::PubSubBigQueryIT::test_streaming_inserts
  <https://ci-beam.apache.org/job/beam_PostCommit_Python39/ws/src/sdks/python/apache_beam/io/gcp/tests/utils.py>:63: PendingDeprecationWarning: Client.dataset is deprecated and will be removed in a future version. Use a string like 'my_project.my_dataset' or a cloud.google.bigquery.DatasetReference object, instead.
    dataset_ref = client.dataset(unique_dataset_name, project=project)

apache_beam/examples/dataframe/flight_delays_it_test.py::FlightDelaysTest::test_flight_delays
  <https://ci-beam.apache.org/job/beam_PostCommit_Python39/ws/src/sdks/python/apache_beam/examples/dataframe/flight_delays.py>:47: FutureWarning: The default value of numeric_only in DataFrame.mean is deprecated. In a future version, it will default to False. In addition, specifying 'numeric_only=None' is deprecated. Select only valid columns or specify the value of numeric_only to silence this warning.
    return airline_df[at_top_airports].mean()

apache_beam/examples/dataframe/flight_delays_it_test.py::FlightDelaysTest::test_flight_delays
apache_beam/examples/dataframe/taxiride_it_test.py::TaxirideIT::test_aggregation
apache_beam/examples/dataframe/taxiride_it_test.py::TaxirideIT::test_enrich
  <https://ci-beam.apache.org/job/beam_PostCommit_Python39/ws/src/sdks/python/apache_beam/io/fileio.py>:593: BeamDeprecationWarning: options is deprecated since First stable release. References to <pipeline>.options will not be supported
    p.options.view_as(GoogleCloudOptions).temp_location or

apache_beam/io/gcp/bigquery_test.py::BigQueryStreamingInsertTransformIntegrationTests::test_multiple_destinations_transform
  <https://ci-beam.apache.org/job/beam_PostCommit_Python39/ws/src/sdks/python/apache_beam/io/gcp/bigquery_test.py>:1694: BeamDeprecationWarning: options is deprecated since First stable release. References to <pipeline>.options will not be supported
    streaming = self.test_pipeline.options.view_as(StandardOptions).streaming

apache_beam/io/gcp/bigquery_read_it_test.py::ReadTests::test_native_source
  <https://ci-beam.apache.org/job/beam_PostCommit_Python39/ws/src/sdks/python/apache_beam/io/gcp/bigquery_read_it_test.py>:170: BeamDeprecationWarning: BigQuerySource is deprecated since 2.25.0. Use ReadFromBigQuery instead.
    beam.io.BigQuerySource(query=self.query, use_standard_sql=True)))

apache_beam/io/gcp/bigquery_read_it_test.py::ReadNewTypesTests::test_native_source
  <https://ci-beam.apache.org/job/beam_PostCommit_Python39/ws/src/sdks/python/apache_beam/io/gcp/bigquery_read_it_test.py>:693: BeamDeprecationWarning: BigQuerySource is deprecated since 2.25.0. Use ReadFromBigQuery instead.
    beam.io.BigQuerySource(query=self.query, use_standard_sql=True)))

apache_beam/io/gcp/bigquery_read_it_test.py::ReadAllBQTests::test_read_queries
  <https://ci-beam.apache.org/job/beam_PostCommit_Python39/ws/src/sdks/python/apache_beam/io/gcp/bigquery.py>:2836: BeamDeprecationWarning: options is deprecated since First stable release. References to <pipeline>.options will not be supported
    job_name = pcoll.pipeline.options.view_as(GoogleCloudOptions).job_name

apache_beam/io/gcp/bigquery_read_it_test.py::ReadAllBQTests::test_read_queries
  <https://ci-beam.apache.org/job/beam_PostCommit_Python39/ws/src/sdks/python/apache_beam/io/gcp/bigquery.py>:2837: BeamDeprecationWarning: options is deprecated since First stable release. References to <pipeline>.options will not be supported
    project = pcoll.pipeline.options.view_as(GoogleCloudOptions).project

apache_beam/io/gcp/bigquery_read_it_test.py::ReadAllBQTests::test_read_queries
  <https://ci-beam.apache.org/job/beam_PostCommit_Python39/ws/src/sdks/python/apache_beam/io/gcp/bigquery.py>:2850: BeamDeprecationWarning: options is deprecated since First stable release. References to <pipeline>.options will not be supported
    options=pcoll.pipeline.options,

-- Docs: https://docs.pytest.org/en/stable/how-to/capture-warnings.html
- generated xml file: <https://ci-beam.apache.org/job/beam_PostCommit_Python39/ws/src/sdks/python/pytest_postCommitIT-df-py39.xml> -
========== 83 passed, 39 skipped, 592 warnings in 8853.70s (2:27:33) ===========

FAILURE: Build failed with an exception.

* Where:
Script '<https://ci-beam.apache.org/job/beam_PostCommit_Python39/ws/src/sdks/python/test-suites/direct/common.gradle'> line: 186

* What went wrong:
Execution failed for task ':sdks:python:test-suites:direct:py39:hdfsIntegrationTest'.
> Process 'command 'sh'' finished with non-zero exit value 1

* Try:
> Run with --stacktrace option to get the stack trace.
> Run with --info or --debug option to get more log output.

* Get more help at https://help.gradle.org

Deprecated Gradle features were used in this build, making it incompatible with Gradle 8.0.

You can use '--warning-mode all' to show the individual deprecation warnings and determine if they come from your own scripts or plugins.

See https://docs.gradle.org/7.5.1/userguide/command_line_interface.html#sec:command_line_warnings

Execution optimizations have been disabled for 1 invalid unit(s) of work during this build to ensure correctness.
Please consult deprecation warnings for more details.

BUILD FAILED in 2h 34m
213 actionable tasks: 148 executed, 59 from cache, 6 up-to-date

Publishing build scan...
https://ge.apache.org/s/lei6bftossxrw

Build step 'Invoke Gradle script' changed build result to FAILURE
Build step 'Invoke Gradle script' marked build as failure

---------------------------------------------------------------------
To unsubscribe, e-mail: builds-unsubscribe@beam.apache.org
For additional commands, e-mail: builds-help@beam.apache.org


Build failed in Jenkins: beam_PostCommit_Python39 #1927

Posted by Apache Jenkins Server <je...@builds.apache.org>.
See <https://ci-beam.apache.org/job/beam_PostCommit_Python39/1927/display/redirect>

Changes:


------------------------------------------
[...truncated 10.71 MB...]

INFO:root:severity: INFO
timestamp {
  seconds: 1686443383
  nanos: 519702434
}
message: "Done consuming work."
log_location: "/usr/local/lib/python3.9/site-packages/apache_beam/runners/worker/sdk_worker.py:285"
thread: "MainThread"

INFO:root:severity: INFO
timestamp {
  seconds: 1686443383
  nanos: 519819021
}
message: "Python sdk harness exiting."
log_location: "/usr/local/lib/python3.9/site-packages/apache_beam/runners/worker/sdk_worker_main.py:213"
thread: "MainThread"

INFO:apache_beam.runners.portability.local_job_service:Completed job in 34.00672769546509 seconds with state DONE.
INFO:root:Completed job in 34.00672769546509 seconds with state DONE.
INFO:apache_beam.runners.portability.portable_runner:Job state changed to DONE

> Task :sdks:python:test-suites:portable:py39:portableWordCountSparkRunnerBatch
INFO:apache_beam.runners.worker.worker_pool_main:Listening for workers at localhost:43887
INFO:apache_beam.runners.portability.fn_api_runner.translations:==================== <function pack_combiners at 0x7f548bc6b430> ====================
INFO:apache_beam.runners.portability.fn_api_runner.translations:==================== <function lift_combiners at 0x7f548bc6b4c0> ====================
INFO:apache_beam.runners.portability.fn_api_runner.translations:==================== <function sort_stages at 0x7f548bc6bc10> ====================
INFO:apache_beam.utils.subprocess_server:Starting service with ['java' '-jar' '<https://ci-beam.apache.org/job/beam_PostCommit_Python39/ws/src/runners/spark/3/job-server/build/libs/beam-runners-spark-3-job-server-2.49.0-SNAPSHOT.jar'> '--spark-master-url' 'local[4]' '--artifacts-dir' '/tmp/beam-tempnmrgipdd/artifacts_gf_jx3v' '--job-port' '34137' '--artifact-port' '0' '--expansion-port' '0']
WARNING:root:Waiting for grpc channel to be ready at localhost:34137.
INFO:apache_beam.utils.subprocess_server:23/06/11 00:30:01 WARN software.amazon.awssdk.regions.internal.util.EC2MetadataUtils: Unable to retrieve the requested metadata.
WARNING:root:Waiting for grpc channel to be ready at localhost:34137.
INFO:apache_beam.utils.subprocess_server:23/06/11 00:30:02 INFO org.apache.beam.runners.jobsubmission.JobServerDriver: ArtifactStagingService started on localhost:36215
INFO:apache_beam.utils.subprocess_server:23/06/11 00:30:03 INFO org.apache.beam.runners.jobsubmission.JobServerDriver: Java ExpansionService started on localhost:37235
INFO:apache_beam.utils.subprocess_server:23/06/11 00:30:03 INFO org.apache.beam.runners.jobsubmission.JobServerDriver: JobService started on localhost:34137
INFO:apache_beam.utils.subprocess_server:23/06/11 00:30:03 INFO org.apache.beam.runners.jobsubmission.JobServerDriver: Job server now running, terminate with Ctrl+C
WARNING:root:Waiting for grpc channel to be ready at localhost:34137.
WARNING:root:Waiting for grpc channel to be ready at localhost:34137.
INFO:apache_beam.utils.subprocess_server:23/06/11 00:30:06 INFO org.apache.beam.runners.fnexecution.artifact.ArtifactStagingService: Staging artifacts for job_7c49bf7b-8f32-4683-ab11-924d48f13a93.
INFO:apache_beam.utils.subprocess_server:23/06/11 00:30:06 INFO org.apache.beam.runners.fnexecution.artifact.ArtifactStagingService: Resolving artifacts for job_7c49bf7b-8f32-4683-ab11-924d48f13a93.ref_Environment_default_environment_1.
INFO:apache_beam.utils.subprocess_server:23/06/11 00:30:06 INFO org.apache.beam.runners.fnexecution.artifact.ArtifactStagingService: Getting 1 artifacts for job_7c49bf7b-8f32-4683-ab11-924d48f13a93.null.
INFO:apache_beam.utils.subprocess_server:23/06/11 00:30:06 INFO org.apache.beam.runners.fnexecution.artifact.ArtifactStagingService: Artifacts fully staged for job_7c49bf7b-8f32-4683-ab11-924d48f13a93.
INFO:apache_beam.utils.subprocess_server:23/06/11 00:30:07 INFO org.apache.beam.runners.spark.SparkJobInvoker: Invoking job BeamApp-jenkins-0611003007-48c44c75_5d48c45e-49d4-46f5-9c2b-01b714b8cd8e
INFO:apache_beam.utils.subprocess_server:23/06/11 00:30:07 INFO org.apache.beam.runners.jobsubmission.JobInvocation: Starting job invocation BeamApp-jenkins-0611003007-48c44c75_5d48c45e-49d4-46f5-9c2b-01b714b8cd8e
INFO:apache_beam.runners.portability.portable_runner:Environment "LOOPBACK" has started a component necessary for the execution. Be sure to run the pipeline using
  with Pipeline() as p:
    p.apply(..)
This ensures that the pipeline finishes before this program exits.
INFO:apache_beam.runners.portability.portable_runner:Job state changed to STOPPED
INFO:apache_beam.runners.portability.portable_runner:Job state changed to STARTING
INFO:apache_beam.runners.portability.portable_runner:Job state changed to RUNNING
INFO:apache_beam.utils.subprocess_server:23/06/11 00:30:08 INFO org.apache.beam.runners.spark.translation.SparkContextFactory: Creating a brand new Spark Context.
INFO:apache_beam.utils.subprocess_server:23/06/11 00:30:09 WARN org.apache.hadoop.util.NativeCodeLoader: Unable to load native-hadoop library for your platform... using builtin-java classes where applicable
INFO:apache_beam.utils.subprocess_server:23/06/11 00:30:11 INFO org.sparkproject.jetty.util.log: Logging initialized @14581ms to org.sparkproject.jetty.util.log.Slf4jLog
INFO:apache_beam.utils.subprocess_server:23/06/11 00:30:11 INFO org.sparkproject.jetty.server.Server: jetty-9.4.40.v20210413; built: 2021-04-13T20:42:42.668Z; git: b881a572662e1943a14ae12e7e1207989f218b74; jvm 1.8.0_362-8u372-ga~us1-0ubuntu1~20.04-b09
INFO:apache_beam.utils.subprocess_server:23/06/11 00:30:11 INFO org.sparkproject.jetty.server.Server: Started @14853ms
INFO:apache_beam.utils.subprocess_server:23/06/11 00:30:12 INFO org.sparkproject.jetty.server.AbstractConnector: Started ServerConnector@e1ebb64{HTTP/1.1, (http/1.1)}{127.0.0.1:4040}
INFO:apache_beam.utils.subprocess_server:23/06/11 00:30:12 INFO org.sparkproject.jetty.server.handler.ContextHandler: Started o.s.j.s.ServletContextHandler@85165a6{/jobs,null,AVAILABLE,@Spark}
INFO:apache_beam.utils.subprocess_server:23/06/11 00:30:12 INFO org.sparkproject.jetty.server.handler.ContextHandler: Started o.s.j.s.ServletContextHandler@76c23d19{/jobs/json,null,AVAILABLE,@Spark}
INFO:apache_beam.utils.subprocess_server:23/06/11 00:30:12 INFO org.sparkproject.jetty.server.handler.ContextHandler: Started o.s.j.s.ServletContextHandler@32ec9948{/jobs/job,null,AVAILABLE,@Spark}
INFO:apache_beam.utils.subprocess_server:23/06/11 00:30:12 INFO org.sparkproject.jetty.server.handler.ContextHandler: Started o.s.j.s.ServletContextHandler@628452f5{/jobs/job/json,null,AVAILABLE,@Spark}
INFO:apache_beam.utils.subprocess_server:23/06/11 00:30:12 INFO org.sparkproject.jetty.server.handler.ContextHandler: Started o.s.j.s.ServletContextHandler@1f67b9a8{/stages,null,AVAILABLE,@Spark}
INFO:apache_beam.utils.subprocess_server:23/06/11 00:30:12 INFO org.sparkproject.jetty.server.handler.ContextHandler: Started o.s.j.s.ServletContextHandler@7d7fa0da{/stages/json,null,AVAILABLE,@Spark}
INFO:apache_beam.utils.subprocess_server:23/06/11 00:30:12 INFO org.sparkproject.jetty.server.handler.ContextHandler: Started o.s.j.s.ServletContextHandler@4e9b9d83{/stages/stage,null,AVAILABLE,@Spark}
INFO:apache_beam.utils.subprocess_server:23/06/11 00:30:12 INFO org.sparkproject.jetty.server.handler.ContextHandler: Started o.s.j.s.ServletContextHandler@71fc28ad{/stages/stage/json,null,AVAILABLE,@Spark}
INFO:apache_beam.utils.subprocess_server:23/06/11 00:30:12 INFO org.sparkproject.jetty.server.handler.ContextHandler: Started o.s.j.s.ServletContextHandler@399157c8{/stages/pool,null,AVAILABLE,@Spark}
INFO:apache_beam.utils.subprocess_server:23/06/11 00:30:12 INFO org.sparkproject.jetty.server.handler.ContextHandler: Started o.s.j.s.ServletContextHandler@4ba02cb{/stages/pool/json,null,AVAILABLE,@Spark}
INFO:apache_beam.utils.subprocess_server:23/06/11 00:30:12 INFO org.sparkproject.jetty.server.handler.ContextHandler: Started o.s.j.s.ServletContextHandler@881e43{/storage,null,AVAILABLE,@Spark}
INFO:apache_beam.utils.subprocess_server:23/06/11 00:30:12 INFO org.sparkproject.jetty.server.handler.ContextHandler: Started o.s.j.s.ServletContextHandler@5fa5fe45{/storage/json,null,AVAILABLE,@Spark}
INFO:apache_beam.utils.subprocess_server:23/06/11 00:30:12 INFO org.sparkproject.jetty.server.handler.ContextHandler: Started o.s.j.s.ServletContextHandler@d1ed36e{/storage/rdd,null,AVAILABLE,@Spark}
INFO:apache_beam.utils.subprocess_server:23/06/11 00:30:12 INFO org.sparkproject.jetty.server.handler.ContextHandler: Started o.s.j.s.ServletContextHandler@1e4a2fdd{/storage/rdd/json,null,AVAILABLE,@Spark}
INFO:apache_beam.utils.subprocess_server:23/06/11 00:30:12 INFO org.sparkproject.jetty.server.handler.ContextHandler: Started o.s.j.s.ServletContextHandler@dcc4a5e{/environment,null,AVAILABLE,@Spark}
INFO:apache_beam.utils.subprocess_server:23/06/11 00:30:12 INFO org.sparkproject.jetty.server.handler.ContextHandler: Started o.s.j.s.ServletContextHandler@4145f382{/environment/json,null,AVAILABLE,@Spark}
INFO:apache_beam.utils.subprocess_server:23/06/11 00:30:12 INFO org.sparkproject.jetty.server.handler.ContextHandler: Started o.s.j.s.ServletContextHandler@4bf1a151{/executors,null,AVAILABLE,@Spark}
INFO:apache_beam.utils.subprocess_server:23/06/11 00:30:12 INFO org.sparkproject.jetty.server.handler.ContextHandler: Started o.s.j.s.ServletContextHandler@5b8c494f{/executors/json,null,AVAILABLE,@Spark}
INFO:apache_beam.utils.subprocess_server:23/06/11 00:30:12 INFO org.sparkproject.jetty.server.handler.ContextHandler: Started o.s.j.s.ServletContextHandler@3d98bfae{/executors/threadDump,null,AVAILABLE,@Spark}
INFO:apache_beam.utils.subprocess_server:23/06/11 00:30:12 INFO org.sparkproject.jetty.server.handler.ContextHandler: Started o.s.j.s.ServletContextHandler@6a1effab{/executors/threadDump/json,null,AVAILABLE,@Spark}
INFO:apache_beam.utils.subprocess_server:23/06/11 00:30:12 INFO org.sparkproject.jetty.server.handler.ContextHandler: Started o.s.j.s.ServletContextHandler@42e39d86{/static,null,AVAILABLE,@Spark}
INFO:apache_beam.utils.subprocess_server:23/06/11 00:30:12 INFO org.sparkproject.jetty.server.handler.ContextHandler: Started o.s.j.s.ServletContextHandler@4f47ce3d{/,null,AVAILABLE,@Spark}
INFO:apache_beam.utils.subprocess_server:23/06/11 00:30:12 INFO org.sparkproject.jetty.server.handler.ContextHandler: Started o.s.j.s.ServletContextHandler@443f7faf{/api,null,AVAILABLE,@Spark}
INFO:apache_beam.utils.subprocess_server:23/06/11 00:30:12 INFO org.sparkproject.jetty.server.handler.ContextHandler: Started o.s.j.s.ServletContextHandler@7c21475c{/jobs/job/kill,null,AVAILABLE,@Spark}
INFO:apache_beam.utils.subprocess_server:23/06/11 00:30:12 INFO org.sparkproject.jetty.server.handler.ContextHandler: Started o.s.j.s.ServletContextHandler@dfc053d{/stages/stage/kill,null,AVAILABLE,@Spark}
INFO:apache_beam.utils.subprocess_server:23/06/11 00:30:12 INFO org.sparkproject.jetty.server.handler.ContextHandler: Started o.s.j.s.ServletContextHandler@7486d92a{/metrics/json,null,AVAILABLE,@Spark}
INFO:apache_beam.utils.subprocess_server:23/06/11 00:30:12 INFO org.apache.beam.runners.spark.metrics.MetricsAccumulator: Instantiated metrics accumulator: MetricQueryResults()
INFO:apache_beam.utils.subprocess_server:23/06/11 00:30:12 WARN software.amazon.awssdk.regions.internal.util.EC2MetadataUtils: Unable to retrieve the requested metadata.
INFO:apache_beam.utils.subprocess_server:23/06/11 00:30:12 INFO org.apache.beam.runners.spark.SparkPipelineRunner: Running job BeamApp-jenkins-0611003007-48c44c75_5d48c45e-49d4-46f5-9c2b-01b714b8cd8e on Spark master local[4]
INFO:apache_beam.utils.subprocess_server:23/06/11 00:30:14 WARN software.amazon.awssdk.regions.internal.util.EC2MetadataUtils: Unable to retrieve the requested metadata.
INFO:apache_beam.utils.subprocess_server:23/06/11 00:30:14 WARN software.amazon.awssdk.regions.internal.util.EC2MetadataUtils: Unable to retrieve the requested metadata.
INFO:apache_beam.utils.subprocess_server:23/06/11 00:30:14 WARN software.amazon.awssdk.regions.internal.util.EC2MetadataUtils: Unable to retrieve the requested metadata.
INFO:apache_beam.utils.subprocess_server:23/06/11 00:30:14 WARN software.amazon.awssdk.regions.internal.util.EC2MetadataUtils: Unable to retrieve the requested metadata.
INFO:apache_beam.runners.worker.statecache:Creating state cache with size 0
INFO:apache_beam.runners.worker.sdk_worker:Creating insecure control channel for localhost:45115.
INFO:apache_beam.runners.worker.sdk_worker:Control channel established.
INFO:apache_beam.runners.worker.sdk_worker:Initializing SDKHarness with unbounded number of workers.
INFO:apache_beam.utils.subprocess_server:23/06/11 00:30:14 INFO org.apache.beam.runners.fnexecution.control.FnApiControlClientPoolService: Beam Fn Control client connected with id 1-1
INFO:apache_beam.utils.subprocess_server:23/06/11 00:30:14 INFO org.apache.beam.runners.fnexecution.control.FnApiControlClientPoolService: getProcessBundleDescriptor request with id 1-2
INFO:apache_beam.runners.worker.sdk_worker:Creating insecure state channel for localhost:41639.
INFO:apache_beam.runners.worker.sdk_worker:State channel established.
INFO:apache_beam.runners.worker.data_plane:Creating client data channel for localhost:35099
INFO:apache_beam.utils.subprocess_server:23/06/11 00:30:14 INFO org.apache.beam.runners.fnexecution.data.GrpcDataService: Beam Fn Data client connected.
INFO:apache_beam.utils.subprocess_server:23/06/11 00:30:14 INFO org.apache.beam.runners.fnexecution.control.FnApiControlClientPoolService: getProcessBundleDescriptor request with id 1-3
INFO:apache_beam.utils.subprocess_server:23/06/11 00:30:15 WARN software.amazon.awssdk.regions.internal.util.EC2MetadataUtils: Unable to retrieve the requested metadata.
INFO:apache_beam.utils.subprocess_server:23/06/11 00:30:15 WARN software.amazon.awssdk.regions.internal.util.EC2MetadataUtils: Unable to retrieve the requested metadata.
INFO:apache_beam.utils.subprocess_server:23/06/11 00:30:15 WARN software.amazon.awssdk.regions.internal.util.EC2MetadataUtils: Unable to retrieve the requested metadata.
INFO:apache_beam.utils.subprocess_server:23/06/11 00:30:15 WARN software.amazon.awssdk.regions.internal.util.EC2MetadataUtils: Unable to retrieve the requested metadata.
INFO:apache_beam.utils.subprocess_server:23/06/11 00:30:15 INFO org.apache.beam.runners.fnexecution.control.FnApiControlClientPoolService: getProcessBundleDescriptor request with id 1-4
INFO:apache_beam.utils.subprocess_server:23/06/11 00:30:15 INFO org.apache.beam.runners.fnexecution.control.FnApiControlClientPoolService: getProcessBundleDescriptor request with id 1-5
INFO:apache_beam.utils.subprocess_server:23/06/11 00:30:15 WARN software.amazon.awssdk.regions.internal.util.EC2MetadataUtils: Unable to retrieve the requested metadata.
INFO:apache_beam.utils.subprocess_server:23/06/11 00:30:15 WARN software.amazon.awssdk.regions.internal.util.EC2MetadataUtils: Unable to retrieve the requested metadata.
INFO:apache_beam.utils.subprocess_server:23/06/11 00:30:15 WARN software.amazon.awssdk.regions.internal.util.EC2MetadataUtils: Unable to retrieve the requested metadata.
INFO:apache_beam.utils.subprocess_server:23/06/11 00:30:15 WARN software.amazon.awssdk.regions.internal.util.EC2MetadataUtils: Unable to retrieve the requested metadata.
INFO:apache_beam.utils.subprocess_server:23/06/11 00:30:15 INFO org.apache.beam.runners.fnexecution.control.FnApiControlClientPoolService: getProcessBundleDescriptor request with id 1-6
INFO:apache_beam.utils.subprocess_server:23/06/11 00:30:15 INFO org.apache.beam.runners.fnexecution.control.FnApiControlClientPoolService: getProcessBundleDescriptor request with id 1-8
INFO:apache_beam.utils.subprocess_server:23/06/11 00:30:15 INFO org.apache.beam.runners.fnexecution.control.FnApiControlClientPoolService: getProcessBundleDescriptor request with id 1-7
INFO:apache_beam.utils.subprocess_server:23/06/11 00:30:15 INFO org.apache.beam.runners.fnexecution.control.FnApiControlClientPoolService: getProcessBundleDescriptor request with id 1-9
INFO:apache_beam.utils.subprocess_server:23/06/11 00:30:15 INFO org.apache.beam.runners.fnexecution.control.FnApiControlClientPoolService: getProcessBundleDescriptor request with id 1-10
INFO:apache_beam.utils.subprocess_server:23/06/11 00:30:15 INFO org.apache.beam.runners.fnexecution.control.FnApiControlClientPoolService: getProcessBundleDescriptor request with id 1-11
INFO:apache_beam.utils.subprocess_server:23/06/11 00:30:15 INFO org.apache.beam.runners.fnexecution.control.FnApiControlClientPoolService: getProcessBundleDescriptor request with id 1-13
INFO:apache_beam.utils.subprocess_server:23/06/11 00:30:15 INFO org.apache.beam.runners.fnexecution.control.FnApiControlClientPoolService: getProcessBundleDescriptor request with id 1-12
INFO:apache_beam.utils.subprocess_server:23/06/11 00:30:15 WARN software.amazon.awssdk.regions.internal.util.EC2MetadataUtils: Unable to retrieve the requested metadata.
INFO:apache_beam.utils.subprocess_server:23/06/11 00:30:15 WARN software.amazon.awssdk.regions.internal.util.EC2MetadataUtils: Unable to retrieve the requested metadata.
INFO:apache_beam.utils.subprocess_server:23/06/11 00:30:15 WARN software.amazon.awssdk.regions.internal.util.EC2MetadataUtils: Unable to retrieve the requested metadata.
INFO:apache_beam.utils.subprocess_server:23/06/11 00:30:15 WARN software.amazon.awssdk.regions.internal.util.EC2MetadataUtils: Unable to retrieve the requested metadata.
INFO:apache_beam.utils.subprocess_server:23/06/11 00:30:15 INFO org.apache.beam.runners.fnexecution.control.FnApiControlClientPoolService: getProcessBundleDescriptor request with id 1-14
INFO:apache_beam.utils.subprocess_server:23/06/11 00:30:15 WARN software.amazon.awssdk.regions.internal.util.EC2MetadataUtils: Unable to retrieve the requested metadata.
INFO:apache_beam.utils.subprocess_server:23/06/11 00:30:15 WARN software.amazon.awssdk.regions.internal.util.EC2MetadataUtils: Unable to retrieve the requested metadata.
INFO:apache_beam.utils.subprocess_server:23/06/11 00:30:15 WARN software.amazon.awssdk.regions.internal.util.EC2MetadataUtils: Unable to retrieve the requested metadata.
INFO:apache_beam.utils.subprocess_server:23/06/11 00:30:15 WARN software.amazon.awssdk.regions.internal.util.EC2MetadataUtils: Unable to retrieve the requested metadata.
INFO:apache_beam.utils.subprocess_server:23/06/11 00:30:15 INFO org.apache.beam.runners.fnexecution.control.FnApiControlClientPoolService: getProcessBundleDescriptor request with id 1-15
INFO:apache_beam.utils.subprocess_server:23/06/11 00:30:15 INFO org.apache.beam.runners.spark.SparkPipelineRunner: Job BeamApp-jenkins-0611003007-48c44c75_5d48c45e-49d4-46f5-9c2b-01b714b8cd8e: Pipeline translated successfully. Computing outputs
INFO:apache_beam.utils.subprocess_server:23/06/11 00:30:15 WARN software.amazon.awssdk.regions.internal.util.EC2MetadataUtils: Unable to retrieve the requested metadata.
INFO:apache_beam.utils.subprocess_server:23/06/11 00:30:15 WARN software.amazon.awssdk.regions.internal.util.EC2MetadataUtils: Unable to retrieve the requested metadata.
INFO:apache_beam.utils.subprocess_server:23/06/11 00:30:15 WARN software.amazon.awssdk.regions.internal.util.EC2MetadataUtils: Unable to retrieve the requested metadata.
INFO:apache_beam.utils.subprocess_server:23/06/11 00:30:15 WARN software.amazon.awssdk.regions.internal.util.EC2MetadataUtils: Unable to retrieve the requested metadata.
INFO:apache_beam.utils.subprocess_server:23/06/11 00:30:16 INFO org.apache.beam.runners.fnexecution.control.FnApiControlClientPoolService: getProcessBundleDescriptor request with id 1-16
INFO:apache_beam.io.filebasedsink:Starting finalize_write threads with num_shards: 4 (skipped: 0), batches: 4, num_threads: 4
INFO:apache_beam.io.filebasedsink:Renamed 4 shards in 0.01 seconds.
INFO:apache_beam.utils.subprocess_server:23/06/11 00:30:16 INFO org.apache.beam.runners.spark.SparkPipelineRunner: Job BeamApp-jenkins-0611003007-48c44c75_5d48c45e-49d4-46f5-9c2b-01b714b8cd8e finished.
INFO:apache_beam.utils.subprocess_server:23/06/11 00:30:16 INFO org.sparkproject.jetty.server.AbstractConnector: Stopped Spark@e1ebb64{HTTP/1.1, (http/1.1)}{127.0.0.1:4040}
INFO:apache_beam.runners.portability.portable_runner:Job state changed to DONE
Exception in thread run_worker_1-1:
Traceback (most recent call last):
  File "/usr/lib/python3.9/threading.py", line 973, in _bootstrap_inner
    self.run()
Exception in thread read_state:
Traceback (most recent call last):
  File "/usr/lib/python3.9/threading.py", line 910, in run
  File "/usr/lib/python3.9/threading.py", line 973, in _bootstrap_inner
    self.run()
    self._target(*self._args, **self._kwargs)
  File "/usr/lib/python3.9/threading.py", line 910, in run
  File "<https://ci-beam.apache.org/job/beam_PostCommit_Python39/ws/src/sdks/python/apache_beam/runners/worker/sdk_worker.py",> line 262, in run
    self._target(*self._args, **self._kwargs)
ERROR:apache_beam.runners.worker.data_plane:Failed to read inputs in the data plane.
Traceback (most recent call last):
  File "<https://ci-beam.apache.org/job/beam_PostCommit_Python39/ws/src/sdks/python/apache_beam/runners/worker/data_plane.py",> line 652, in _read_inputs
    for elements in elements_iterator:
  File "<https://ci-beam.apache.org/job/beam_PostCommit_Python39/ws/src/build/gradleenv/2022703443/lib/python3.9/site-packages/grpc/_channel.py",> line 475, in __next__
    return self._next()
  File "<https://ci-beam.apache.org/job/beam_PostCommit_Python39/ws/src/build/gradleenv/2022703443/lib/python3.9/site-packages/grpc/_channel.py",> line 881, in _next
    raise self
grpc._channel._MultiThreadedRendezvous: <_MultiThreadedRendezvous of RPC that terminated with:
	status = StatusCode.UNAVAILABLE
	details = "Socket closed"
	debug_error_string = "UNKNOWN:Error received from peer ipv6:%5B::1%5D:35099 {created_time:"2023-06-11T00:30:16.718447085+00:00", grpc_status:14, grpc_message:"Socket closed"}"
>
  File "<https://ci-beam.apache.org/job/beam_PostCommit_Python39/ws/src/sdks/python/apache_beam/runners/worker/sdk_worker.py",> line 1039, in pull_responses
    for work_request in self._control_stub.Control(get_responses()):
  File "<https://ci-beam.apache.org/job/beam_PostCommit_Python39/ws/src/build/gradleenv/2022703443/lib/python3.9/site-packages/grpc/_channel.py",> line 475, in __next__
    for response in responses:
  File "<https://ci-beam.apache.org/job/beam_PostCommit_Python39/ws/src/build/gradleenv/2022703443/lib/python3.9/site-packages/grpc/_channel.py",> line 475, in __next__
Exception in thread read_grpc_client_inputs:
    return self._next()
Traceback (most recent call last):
  File "<https://ci-beam.apache.org/job/beam_PostCommit_Python39/ws/src/build/gradleenv/2022703443/lib/python3.9/site-packages/grpc/_channel.py",> line 881, in _next
    return self._next()
  File "/usr/lib/python3.9/threading.py", line 973, in _bootstrap_inner
  File "<https://ci-beam.apache.org/job/beam_PostCommit_Python39/ws/src/build/gradleenv/2022703443/lib/python3.9/site-packages/grpc/_channel.py",> line 881, in _next
    raise self
grpc._channel._MultiThreadedRendezvous: <_MultiThreadedRendezvous of RPC that terminated with:
	status = StatusCode.UNAVAILABLE
	details = "Socket closed"
	debug_error_string = "UNKNOWN:Error received from peer ipv6:%5B::1%5D:45115 {created_time:"2023-06-11T00:30:16.718463552+00:00", grpc_status:14, grpc_message:"Socket closed"}"
>
    self.run()
    raise self
  File "/usr/lib/python3.9/threading.py", line 910, in run
grpc._channel._MultiThreadedRendezvous: <_MultiThreadedRendezvous of RPC that terminated with:
	status = StatusCode.UNAVAILABLE
	details = "Socket closed"
	debug_error_string = "UNKNOWN:Error received from peer ipv6:%5B::1%5D:41639 {created_time:"2023-06-11T00:30:16.71846351+00:00", grpc_status:14, grpc_message:"Socket closed"}"
>
    self._target(*self._args, **self._kwargs)
  File "<https://ci-beam.apache.org/job/beam_PostCommit_Python39/ws/src/sdks/python/apache_beam/runners/worker/data_plane.py",> line 669, in <lambda>
    target=lambda: self._read_inputs(elements_iterator),
  File "<https://ci-beam.apache.org/job/beam_PostCommit_Python39/ws/src/sdks/python/apache_beam/runners/worker/data_plane.py",> line 652, in _read_inputs
    for elements in elements_iterator:
  File "<https://ci-beam.apache.org/job/beam_PostCommit_Python39/ws/src/build/gradleenv/2022703443/lib/python3.9/site-packages/grpc/_channel.py",> line 475, in __next__
    return self._next()
  File "<https://ci-beam.apache.org/job/beam_PostCommit_Python39/ws/src/build/gradleenv/2022703443/lib/python3.9/site-packages/grpc/_channel.py",> line 881, in _next
    raise self
grpc._channel._MultiThreadedRendezvous: <_MultiThreadedRendezvous of RPC that terminated with:
	status = StatusCode.UNAVAILABLE
	details = "Socket closed"
	debug_error_string = "UNKNOWN:Error received from peer ipv6:%5B::1%5D:35099 {created_time:"2023-06-11T00:30:16.718447085+00:00", grpc_status:14, grpc_message:"Socket closed"}"
>

> Task :sdks:python:test-suites:portable:py39:postCommitPy39

> Task :sdks:python:test-suites:dataflow:py39:postCommitIT
warning: sdist: standard file not found: should have one of README, README.rst, README.txt, README.md

warning: check: missing required meta-data: url

warning: check: missing meta-data: either (author and author_email) or (maintainer and maintainer_email) should be supplied


FAILURE: Build failed with an exception.

* Where:
Script '<https://ci-beam.apache.org/job/beam_PostCommit_Python39/ws/src/sdks/python/test-suites/direct/common.gradle'> line: 186

* What went wrong:
Execution failed for task ':sdks:python:test-suites:direct:py39:hdfsIntegrationTest'.
> Process 'command 'sh'' finished with non-zero exit value 1

* Try:
> Run with --stacktrace option to get the stack trace.
> Run with --info or --debug option to get more log output.

* Get more help at https://help.gradle.org

Deprecated Gradle features were used in this build, making it incompatible with Gradle 8.0.

You can use '--warning-mode all' to show the individual deprecation warnings and determine if they come from your own scripts or plugins.

See https://docs.gradle.org/7.5.1/userguide/command_line_interface.html#sec:command_line_warnings

Execution optimizations have been disabled for 1 invalid unit(s) of work during this build to ensure correctness.
Please consult deprecation warnings for more details.

BUILD FAILED in 2h 29m 21s
213 actionable tasks: 148 executed, 59 from cache, 6 up-to-date

Publishing build scan...
https://ge.apache.org/s/jnk4s6bq3bmhq

Build step 'Invoke Gradle script' changed build result to FAILURE
Build step 'Invoke Gradle script' marked build as failure

---------------------------------------------------------------------
To unsubscribe, e-mail: builds-unsubscribe@beam.apache.org
For additional commands, e-mail: builds-help@beam.apache.org


Build failed in Jenkins: beam_PostCommit_Python39 #1926

Posted by Apache Jenkins Server <je...@builds.apache.org>.
See <https://ci-beam.apache.org/job/beam_PostCommit_Python39/1926/display/redirect>

Changes:


------------------------------------------
[...truncated 11.26 MB...]
../../build/gradleenv/-1734967050/lib/python3.9/site-packages/pkg_resources/__init__.py:2870
../../build/gradleenv/-1734967050/lib/python3.9/site-packages/pkg_resources/__init__.py:2870
../../build/gradleenv/-1734967050/lib/python3.9/site-packages/pkg_resources/__init__.py:2870
../../build/gradleenv/-1734967050/lib/python3.9/site-packages/pkg_resources/__init__.py:2870
../../build/gradleenv/-1734967050/lib/python3.9/site-packages/pkg_resources/__init__.py:2870
  <https://ci-beam.apache.org/job/beam_PostCommit_Python39/ws/src/build/gradleenv/-1734967050/lib/python3.9/site-packages/pkg_resources/__init__.py>:2870: DeprecationWarning: Deprecated call to `pkg_resources.declare_namespace('google.logging')`.
  Implementing implicit namespace packages (as specified in PEP 420) is preferred to `pkg_resources.declare_namespace`. See https://setuptools.pypa.io/en/latest/references/keywords.html#keyword-namespace-packages
    declare_namespace(pkg)

../../build/gradleenv/-1734967050/lib/python3.9/site-packages/pkg_resources/__init__.py:2870
../../build/gradleenv/-1734967050/lib/python3.9/site-packages/pkg_resources/__init__.py:2870
../../build/gradleenv/-1734967050/lib/python3.9/site-packages/pkg_resources/__init__.py:2870
../../build/gradleenv/-1734967050/lib/python3.9/site-packages/pkg_resources/__init__.py:2870
../../build/gradleenv/-1734967050/lib/python3.9/site-packages/pkg_resources/__init__.py:2870
../../build/gradleenv/-1734967050/lib/python3.9/site-packages/pkg_resources/__init__.py:2870
../../build/gradleenv/-1734967050/lib/python3.9/site-packages/pkg_resources/__init__.py:2870
../../build/gradleenv/-1734967050/lib/python3.9/site-packages/pkg_resources/__init__.py:2870
../../build/gradleenv/-1734967050/lib/python3.9/site-packages/pkg_resources/__init__.py:2870
  <https://ci-beam.apache.org/job/beam_PostCommit_Python39/ws/src/build/gradleenv/-1734967050/lib/python3.9/site-packages/pkg_resources/__init__.py>:2870: DeprecationWarning: Deprecated call to `pkg_resources.declare_namespace('google.iam')`.
  Implementing implicit namespace packages (as specified in PEP 420) is preferred to `pkg_resources.declare_namespace`. See https://setuptools.pypa.io/en/latest/references/keywords.html#keyword-namespace-packages
    declare_namespace(pkg)

../../build/gradleenv/-1734967050/lib/python3.9/site-packages/google/rpc/__init__.py:20
../../build/gradleenv/-1734967050/lib/python3.9/site-packages/google/rpc/__init__.py:20
../../build/gradleenv/-1734967050/lib/python3.9/site-packages/google/rpc/__init__.py:20
../../build/gradleenv/-1734967050/lib/python3.9/site-packages/google/rpc/__init__.py:20
../../build/gradleenv/-1734967050/lib/python3.9/site-packages/google/rpc/__init__.py:20
../../build/gradleenv/-1734967050/lib/python3.9/site-packages/google/rpc/__init__.py:20
../../build/gradleenv/-1734967050/lib/python3.9/site-packages/google/rpc/__init__.py:20
../../build/gradleenv/-1734967050/lib/python3.9/site-packages/google/rpc/__init__.py:20
../../build/gradleenv/-1734967050/lib/python3.9/site-packages/google/rpc/__init__.py:20
  <https://ci-beam.apache.org/job/beam_PostCommit_Python39/ws/src/build/gradleenv/-1734967050/lib/python3.9/site-packages/google/rpc/__init__.py>:20: DeprecationWarning: Deprecated call to `pkg_resources.declare_namespace('google.rpc')`.
  Implementing implicit namespace packages (as specified in PEP 420) is preferred to `pkg_resources.declare_namespace`. See https://setuptools.pypa.io/en/latest/references/keywords.html#keyword-namespace-packages
    pkg_resources.declare_namespace(__name__)

apache_beam/typehints/pandas_type_compatibility_test.py:67
apache_beam/typehints/pandas_type_compatibility_test.py:67
apache_beam/typehints/pandas_type_compatibility_test.py:67
apache_beam/typehints/pandas_type_compatibility_test.py:67
apache_beam/typehints/pandas_type_compatibility_test.py:67
apache_beam/typehints/pandas_type_compatibility_test.py:67
apache_beam/typehints/pandas_type_compatibility_test.py:67
apache_beam/typehints/pandas_type_compatibility_test.py:67
  <https://ci-beam.apache.org/job/beam_PostCommit_Python39/ws/src/sdks/python/apache_beam/typehints/pandas_type_compatibility_test.py>:67: FutureWarning: pandas.Int64Index is deprecated and will be removed from pandas in a future version. Use pandas.Index with the appropriate dtype instead.
    }).set_index(pd.Int64Index(range(123, 223), name='an_index')),

apache_beam/typehints/pandas_type_compatibility_test.py:90
apache_beam/typehints/pandas_type_compatibility_test.py:90
apache_beam/typehints/pandas_type_compatibility_test.py:90
apache_beam/typehints/pandas_type_compatibility_test.py:90
apache_beam/typehints/pandas_type_compatibility_test.py:90
apache_beam/typehints/pandas_type_compatibility_test.py:90
apache_beam/typehints/pandas_type_compatibility_test.py:90
apache_beam/typehints/pandas_type_compatibility_test.py:90
  <https://ci-beam.apache.org/job/beam_PostCommit_Python39/ws/src/sdks/python/apache_beam/typehints/pandas_type_compatibility_test.py>:90: FutureWarning: pandas.Int64Index is deprecated and will be removed from pandas in a future version. Use pandas.Index with the appropriate dtype instead.
    pd.Int64Index(range(123, 223), name='an_index'),

apache_beam/typehints/pandas_type_compatibility_test.py:91
apache_beam/typehints/pandas_type_compatibility_test.py:91
apache_beam/typehints/pandas_type_compatibility_test.py:91
apache_beam/typehints/pandas_type_compatibility_test.py:91
apache_beam/typehints/pandas_type_compatibility_test.py:91
apache_beam/typehints/pandas_type_compatibility_test.py:91
apache_beam/typehints/pandas_type_compatibility_test.py:91
apache_beam/typehints/pandas_type_compatibility_test.py:91
  <https://ci-beam.apache.org/job/beam_PostCommit_Python39/ws/src/sdks/python/apache_beam/typehints/pandas_type_compatibility_test.py>:91: FutureWarning: pandas.Int64Index is deprecated and will be removed from pandas in a future version. Use pandas.Index with the appropriate dtype instead.
    pd.Int64Index(range(475, 575), name='another_index'),

apache_beam/dataframe/io_it_test.py: 3 warnings
apache_beam/examples/cookbook/bigquery_tornadoes_it_test.py: 1 warning
apache_beam/examples/dataframe/flight_delays_it_test.py: 1 warning
apache_beam/io/gcp/big_query_query_to_table_it_test.py: 4 warnings
apache_beam/io/gcp/bigquery_read_it_test.py: 7 warnings
apache_beam/io/gcp/bigquery_io_read_it_test.py: 2 warnings
apache_beam/io/gcp/bigquery_json_it_test.py: 3 warnings
  <https://ci-beam.apache.org/job/beam_PostCommit_Python39/ws/src/sdks/python/apache_beam/io/gcp/bigquery.py>:2664: BeamDeprecationWarning: options is deprecated since First stable release. References to <pipeline>.options will not be supported
    temp_location = pcoll.pipeline.options.view_as(

apache_beam/dataframe/io_it_test.py: 3 warnings
apache_beam/examples/cookbook/bigquery_tornadoes_it_test.py: 1 warning
apache_beam/examples/dataframe/flight_delays_it_test.py: 1 warning
apache_beam/io/gcp/big_query_query_to_table_it_test.py: 4 warnings
apache_beam/io/gcp/bigquery_read_it_test.py: 7 warnings
apache_beam/io/gcp/bigquery_io_read_it_test.py: 2 warnings
apache_beam/io/gcp/bigquery_json_it_test.py: 3 warnings
  <https://ci-beam.apache.org/job/beam_PostCommit_Python39/ws/src/sdks/python/apache_beam/io/gcp/bigquery.py>:2666: BeamDeprecationWarning: options is deprecated since First stable release. References to <pipeline>.options will not be supported
    job_name = pcoll.pipeline.options.view_as(GoogleCloudOptions).job_name

apache_beam/dataframe/io_it_test.py: 3 warnings
apache_beam/examples/cookbook/bigquery_tornadoes_it_test.py: 1 warning
apache_beam/examples/dataframe/flight_delays_it_test.py: 1 warning
apache_beam/io/gcp/big_query_query_to_table_it_test.py: 4 warnings
apache_beam/io/gcp/bigquery_read_it_test.py: 7 warnings
apache_beam/io/gcp/bigquery_io_read_it_test.py: 2 warnings
apache_beam/io/gcp/bigquery_json_it_test.py: 3 warnings
  <https://ci-beam.apache.org/job/beam_PostCommit_Python39/ws/src/sdks/python/apache_beam/io/gcp/bigquery.py>:2690: BeamDeprecationWarning: options is deprecated since First stable release. References to <pipeline>.options will not be supported
    pipeline_options=pcoll.pipeline.options,

apache_beam/dataframe/io_it_test.py: 2 warnings
apache_beam/io/gcp/bigquery_json_it_test.py: 1 warning
apache_beam/io/gcp/bigquery_read_it_test.py: 9 warnings
  <https://ci-beam.apache.org/job/beam_PostCommit_Python39/ws/src/sdks/python/apache_beam/io/gcp/bigquery.py>:2708: BeamDeprecationWarning: options is deprecated since First stable release. References to <pipeline>.options will not be supported
    project_id = pcoll.pipeline.options.view_as(GoogleCloudOptions).project

apache_beam/dataframe/io_it_test.py: 2 warnings
apache_beam/io/gcp/bigquery_json_it_test.py: 1 warning
apache_beam/io/gcp/bigquery_read_it_test.py: 9 warnings
  <https://ci-beam.apache.org/job/beam_PostCommit_Python39/ws/src/sdks/python/apache_beam/io/gcp/bigquery.py>:2729: BeamDeprecationWarning: options is deprecated since First stable release. References to <pipeline>.options will not be supported
    pipeline_options=pcoll.pipeline.options,

apache_beam/examples/cookbook/bigquery_tornadoes_it_test.py: 1 warning
apache_beam/io/gcp/big_query_query_to_table_it_test.py: 4 warnings
apache_beam/io/gcp/bigquery_write_it_test.py: 4 warnings
apache_beam/io/gcp/bigquery_test.py: 2 warnings
  <https://ci-beam.apache.org/job/beam_PostCommit_Python39/ws/src/sdks/python/apache_beam/io/gcp/bigquery.py>:2024: BeamDeprecationWarning: options is deprecated since First stable release. References to <pipeline>.options will not be supported
    self.table_reference.projectId = pcoll.pipeline.options.view_as(

apache_beam/examples/cookbook/bigquery_tornadoes_it_test.py: 1 warning
apache_beam/examples/complete/game/game_stats_it_test.py: 2 warnings
apache_beam/examples/complete/game/hourly_team_score_it_test.py: 1 warning
apache_beam/examples/complete/game/leader_board_it_test.py: 2 warnings
apache_beam/io/gcp/big_query_query_to_table_it_test.py: 4 warnings
apache_beam/io/gcp/bigquery_file_loads_test.py: 3 warnings
apache_beam/io/gcp/bigquery_json_it_test.py: 2 warnings
apache_beam/io/gcp/bigquery_test.py: 6 warnings
apache_beam/io/gcp/bigquery_write_it_test.py: 4 warnings
  <https://ci-beam.apache.org/job/beam_PostCommit_Python39/ws/src/sdks/python/apache_beam/io/gcp/bigquery.py>:2028: BeamDeprecationWarning: options is deprecated since First stable release. References to <pipeline>.options will not be supported
    is_streaming_pipeline = p.options.view_as(StandardOptions).streaming

apache_beam/examples/cookbook/bigquery_tornadoes_it_test.py: 1 warning
apache_beam/examples/complete/game/game_stats_it_test.py: 2 warnings
apache_beam/examples/complete/game/hourly_team_score_it_test.py: 1 warning
apache_beam/examples/complete/game/leader_board_it_test.py: 2 warnings
apache_beam/io/gcp/big_query_query_to_table_it_test.py: 4 warnings
apache_beam/io/gcp/bigquery_file_loads_test.py: 3 warnings
apache_beam/io/gcp/bigquery_json_it_test.py: 2 warnings
apache_beam/io/gcp/bigquery_test.py: 6 warnings
apache_beam/io/gcp/bigquery_write_it_test.py: 4 warnings
  <https://ci-beam.apache.org/job/beam_PostCommit_Python39/ws/src/sdks/python/apache_beam/io/gcp/bigquery.py>:2034: BeamDeprecationWarning: options is deprecated since First stable release. References to <pipeline>.options will not be supported
    experiments = p.options.view_as(DebugOptions).experiments or []

apache_beam/examples/cookbook/bigquery_tornadoes_it_test.py: 1 warning
apache_beam/io/gcp/big_query_query_to_table_it_test.py: 4 warnings
apache_beam/io/gcp/bigquery_file_loads_test.py: 3 warnings
apache_beam/io/gcp/bigquery_write_it_test.py: 3 warnings
apache_beam/io/gcp/bigquery_test.py: 3 warnings
  <https://ci-beam.apache.org/job/beam_PostCommit_Python39/ws/src/sdks/python/apache_beam/io/gcp/bigquery_file_loads.py>:1169: BeamDeprecationWarning: options is deprecated since First stable release. References to <pipeline>.options will not be supported
    self.project = self.project or p.options.view_as(GoogleCloudOptions).project

apache_beam/examples/cookbook/bigquery_tornadoes_it_test.py: 1 warning
apache_beam/examples/complete/game/hourly_team_score_it_test.py: 1 warning
apache_beam/io/gcp/big_query_query_to_table_it_test.py: 4 warnings
apache_beam/io/gcp/bigquery_file_loads_test.py: 3 warnings
apache_beam/io/gcp/bigquery_write_it_test.py: 3 warnings
apache_beam/io/gcp/bigquery_test.py: 3 warnings
  <https://ci-beam.apache.org/job/beam_PostCommit_Python39/ws/src/sdks/python/apache_beam/io/gcp/bigquery_file_loads.py>:1176: BeamDeprecationWarning: options is deprecated since First stable release. References to <pipeline>.options will not be supported
    temp_location = p.options.view_as(GoogleCloudOptions).temp_location

apache_beam/examples/cookbook/bigquery_tornadoes_it_test.py: 1 warning
apache_beam/examples/complete/game/hourly_team_score_it_test.py: 1 warning
apache_beam/io/gcp/big_query_query_to_table_it_test.py: 4 warnings
apache_beam/io/gcp/bigquery_file_loads_test.py: 3 warnings
apache_beam/io/gcp/bigquery_write_it_test.py: 3 warnings
apache_beam/io/gcp/bigquery_test.py: 3 warnings
  <https://ci-beam.apache.org/job/beam_PostCommit_Python39/ws/src/sdks/python/apache_beam/io/gcp/bigquery_file_loads.py>:1178: BeamDeprecationWarning: options is deprecated since First stable release. References to <pipeline>.options will not be supported
    p.options.view_as(GoogleCloudOptions).job_name or 'AUTOMATIC_JOB_NAME')

apache_beam/examples/cookbook/bigquery_tornadoes_it_test.py::BigqueryTornadoesIT::test_bigquery_tornadoes_it
  <https://ci-beam.apache.org/job/beam_PostCommit_Python39/ws/src/sdks/python/apache_beam/io/gcp/tests/utils.py>:100: PendingDeprecationWarning: Client.dataset is deprecated and will be removed in a future version. Use a string like 'my_project.my_dataset' or a cloud.google.bigquery.DatasetReference object, instead.
    table_ref = client.dataset(dataset_id).table(table_id)

apache_beam/examples/complete/game/game_stats_it_test.py::GameStatsIT::test_game_stats_it
apache_beam/examples/complete/game/hourly_team_score_it_test.py::HourlyTeamScoreIT::test_hourly_team_score_it
apache_beam/examples/complete/game/leader_board_it_test.py::LeaderBoardIT::test_leader_board_it
apache_beam/io/gcp/bigquery_test.py::PubSubBigQueryIT::test_file_loads
apache_beam/io/gcp/bigquery_test.py::PubSubBigQueryIT::test_streaming_inserts
  <https://ci-beam.apache.org/job/beam_PostCommit_Python39/ws/src/sdks/python/apache_beam/io/gcp/tests/utils.py>:63: PendingDeprecationWarning: Client.dataset is deprecated and will be removed in a future version. Use a string like 'my_project.my_dataset' or a cloud.google.bigquery.DatasetReference object, instead.
    dataset_ref = client.dataset(unique_dataset_name, project=project)

apache_beam/examples/dataframe/flight_delays_it_test.py::FlightDelaysTest::test_flight_delays
  <https://ci-beam.apache.org/job/beam_PostCommit_Python39/ws/src/sdks/python/apache_beam/examples/dataframe/flight_delays.py>:47: FutureWarning: The default value of numeric_only in DataFrame.mean is deprecated. In a future version, it will default to False. In addition, specifying 'numeric_only=None' is deprecated. Select only valid columns or specify the value of numeric_only to silence this warning.
    return airline_df[at_top_airports].mean()

apache_beam/examples/dataframe/flight_delays_it_test.py::FlightDelaysTest::test_flight_delays
apache_beam/examples/dataframe/taxiride_it_test.py::TaxirideIT::test_aggregation
apache_beam/examples/dataframe/taxiride_it_test.py::TaxirideIT::test_enrich
  <https://ci-beam.apache.org/job/beam_PostCommit_Python39/ws/src/sdks/python/apache_beam/io/fileio.py>:593: BeamDeprecationWarning: options is deprecated since First stable release. References to <pipeline>.options will not be supported
    p.options.view_as(GoogleCloudOptions).temp_location or

apache_beam/io/gcp/bigquery_read_it_test.py::ReadTests::test_native_source
  <https://ci-beam.apache.org/job/beam_PostCommit_Python39/ws/src/sdks/python/apache_beam/io/gcp/bigquery_read_it_test.py>:170: BeamDeprecationWarning: BigQuerySource is deprecated since 2.25.0. Use ReadFromBigQuery instead.
    beam.io.BigQuerySource(query=self.query, use_standard_sql=True)))

apache_beam/io/gcp/bigquery_test.py::BigQueryStreamingInsertTransformIntegrationTests::test_multiple_destinations_transform
  <https://ci-beam.apache.org/job/beam_PostCommit_Python39/ws/src/sdks/python/apache_beam/io/gcp/bigquery_test.py>:1694: BeamDeprecationWarning: options is deprecated since First stable release. References to <pipeline>.options will not be supported
    streaming = self.test_pipeline.options.view_as(StandardOptions).streaming

apache_beam/io/gcp/bigquery_read_it_test.py::ReadNewTypesTests::test_native_source
  <https://ci-beam.apache.org/job/beam_PostCommit_Python39/ws/src/sdks/python/apache_beam/io/gcp/bigquery_read_it_test.py>:693: BeamDeprecationWarning: BigQuerySource is deprecated since 2.25.0. Use ReadFromBigQuery instead.
    beam.io.BigQuerySource(query=self.query, use_standard_sql=True)))

apache_beam/io/gcp/bigquery_read_it_test.py::ReadAllBQTests::test_read_queries
  <https://ci-beam.apache.org/job/beam_PostCommit_Python39/ws/src/sdks/python/apache_beam/io/gcp/bigquery.py>:2836: BeamDeprecationWarning: options is deprecated since First stable release. References to <pipeline>.options will not be supported
    job_name = pcoll.pipeline.options.view_as(GoogleCloudOptions).job_name

apache_beam/io/gcp/bigquery_read_it_test.py::ReadAllBQTests::test_read_queries
  <https://ci-beam.apache.org/job/beam_PostCommit_Python39/ws/src/sdks/python/apache_beam/io/gcp/bigquery.py>:2837: BeamDeprecationWarning: options is deprecated since First stable release. References to <pipeline>.options will not be supported
    project = pcoll.pipeline.options.view_as(GoogleCloudOptions).project

apache_beam/io/gcp/bigquery_read_it_test.py::ReadAllBQTests::test_read_queries
  <https://ci-beam.apache.org/job/beam_PostCommit_Python39/ws/src/sdks/python/apache_beam/io/gcp/bigquery.py>:2850: BeamDeprecationWarning: options is deprecated since First stable release. References to <pipeline>.options will not be supported
    options=pcoll.pipeline.options,

-- Docs: https://docs.pytest.org/en/stable/how-to/capture-warnings.html
- generated xml file: <https://ci-beam.apache.org/job/beam_PostCommit_Python39/ws/src/sdks/python/pytest_postCommitIT-df-py39.xml> -
========== 83 passed, 39 skipped, 592 warnings in 8588.90s (2:23:08) ===========

FAILURE: Build failed with an exception.

* Where:
Script '<https://ci-beam.apache.org/job/beam_PostCommit_Python39/ws/src/sdks/python/test-suites/direct/common.gradle'> line: 186

* What went wrong:
Execution failed for task ':sdks:python:test-suites:direct:py39:hdfsIntegrationTest'.
> Process 'command 'sh'' finished with non-zero exit value 1

* Try:
> Run with --stacktrace option to get the stack trace.
> Run with --info or --debug option to get more log output.

* Get more help at https://help.gradle.org

Deprecated Gradle features were used in this build, making it incompatible with Gradle 8.0.

You can use '--warning-mode all' to show the individual deprecation warnings and determine if they come from your own scripts or plugins.

See https://docs.gradle.org/7.5.1/userguide/command_line_interface.html#sec:command_line_warnings

Execution optimizations have been disabled for 1 invalid unit(s) of work during this build to ensure correctness.
Please consult deprecation warnings for more details.

BUILD FAILED in 2h 29m 36s
213 actionable tasks: 148 executed, 59 from cache, 6 up-to-date

Publishing build scan...
https://ge.apache.org/s/xuq6jv6kwr7hi

Build step 'Invoke Gradle script' changed build result to FAILURE
Build step 'Invoke Gradle script' marked build as failure

---------------------------------------------------------------------
To unsubscribe, e-mail: builds-unsubscribe@beam.apache.org
For additional commands, e-mail: builds-help@beam.apache.org


Build failed in Jenkins: beam_PostCommit_Python39 #1925

Posted by Apache Jenkins Server <je...@builds.apache.org>.
See <https://ci-beam.apache.org/job/beam_PostCommit_Python39/1925/display/redirect>

Changes:


------------------------------------------
[...truncated 11.25 MB...]
../../build/gradleenv/-1734967050/lib/python3.9/site-packages/pkg_resources/__init__.py:2870
../../build/gradleenv/-1734967050/lib/python3.9/site-packages/pkg_resources/__init__.py:2870
../../build/gradleenv/-1734967050/lib/python3.9/site-packages/pkg_resources/__init__.py:2870
../../build/gradleenv/-1734967050/lib/python3.9/site-packages/pkg_resources/__init__.py:2870
../../build/gradleenv/-1734967050/lib/python3.9/site-packages/pkg_resources/__init__.py:2870
  <https://ci-beam.apache.org/job/beam_PostCommit_Python39/ws/src/build/gradleenv/-1734967050/lib/python3.9/site-packages/pkg_resources/__init__.py>:2870: DeprecationWarning: Deprecated call to `pkg_resources.declare_namespace('google.logging')`.
  Implementing implicit namespace packages (as specified in PEP 420) is preferred to `pkg_resources.declare_namespace`. See https://setuptools.pypa.io/en/latest/references/keywords.html#keyword-namespace-packages
    declare_namespace(pkg)

../../build/gradleenv/-1734967050/lib/python3.9/site-packages/pkg_resources/__init__.py:2870
../../build/gradleenv/-1734967050/lib/python3.9/site-packages/pkg_resources/__init__.py:2870
../../build/gradleenv/-1734967050/lib/python3.9/site-packages/pkg_resources/__init__.py:2870
../../build/gradleenv/-1734967050/lib/python3.9/site-packages/pkg_resources/__init__.py:2870
../../build/gradleenv/-1734967050/lib/python3.9/site-packages/pkg_resources/__init__.py:2870
../../build/gradleenv/-1734967050/lib/python3.9/site-packages/pkg_resources/__init__.py:2870
../../build/gradleenv/-1734967050/lib/python3.9/site-packages/pkg_resources/__init__.py:2870
../../build/gradleenv/-1734967050/lib/python3.9/site-packages/pkg_resources/__init__.py:2870
../../build/gradleenv/-1734967050/lib/python3.9/site-packages/pkg_resources/__init__.py:2870
  <https://ci-beam.apache.org/job/beam_PostCommit_Python39/ws/src/build/gradleenv/-1734967050/lib/python3.9/site-packages/pkg_resources/__init__.py>:2870: DeprecationWarning: Deprecated call to `pkg_resources.declare_namespace('google.iam')`.
  Implementing implicit namespace packages (as specified in PEP 420) is preferred to `pkg_resources.declare_namespace`. See https://setuptools.pypa.io/en/latest/references/keywords.html#keyword-namespace-packages
    declare_namespace(pkg)

../../build/gradleenv/-1734967050/lib/python3.9/site-packages/google/rpc/__init__.py:20
../../build/gradleenv/-1734967050/lib/python3.9/site-packages/google/rpc/__init__.py:20
../../build/gradleenv/-1734967050/lib/python3.9/site-packages/google/rpc/__init__.py:20
../../build/gradleenv/-1734967050/lib/python3.9/site-packages/google/rpc/__init__.py:20
../../build/gradleenv/-1734967050/lib/python3.9/site-packages/google/rpc/__init__.py:20
../../build/gradleenv/-1734967050/lib/python3.9/site-packages/google/rpc/__init__.py:20
../../build/gradleenv/-1734967050/lib/python3.9/site-packages/google/rpc/__init__.py:20
../../build/gradleenv/-1734967050/lib/python3.9/site-packages/google/rpc/__init__.py:20
../../build/gradleenv/-1734967050/lib/python3.9/site-packages/google/rpc/__init__.py:20
  <https://ci-beam.apache.org/job/beam_PostCommit_Python39/ws/src/build/gradleenv/-1734967050/lib/python3.9/site-packages/google/rpc/__init__.py>:20: DeprecationWarning: Deprecated call to `pkg_resources.declare_namespace('google.rpc')`.
  Implementing implicit namespace packages (as specified in PEP 420) is preferred to `pkg_resources.declare_namespace`. See https://setuptools.pypa.io/en/latest/references/keywords.html#keyword-namespace-packages
    pkg_resources.declare_namespace(__name__)

apache_beam/typehints/pandas_type_compatibility_test.py:67
apache_beam/typehints/pandas_type_compatibility_test.py:67
apache_beam/typehints/pandas_type_compatibility_test.py:67
apache_beam/typehints/pandas_type_compatibility_test.py:67
apache_beam/typehints/pandas_type_compatibility_test.py:67
apache_beam/typehints/pandas_type_compatibility_test.py:67
apache_beam/typehints/pandas_type_compatibility_test.py:67
apache_beam/typehints/pandas_type_compatibility_test.py:67
  <https://ci-beam.apache.org/job/beam_PostCommit_Python39/ws/src/sdks/python/apache_beam/typehints/pandas_type_compatibility_test.py>:67: FutureWarning: pandas.Int64Index is deprecated and will be removed from pandas in a future version. Use pandas.Index with the appropriate dtype instead.
    }).set_index(pd.Int64Index(range(123, 223), name='an_index')),

apache_beam/typehints/pandas_type_compatibility_test.py:90
apache_beam/typehints/pandas_type_compatibility_test.py:90
apache_beam/typehints/pandas_type_compatibility_test.py:90
apache_beam/typehints/pandas_type_compatibility_test.py:90
apache_beam/typehints/pandas_type_compatibility_test.py:90
apache_beam/typehints/pandas_type_compatibility_test.py:90
apache_beam/typehints/pandas_type_compatibility_test.py:90
apache_beam/typehints/pandas_type_compatibility_test.py:90
  <https://ci-beam.apache.org/job/beam_PostCommit_Python39/ws/src/sdks/python/apache_beam/typehints/pandas_type_compatibility_test.py>:90: FutureWarning: pandas.Int64Index is deprecated and will be removed from pandas in a future version. Use pandas.Index with the appropriate dtype instead.
    pd.Int64Index(range(123, 223), name='an_index'),

apache_beam/typehints/pandas_type_compatibility_test.py:91
apache_beam/typehints/pandas_type_compatibility_test.py:91
apache_beam/typehints/pandas_type_compatibility_test.py:91
apache_beam/typehints/pandas_type_compatibility_test.py:91
apache_beam/typehints/pandas_type_compatibility_test.py:91
apache_beam/typehints/pandas_type_compatibility_test.py:91
apache_beam/typehints/pandas_type_compatibility_test.py:91
apache_beam/typehints/pandas_type_compatibility_test.py:91
  <https://ci-beam.apache.org/job/beam_PostCommit_Python39/ws/src/sdks/python/apache_beam/typehints/pandas_type_compatibility_test.py>:91: FutureWarning: pandas.Int64Index is deprecated and will be removed from pandas in a future version. Use pandas.Index with the appropriate dtype instead.
    pd.Int64Index(range(475, 575), name='another_index'),

apache_beam/dataframe/io_it_test.py: 3 warnings
apache_beam/examples/cookbook/bigquery_tornadoes_it_test.py: 1 warning
apache_beam/examples/dataframe/flight_delays_it_test.py: 1 warning
apache_beam/io/gcp/big_query_query_to_table_it_test.py: 4 warnings
apache_beam/io/gcp/bigquery_io_read_it_test.py: 2 warnings
apache_beam/io/gcp/bigquery_json_it_test.py: 3 warnings
apache_beam/io/gcp/bigquery_read_it_test.py: 7 warnings
  <https://ci-beam.apache.org/job/beam_PostCommit_Python39/ws/src/sdks/python/apache_beam/io/gcp/bigquery.py>:2664: BeamDeprecationWarning: options is deprecated since First stable release. References to <pipeline>.options will not be supported
    temp_location = pcoll.pipeline.options.view_as(

apache_beam/dataframe/io_it_test.py: 3 warnings
apache_beam/examples/cookbook/bigquery_tornadoes_it_test.py: 1 warning
apache_beam/examples/dataframe/flight_delays_it_test.py: 1 warning
apache_beam/io/gcp/big_query_query_to_table_it_test.py: 4 warnings
apache_beam/io/gcp/bigquery_io_read_it_test.py: 2 warnings
apache_beam/io/gcp/bigquery_json_it_test.py: 3 warnings
apache_beam/io/gcp/bigquery_read_it_test.py: 7 warnings
  <https://ci-beam.apache.org/job/beam_PostCommit_Python39/ws/src/sdks/python/apache_beam/io/gcp/bigquery.py>:2666: BeamDeprecationWarning: options is deprecated since First stable release. References to <pipeline>.options will not be supported
    job_name = pcoll.pipeline.options.view_as(GoogleCloudOptions).job_name

apache_beam/dataframe/io_it_test.py: 3 warnings
apache_beam/examples/cookbook/bigquery_tornadoes_it_test.py: 1 warning
apache_beam/examples/dataframe/flight_delays_it_test.py: 1 warning
apache_beam/io/gcp/big_query_query_to_table_it_test.py: 4 warnings
apache_beam/io/gcp/bigquery_io_read_it_test.py: 2 warnings
apache_beam/io/gcp/bigquery_json_it_test.py: 3 warnings
apache_beam/io/gcp/bigquery_read_it_test.py: 7 warnings
  <https://ci-beam.apache.org/job/beam_PostCommit_Python39/ws/src/sdks/python/apache_beam/io/gcp/bigquery.py>:2690: BeamDeprecationWarning: options is deprecated since First stable release. References to <pipeline>.options will not be supported
    pipeline_options=pcoll.pipeline.options,

apache_beam/dataframe/io_it_test.py: 2 warnings
apache_beam/io/gcp/bigquery_json_it_test.py: 1 warning
apache_beam/io/gcp/bigquery_read_it_test.py: 9 warnings
  <https://ci-beam.apache.org/job/beam_PostCommit_Python39/ws/src/sdks/python/apache_beam/io/gcp/bigquery.py>:2708: BeamDeprecationWarning: options is deprecated since First stable release. References to <pipeline>.options will not be supported
    project_id = pcoll.pipeline.options.view_as(GoogleCloudOptions).project

apache_beam/dataframe/io_it_test.py: 2 warnings
apache_beam/io/gcp/bigquery_json_it_test.py: 1 warning
apache_beam/io/gcp/bigquery_read_it_test.py: 9 warnings
  <https://ci-beam.apache.org/job/beam_PostCommit_Python39/ws/src/sdks/python/apache_beam/io/gcp/bigquery.py>:2729: BeamDeprecationWarning: options is deprecated since First stable release. References to <pipeline>.options will not be supported
    pipeline_options=pcoll.pipeline.options,

apache_beam/examples/cookbook/bigquery_tornadoes_it_test.py: 1 warning
apache_beam/io/gcp/big_query_query_to_table_it_test.py: 4 warnings
apache_beam/io/gcp/bigquery_write_it_test.py: 4 warnings
apache_beam/io/gcp/bigquery_test.py: 2 warnings
  <https://ci-beam.apache.org/job/beam_PostCommit_Python39/ws/src/sdks/python/apache_beam/io/gcp/bigquery.py>:2024: BeamDeprecationWarning: options is deprecated since First stable release. References to <pipeline>.options will not be supported
    self.table_reference.projectId = pcoll.pipeline.options.view_as(

apache_beam/examples/cookbook/bigquery_tornadoes_it_test.py: 1 warning
apache_beam/examples/complete/game/hourly_team_score_it_test.py: 1 warning
apache_beam/examples/complete/game/game_stats_it_test.py: 2 warnings
apache_beam/io/gcp/big_query_query_to_table_it_test.py: 4 warnings
apache_beam/io/gcp/bigquery_file_loads_test.py: 3 warnings
apache_beam/examples/complete/game/leader_board_it_test.py: 2 warnings
apache_beam/io/gcp/bigquery_json_it_test.py: 2 warnings
apache_beam/io/gcp/bigquery_test.py: 6 warnings
apache_beam/io/gcp/bigquery_write_it_test.py: 4 warnings
  <https://ci-beam.apache.org/job/beam_PostCommit_Python39/ws/src/sdks/python/apache_beam/io/gcp/bigquery.py>:2028: BeamDeprecationWarning: options is deprecated since First stable release. References to <pipeline>.options will not be supported
    is_streaming_pipeline = p.options.view_as(StandardOptions).streaming

apache_beam/examples/cookbook/bigquery_tornadoes_it_test.py: 1 warning
apache_beam/examples/complete/game/hourly_team_score_it_test.py: 1 warning
apache_beam/examples/complete/game/game_stats_it_test.py: 2 warnings
apache_beam/io/gcp/big_query_query_to_table_it_test.py: 4 warnings
apache_beam/io/gcp/bigquery_file_loads_test.py: 3 warnings
apache_beam/examples/complete/game/leader_board_it_test.py: 2 warnings
apache_beam/io/gcp/bigquery_json_it_test.py: 2 warnings
apache_beam/io/gcp/bigquery_test.py: 6 warnings
apache_beam/io/gcp/bigquery_write_it_test.py: 4 warnings
  <https://ci-beam.apache.org/job/beam_PostCommit_Python39/ws/src/sdks/python/apache_beam/io/gcp/bigquery.py>:2034: BeamDeprecationWarning: options is deprecated since First stable release. References to <pipeline>.options will not be supported
    experiments = p.options.view_as(DebugOptions).experiments or []

apache_beam/examples/cookbook/bigquery_tornadoes_it_test.py: 1 warning
apache_beam/io/gcp/big_query_query_to_table_it_test.py: 4 warnings
apache_beam/io/gcp/bigquery_file_loads_test.py: 3 warnings
apache_beam/io/gcp/bigquery_test.py: 3 warnings
apache_beam/io/gcp/bigquery_write_it_test.py: 3 warnings
  <https://ci-beam.apache.org/job/beam_PostCommit_Python39/ws/src/sdks/python/apache_beam/io/gcp/bigquery_file_loads.py>:1169: BeamDeprecationWarning: options is deprecated since First stable release. References to <pipeline>.options will not be supported
    self.project = self.project or p.options.view_as(GoogleCloudOptions).project

apache_beam/examples/cookbook/bigquery_tornadoes_it_test.py: 1 warning
apache_beam/examples/complete/game/hourly_team_score_it_test.py: 1 warning
apache_beam/io/gcp/big_query_query_to_table_it_test.py: 4 warnings
apache_beam/io/gcp/bigquery_file_loads_test.py: 3 warnings
apache_beam/io/gcp/bigquery_test.py: 3 warnings
apache_beam/io/gcp/bigquery_write_it_test.py: 3 warnings
  <https://ci-beam.apache.org/job/beam_PostCommit_Python39/ws/src/sdks/python/apache_beam/io/gcp/bigquery_file_loads.py>:1176: BeamDeprecationWarning: options is deprecated since First stable release. References to <pipeline>.options will not be supported
    temp_location = p.options.view_as(GoogleCloudOptions).temp_location

apache_beam/examples/cookbook/bigquery_tornadoes_it_test.py: 1 warning
apache_beam/examples/complete/game/hourly_team_score_it_test.py: 1 warning
apache_beam/io/gcp/big_query_query_to_table_it_test.py: 4 warnings
apache_beam/io/gcp/bigquery_file_loads_test.py: 3 warnings
apache_beam/io/gcp/bigquery_test.py: 3 warnings
apache_beam/io/gcp/bigquery_write_it_test.py: 3 warnings
  <https://ci-beam.apache.org/job/beam_PostCommit_Python39/ws/src/sdks/python/apache_beam/io/gcp/bigquery_file_loads.py>:1178: BeamDeprecationWarning: options is deprecated since First stable release. References to <pipeline>.options will not be supported
    p.options.view_as(GoogleCloudOptions).job_name or 'AUTOMATIC_JOB_NAME')

apache_beam/examples/cookbook/bigquery_tornadoes_it_test.py::BigqueryTornadoesIT::test_bigquery_tornadoes_it
  <https://ci-beam.apache.org/job/beam_PostCommit_Python39/ws/src/sdks/python/apache_beam/io/gcp/tests/utils.py>:100: PendingDeprecationWarning: Client.dataset is deprecated and will be removed in a future version. Use a string like 'my_project.my_dataset' or a cloud.google.bigquery.DatasetReference object, instead.
    table_ref = client.dataset(dataset_id).table(table_id)

apache_beam/examples/complete/game/hourly_team_score_it_test.py::HourlyTeamScoreIT::test_hourly_team_score_it
apache_beam/examples/complete/game/game_stats_it_test.py::GameStatsIT::test_game_stats_it
apache_beam/examples/complete/game/leader_board_it_test.py::LeaderBoardIT::test_leader_board_it
apache_beam/io/gcp/bigquery_test.py::PubSubBigQueryIT::test_file_loads
apache_beam/io/gcp/bigquery_test.py::PubSubBigQueryIT::test_streaming_inserts
  <https://ci-beam.apache.org/job/beam_PostCommit_Python39/ws/src/sdks/python/apache_beam/io/gcp/tests/utils.py>:63: PendingDeprecationWarning: Client.dataset is deprecated and will be removed in a future version. Use a string like 'my_project.my_dataset' or a cloud.google.bigquery.DatasetReference object, instead.
    dataset_ref = client.dataset(unique_dataset_name, project=project)

apache_beam/examples/dataframe/flight_delays_it_test.py::FlightDelaysTest::test_flight_delays
  <https://ci-beam.apache.org/job/beam_PostCommit_Python39/ws/src/sdks/python/apache_beam/examples/dataframe/flight_delays.py>:47: FutureWarning: The default value of numeric_only in DataFrame.mean is deprecated. In a future version, it will default to False. In addition, specifying 'numeric_only=None' is deprecated. Select only valid columns or specify the value of numeric_only to silence this warning.
    return airline_df[at_top_airports].mean()

apache_beam/examples/dataframe/flight_delays_it_test.py::FlightDelaysTest::test_flight_delays
apache_beam/examples/dataframe/taxiride_it_test.py::TaxirideIT::test_aggregation
apache_beam/examples/dataframe/taxiride_it_test.py::TaxirideIT::test_enrich
  <https://ci-beam.apache.org/job/beam_PostCommit_Python39/ws/src/sdks/python/apache_beam/io/fileio.py>:593: BeamDeprecationWarning: options is deprecated since First stable release. References to <pipeline>.options will not be supported
    p.options.view_as(GoogleCloudOptions).temp_location or

apache_beam/io/gcp/bigquery_test.py::BigQueryStreamingInsertTransformIntegrationTests::test_multiple_destinations_transform
  <https://ci-beam.apache.org/job/beam_PostCommit_Python39/ws/src/sdks/python/apache_beam/io/gcp/bigquery_test.py>:1694: BeamDeprecationWarning: options is deprecated since First stable release. References to <pipeline>.options will not be supported
    streaming = self.test_pipeline.options.view_as(StandardOptions).streaming

apache_beam/io/gcp/bigquery_read_it_test.py::ReadTests::test_native_source
  <https://ci-beam.apache.org/job/beam_PostCommit_Python39/ws/src/sdks/python/apache_beam/io/gcp/bigquery_read_it_test.py>:170: BeamDeprecationWarning: BigQuerySource is deprecated since 2.25.0. Use ReadFromBigQuery instead.
    beam.io.BigQuerySource(query=self.query, use_standard_sql=True)))

apache_beam/io/gcp/bigquery_read_it_test.py::ReadNewTypesTests::test_native_source
  <https://ci-beam.apache.org/job/beam_PostCommit_Python39/ws/src/sdks/python/apache_beam/io/gcp/bigquery_read_it_test.py>:693: BeamDeprecationWarning: BigQuerySource is deprecated since 2.25.0. Use ReadFromBigQuery instead.
    beam.io.BigQuerySource(query=self.query, use_standard_sql=True)))

apache_beam/io/gcp/bigquery_read_it_test.py::ReadAllBQTests::test_read_queries
  <https://ci-beam.apache.org/job/beam_PostCommit_Python39/ws/src/sdks/python/apache_beam/io/gcp/bigquery.py>:2836: BeamDeprecationWarning: options is deprecated since First stable release. References to <pipeline>.options will not be supported
    job_name = pcoll.pipeline.options.view_as(GoogleCloudOptions).job_name

apache_beam/io/gcp/bigquery_read_it_test.py::ReadAllBQTests::test_read_queries
  <https://ci-beam.apache.org/job/beam_PostCommit_Python39/ws/src/sdks/python/apache_beam/io/gcp/bigquery.py>:2837: BeamDeprecationWarning: options is deprecated since First stable release. References to <pipeline>.options will not be supported
    project = pcoll.pipeline.options.view_as(GoogleCloudOptions).project

apache_beam/io/gcp/bigquery_read_it_test.py::ReadAllBQTests::test_read_queries
  <https://ci-beam.apache.org/job/beam_PostCommit_Python39/ws/src/sdks/python/apache_beam/io/gcp/bigquery.py>:2850: BeamDeprecationWarning: options is deprecated since First stable release. References to <pipeline>.options will not be supported
    options=pcoll.pipeline.options,

-- Docs: https://docs.pytest.org/en/stable/how-to/capture-warnings.html
- generated xml file: <https://ci-beam.apache.org/job/beam_PostCommit_Python39/ws/src/sdks/python/pytest_postCommitIT-df-py39.xml> -
========== 83 passed, 39 skipped, 592 warnings in 8093.69s (2:14:53) ===========

FAILURE: Build failed with an exception.

* Where:
Script '<https://ci-beam.apache.org/job/beam_PostCommit_Python39/ws/src/sdks/python/test-suites/direct/common.gradle'> line: 186

* What went wrong:
Execution failed for task ':sdks:python:test-suites:direct:py39:hdfsIntegrationTest'.
> Process 'command 'sh'' finished with non-zero exit value 1

* Try:
> Run with --stacktrace option to get the stack trace.
> Run with --info or --debug option to get more log output.

* Get more help at https://help.gradle.org

Deprecated Gradle features were used in this build, making it incompatible with Gradle 8.0.

You can use '--warning-mode all' to show the individual deprecation warnings and determine if they come from your own scripts or plugins.

See https://docs.gradle.org/7.5.1/userguide/command_line_interface.html#sec:command_line_warnings

Execution optimizations have been disabled for 1 invalid unit(s) of work during this build to ensure correctness.
Please consult deprecation warnings for more details.

BUILD FAILED in 2h 20m 59s
213 actionable tasks: 149 executed, 58 from cache, 6 up-to-date

Publishing build scan...
https://ge.apache.org/s/ku2lx6fheftko

Build step 'Invoke Gradle script' changed build result to FAILURE
Build step 'Invoke Gradle script' marked build as failure

---------------------------------------------------------------------
To unsubscribe, e-mail: builds-unsubscribe@beam.apache.org
For additional commands, e-mail: builds-help@beam.apache.org


Build failed in Jenkins: beam_PostCommit_Python39 #1924

Posted by Apache Jenkins Server <je...@builds.apache.org>.
See <https://ci-beam.apache.org/job/beam_PostCommit_Python39/1924/display/redirect>

Changes:


------------------------------------------
[...truncated 8.96 MB...]
message: "Closing all cached gRPC state handlers."
log_location: "/usr/local/lib/python3.9/site-packages/apache_beam/runners/worker/sdk_worker.py:908"
thread: "MainThread"

INFO:root:severity: INFO
timestamp {
  seconds: 1686378518
  nanos: 356623649
}
message: "Done consuming work."
log_location: "/usr/local/lib/python3.9/site-packages/apache_beam/runners/worker/sdk_worker.py:285"
thread: "MainThread"

INFO:root:severity: INFO
timestamp {
  seconds: 1686378518
  nanos: 356768846
}
message: "Python sdk harness exiting."
log_location: "/usr/local/lib/python3.9/site-packages/apache_beam/runners/worker/sdk_worker_main.py:213"
thread: "MainThread"

INFO:apache_beam.runners.portability.local_job_service:Completed job in 18.255016803741455 seconds with state DONE.
INFO:root:Completed job in 18.255016803741455 seconds with state DONE.
INFO:apache_beam.runners.portability.portable_runner:Job state changed to DONE

> Task :sdks:python:test-suites:portable:py39:portableWordCountSparkRunnerBatch
INFO:apache_beam.runners.worker.worker_pool_main:Listening for workers at localhost:33639
INFO:apache_beam.runners.portability.fn_api_runner.translations:==================== <function pack_combiners at 0x7f859d281430> ====================
INFO:apache_beam.runners.portability.fn_api_runner.translations:==================== <function lift_combiners at 0x7f859d2814c0> ====================
INFO:apache_beam.runners.portability.fn_api_runner.translations:==================== <function sort_stages at 0x7f859d281c10> ====================
INFO:apache_beam.utils.subprocess_server:Starting service with ['java' '-jar' '<https://ci-beam.apache.org/job/beam_PostCommit_Python39/ws/src/runners/spark/3/job-server/build/libs/beam-runners-spark-3-job-server-2.49.0-SNAPSHOT.jar'> '--spark-master-url' 'local[4]' '--artifacts-dir' '/tmp/beam-tempo5x1hiqy/artifacts505d03__' '--job-port' '59961' '--artifact-port' '0' '--expansion-port' '0']
INFO:apache_beam.utils.subprocess_server:23/06/10 06:28:45 WARN software.amazon.awssdk.regions.internal.util.EC2MetadataUtils: Unable to retrieve the requested metadata.
INFO:apache_beam.utils.subprocess_server:23/06/10 06:28:46 INFO org.apache.beam.runners.jobsubmission.JobServerDriver: ArtifactStagingService started on localhost:46515
INFO:apache_beam.utils.subprocess_server:23/06/10 06:28:46 INFO org.apache.beam.runners.jobsubmission.JobServerDriver: Java ExpansionService started on localhost:43457
INFO:apache_beam.utils.subprocess_server:23/06/10 06:28:46 INFO org.apache.beam.runners.jobsubmission.JobServerDriver: JobService started on localhost:59961
INFO:apache_beam.utils.subprocess_server:23/06/10 06:28:46 INFO org.apache.beam.runners.jobsubmission.JobServerDriver: Job server now running, terminate with Ctrl+C
WARNING:root:Waiting for grpc channel to be ready at localhost:59961.
INFO:apache_beam.utils.subprocess_server:23/06/10 06:28:48 INFO org.apache.beam.runners.fnexecution.artifact.ArtifactStagingService: Staging artifacts for job_9e93d963-0c2b-41c9-be28-8a6436b686ff.
INFO:apache_beam.utils.subprocess_server:23/06/10 06:28:48 INFO org.apache.beam.runners.fnexecution.artifact.ArtifactStagingService: Resolving artifacts for job_9e93d963-0c2b-41c9-be28-8a6436b686ff.ref_Environment_default_environment_1.
INFO:apache_beam.utils.subprocess_server:23/06/10 06:28:48 INFO org.apache.beam.runners.fnexecution.artifact.ArtifactStagingService: Getting 1 artifacts for job_9e93d963-0c2b-41c9-be28-8a6436b686ff.null.
INFO:apache_beam.utils.subprocess_server:23/06/10 06:28:48 INFO org.apache.beam.runners.fnexecution.artifact.ArtifactStagingService: Artifacts fully staged for job_9e93d963-0c2b-41c9-be28-8a6436b686ff.
INFO:apache_beam.utils.subprocess_server:23/06/10 06:28:48 INFO org.apache.beam.runners.spark.SparkJobInvoker: Invoking job BeamApp-jenkins-0610062848-8545c33f_c2aadabc-01ae-454d-aac9-65ce51923753
INFO:apache_beam.utils.subprocess_server:23/06/10 06:28:48 INFO org.apache.beam.runners.jobsubmission.JobInvocation: Starting job invocation BeamApp-jenkins-0610062848-8545c33f_c2aadabc-01ae-454d-aac9-65ce51923753
INFO:apache_beam.runners.portability.portable_runner:Environment "LOOPBACK" has started a component necessary for the execution. Be sure to run the pipeline using
  with Pipeline() as p:
    p.apply(..)
This ensures that the pipeline finishes before this program exits.
INFO:apache_beam.runners.portability.portable_runner:Job state changed to STOPPED
INFO:apache_beam.runners.portability.portable_runner:Job state changed to STARTING
INFO:apache_beam.runners.portability.portable_runner:Job state changed to RUNNING
INFO:apache_beam.utils.subprocess_server:23/06/10 06:28:49 INFO org.apache.beam.runners.spark.translation.SparkContextFactory: Creating a brand new Spark Context.
INFO:apache_beam.utils.subprocess_server:23/06/10 06:28:50 WARN org.apache.hadoop.util.NativeCodeLoader: Unable to load native-hadoop library for your platform... using builtin-java classes where applicable
INFO:apache_beam.utils.subprocess_server:23/06/10 06:28:51 INFO org.sparkproject.jetty.util.log: Logging initialized @8450ms to org.sparkproject.jetty.util.log.Slf4jLog
INFO:apache_beam.utils.subprocess_server:23/06/10 06:28:51 INFO org.sparkproject.jetty.server.Server: jetty-9.4.40.v20210413; built: 2021-04-13T20:42:42.668Z; git: b881a572662e1943a14ae12e7e1207989f218b74; jvm 1.8.0_362-8u372-ga~us1-0ubuntu1~20.04-b09
INFO:apache_beam.utils.subprocess_server:23/06/10 06:28:51 INFO org.sparkproject.jetty.server.Server: Started @8729ms
INFO:apache_beam.utils.subprocess_server:23/06/10 06:28:51 INFO org.sparkproject.jetty.server.AbstractConnector: Started ServerConnector@1392e828{HTTP/1.1, (http/1.1)}{127.0.0.1:4040}
INFO:apache_beam.utils.subprocess_server:23/06/10 06:28:51 INFO org.sparkproject.jetty.server.handler.ContextHandler: Started o.s.j.s.ServletContextHandler@2b0045a0{/jobs,null,AVAILABLE,@Spark}
INFO:apache_beam.utils.subprocess_server:23/06/10 06:28:51 INFO org.sparkproject.jetty.server.handler.ContextHandler: Started o.s.j.s.ServletContextHandler@7f2ae210{/jobs/json,null,AVAILABLE,@Spark}
INFO:apache_beam.utils.subprocess_server:23/06/10 06:28:51 INFO org.sparkproject.jetty.server.handler.ContextHandler: Started o.s.j.s.ServletContextHandler@14fa9e5b{/jobs/job,null,AVAILABLE,@Spark}
INFO:apache_beam.utils.subprocess_server:23/06/10 06:28:51 INFO org.sparkproject.jetty.server.handler.ContextHandler: Started o.s.j.s.ServletContextHandler@72174a68{/jobs/job/json,null,AVAILABLE,@Spark}
INFO:apache_beam.utils.subprocess_server:23/06/10 06:28:51 INFO org.sparkproject.jetty.server.handler.ContextHandler: Started o.s.j.s.ServletContextHandler@750556fc{/stages,null,AVAILABLE,@Spark}
INFO:apache_beam.utils.subprocess_server:23/06/10 06:28:51 INFO org.sparkproject.jetty.server.handler.ContextHandler: Started o.s.j.s.ServletContextHandler@406473ee{/stages/json,null,AVAILABLE,@Spark}
INFO:apache_beam.utils.subprocess_server:23/06/10 06:28:51 INFO org.sparkproject.jetty.server.handler.ContextHandler: Started o.s.j.s.ServletContextHandler@55cdc269{/stages/stage,null,AVAILABLE,@Spark}
INFO:apache_beam.utils.subprocess_server:23/06/10 06:28:51 INFO org.sparkproject.jetty.server.handler.ContextHandler: Started o.s.j.s.ServletContextHandler@48e2ba60{/stages/stage/json,null,AVAILABLE,@Spark}
INFO:apache_beam.utils.subprocess_server:23/06/10 06:28:51 INFO org.sparkproject.jetty.server.handler.ContextHandler: Started o.s.j.s.ServletContextHandler@6c05696d{/stages/pool,null,AVAILABLE,@Spark}
INFO:apache_beam.utils.subprocess_server:23/06/10 06:28:51 INFO org.sparkproject.jetty.server.handler.ContextHandler: Started o.s.j.s.ServletContextHandler@7da59335{/stages/pool/json,null,AVAILABLE,@Spark}
INFO:apache_beam.utils.subprocess_server:23/06/10 06:28:51 INFO org.sparkproject.jetty.server.handler.ContextHandler: Started o.s.j.s.ServletContextHandler@1e3c14f2{/storage,null,AVAILABLE,@Spark}
INFO:apache_beam.utils.subprocess_server:23/06/10 06:28:51 INFO org.sparkproject.jetty.server.handler.ContextHandler: Started o.s.j.s.ServletContextHandler@27971c3e{/storage/json,null,AVAILABLE,@Spark}
INFO:apache_beam.utils.subprocess_server:23/06/10 06:28:51 INFO org.sparkproject.jetty.server.handler.ContextHandler: Started o.s.j.s.ServletContextHandler@2ab13d08{/storage/rdd,null,AVAILABLE,@Spark}
INFO:apache_beam.utils.subprocess_server:23/06/10 06:28:51 INFO org.sparkproject.jetty.server.handler.ContextHandler: Started o.s.j.s.ServletContextHandler@132b0b96{/storage/rdd/json,null,AVAILABLE,@Spark}
INFO:apache_beam.utils.subprocess_server:23/06/10 06:28:51 INFO org.sparkproject.jetty.server.handler.ContextHandler: Started o.s.j.s.ServletContextHandler@4537aaa3{/environment,null,AVAILABLE,@Spark}
INFO:apache_beam.utils.subprocess_server:23/06/10 06:28:51 INFO org.sparkproject.jetty.server.handler.ContextHandler: Started o.s.j.s.ServletContextHandler@1657d1b9{/environment/json,null,AVAILABLE,@Spark}
INFO:apache_beam.utils.subprocess_server:23/06/10 06:28:51 INFO org.sparkproject.jetty.server.handler.ContextHandler: Started o.s.j.s.ServletContextHandler@649a2787{/executors,null,AVAILABLE,@Spark}
INFO:apache_beam.utils.subprocess_server:23/06/10 06:28:51 INFO org.sparkproject.jetty.server.handler.ContextHandler: Started o.s.j.s.ServletContextHandler@49b760eb{/executors/json,null,AVAILABLE,@Spark}
INFO:apache_beam.utils.subprocess_server:23/06/10 06:28:51 INFO org.sparkproject.jetty.server.handler.ContextHandler: Started o.s.j.s.ServletContextHandler@679f3e56{/executors/threadDump,null,AVAILABLE,@Spark}
INFO:apache_beam.utils.subprocess_server:23/06/10 06:28:51 INFO org.sparkproject.jetty.server.handler.ContextHandler: Started o.s.j.s.ServletContextHandler@59af365f{/executors/threadDump/json,null,AVAILABLE,@Spark}
INFO:apache_beam.utils.subprocess_server:23/06/10 06:28:51 INFO org.sparkproject.jetty.server.handler.ContextHandler: Started o.s.j.s.ServletContextHandler@718ac627{/static,null,AVAILABLE,@Spark}
INFO:apache_beam.utils.subprocess_server:23/06/10 06:28:51 INFO org.sparkproject.jetty.server.handler.ContextHandler: Started o.s.j.s.ServletContextHandler@56488977{/,null,AVAILABLE,@Spark}
INFO:apache_beam.utils.subprocess_server:23/06/10 06:28:51 INFO org.sparkproject.jetty.server.handler.ContextHandler: Started o.s.j.s.ServletContextHandler@6994390f{/api,null,AVAILABLE,@Spark}
INFO:apache_beam.utils.subprocess_server:23/06/10 06:28:51 INFO org.sparkproject.jetty.server.handler.ContextHandler: Started o.s.j.s.ServletContextHandler@5767639d{/jobs/job/kill,null,AVAILABLE,@Spark}
INFO:apache_beam.utils.subprocess_server:23/06/10 06:28:51 INFO org.sparkproject.jetty.server.handler.ContextHandler: Started o.s.j.s.ServletContextHandler@539b101e{/stages/stage/kill,null,AVAILABLE,@Spark}
INFO:apache_beam.utils.subprocess_server:23/06/10 06:28:51 INFO org.sparkproject.jetty.server.handler.ContextHandler: Started o.s.j.s.ServletContextHandler@78ce115c{/metrics/json,null,AVAILABLE,@Spark}
INFO:apache_beam.utils.subprocess_server:23/06/10 06:28:51 INFO org.apache.beam.runners.spark.metrics.MetricsAccumulator: Instantiated metrics accumulator: MetricQueryResults()
INFO:apache_beam.utils.subprocess_server:23/06/10 06:28:51 WARN software.amazon.awssdk.regions.internal.util.EC2MetadataUtils: Unable to retrieve the requested metadata.
INFO:apache_beam.utils.subprocess_server:23/06/10 06:28:51 INFO org.apache.beam.runners.spark.SparkPipelineRunner: Running job BeamApp-jenkins-0610062848-8545c33f_c2aadabc-01ae-454d-aac9-65ce51923753 on Spark master local[4]
INFO:apache_beam.utils.subprocess_server:23/06/10 06:28:53 WARN software.amazon.awssdk.regions.internal.util.EC2MetadataUtils: Unable to retrieve the requested metadata.
INFO:apache_beam.utils.subprocess_server:23/06/10 06:28:53 WARN software.amazon.awssdk.regions.internal.util.EC2MetadataUtils: Unable to retrieve the requested metadata.
INFO:apache_beam.utils.subprocess_server:23/06/10 06:28:53 WARN software.amazon.awssdk.regions.internal.util.EC2MetadataUtils: Unable to retrieve the requested metadata.
INFO:apache_beam.utils.subprocess_server:23/06/10 06:28:53 WARN software.amazon.awssdk.regions.internal.util.EC2MetadataUtils: Unable to retrieve the requested metadata.
INFO:apache_beam.runners.worker.statecache:Creating state cache with size 0
INFO:apache_beam.runners.worker.sdk_worker:Creating insecure control channel for localhost:35353.
INFO:apache_beam.runners.worker.sdk_worker:Control channel established.
INFO:apache_beam.runners.worker.sdk_worker:Initializing SDKHarness with unbounded number of workers.
INFO:apache_beam.utils.subprocess_server:23/06/10 06:28:53 INFO org.apache.beam.runners.fnexecution.control.FnApiControlClientPoolService: Beam Fn Control client connected with id 1-1
INFO:apache_beam.utils.subprocess_server:23/06/10 06:28:53 INFO org.apache.beam.runners.fnexecution.control.FnApiControlClientPoolService: getProcessBundleDescriptor request with id 1-2
INFO:apache_beam.runners.worker.sdk_worker:Creating insecure state channel for localhost:35617.
INFO:apache_beam.runners.worker.sdk_worker:State channel established.
INFO:apache_beam.runners.worker.data_plane:Creating client data channel for localhost:39119
INFO:apache_beam.utils.subprocess_server:23/06/10 06:28:53 INFO org.apache.beam.runners.fnexecution.data.GrpcDataService: Beam Fn Data client connected.
INFO:apache_beam.utils.subprocess_server:23/06/10 06:28:54 INFO org.apache.beam.runners.fnexecution.control.FnApiControlClientPoolService: getProcessBundleDescriptor request with id 1-3
INFO:apache_beam.utils.subprocess_server:23/06/10 06:28:54 WARN software.amazon.awssdk.regions.internal.util.EC2MetadataUtils: Unable to retrieve the requested metadata.
INFO:apache_beam.utils.subprocess_server:23/06/10 06:28:54 WARN software.amazon.awssdk.regions.internal.util.EC2MetadataUtils: Unable to retrieve the requested metadata.
INFO:apache_beam.utils.subprocess_server:23/06/10 06:28:54 WARN software.amazon.awssdk.regions.internal.util.EC2MetadataUtils: Unable to retrieve the requested metadata.
INFO:apache_beam.utils.subprocess_server:23/06/10 06:28:54 WARN software.amazon.awssdk.regions.internal.util.EC2MetadataUtils: Unable to retrieve the requested metadata.
INFO:apache_beam.utils.subprocess_server:23/06/10 06:28:54 INFO org.apache.beam.runners.fnexecution.control.FnApiControlClientPoolService: getProcessBundleDescriptor request with id 1-4
INFO:apache_beam.utils.subprocess_server:23/06/10 06:28:54 INFO org.apache.beam.runners.fnexecution.control.FnApiControlClientPoolService: getProcessBundleDescriptor request with id 1-5
INFO:apache_beam.utils.subprocess_server:23/06/10 06:28:54 WARN software.amazon.awssdk.regions.internal.util.EC2MetadataUtils: Unable to retrieve the requested metadata.
INFO:apache_beam.utils.subprocess_server:23/06/10 06:28:54 WARN software.amazon.awssdk.regions.internal.util.EC2MetadataUtils: Unable to retrieve the requested metadata.
INFO:apache_beam.utils.subprocess_server:23/06/10 06:28:54 WARN software.amazon.awssdk.regions.internal.util.EC2MetadataUtils: Unable to retrieve the requested metadata.
INFO:apache_beam.utils.subprocess_server:23/06/10 06:28:54 WARN software.amazon.awssdk.regions.internal.util.EC2MetadataUtils: Unable to retrieve the requested metadata.
INFO:apache_beam.utils.subprocess_server:23/06/10 06:28:55 INFO org.apache.beam.runners.fnexecution.control.FnApiControlClientPoolService: getProcessBundleDescriptor request with id 1-9
INFO:apache_beam.utils.subprocess_server:23/06/10 06:28:55 INFO org.apache.beam.runners.fnexecution.control.FnApiControlClientPoolService: getProcessBundleDescriptor request with id 1-8
INFO:apache_beam.utils.subprocess_server:23/06/10 06:28:55 INFO org.apache.beam.runners.fnexecution.control.FnApiControlClientPoolService: getProcessBundleDescriptor request with id 1-6
INFO:apache_beam.utils.subprocess_server:23/06/10 06:28:55 INFO org.apache.beam.runners.fnexecution.control.FnApiControlClientPoolService: getProcessBundleDescriptor request with id 1-7
INFO:apache_beam.utils.subprocess_server:23/06/10 06:28:55 INFO org.apache.beam.runners.fnexecution.control.FnApiControlClientPoolService: getProcessBundleDescriptor request with id 1-10
INFO:apache_beam.utils.subprocess_server:23/06/10 06:28:55 INFO org.apache.beam.runners.fnexecution.control.FnApiControlClientPoolService: getProcessBundleDescriptor request with id 1-11
INFO:apache_beam.utils.subprocess_server:23/06/10 06:28:55 INFO org.apache.beam.runners.fnexecution.control.FnApiControlClientPoolService: getProcessBundleDescriptor request with id 1-12
INFO:apache_beam.utils.subprocess_server:23/06/10 06:28:55 INFO org.apache.beam.runners.fnexecution.control.FnApiControlClientPoolService: getProcessBundleDescriptor request with id 1-13
INFO:apache_beam.utils.subprocess_server:23/06/10 06:28:55 WARN software.amazon.awssdk.regions.internal.util.EC2MetadataUtils: Unable to retrieve the requested metadata.
INFO:apache_beam.utils.subprocess_server:23/06/10 06:28:55 WARN software.amazon.awssdk.regions.internal.util.EC2MetadataUtils: Unable to retrieve the requested metadata.
INFO:apache_beam.utils.subprocess_server:23/06/10 06:28:55 WARN software.amazon.awssdk.regions.internal.util.EC2MetadataUtils: Unable to retrieve the requested metadata.
INFO:apache_beam.utils.subprocess_server:23/06/10 06:28:55 WARN software.amazon.awssdk.regions.internal.util.EC2MetadataUtils: Unable to retrieve the requested metadata.
INFO:apache_beam.utils.subprocess_server:23/06/10 06:28:55 INFO org.apache.beam.runners.fnexecution.control.FnApiControlClientPoolService: getProcessBundleDescriptor request with id 1-14
INFO:apache_beam.utils.subprocess_server:23/06/10 06:28:55 WARN software.amazon.awssdk.regions.internal.util.EC2MetadataUtils: Unable to retrieve the requested metadata.
INFO:apache_beam.utils.subprocess_server:23/06/10 06:28:55 WARN software.amazon.awssdk.regions.internal.util.EC2MetadataUtils: Unable to retrieve the requested metadata.
INFO:apache_beam.utils.subprocess_server:23/06/10 06:28:55 WARN software.amazon.awssdk.regions.internal.util.EC2MetadataUtils: Unable to retrieve the requested metadata.
INFO:apache_beam.utils.subprocess_server:23/06/10 06:28:55 WARN software.amazon.awssdk.regions.internal.util.EC2MetadataUtils: Unable to retrieve the requested metadata.
INFO:apache_beam.utils.subprocess_server:23/06/10 06:28:55 INFO org.apache.beam.runners.fnexecution.control.FnApiControlClientPoolService: getProcessBundleDescriptor request with id 1-15
INFO:apache_beam.utils.subprocess_server:23/06/10 06:28:55 INFO org.apache.beam.runners.spark.SparkPipelineRunner: Job BeamApp-jenkins-0610062848-8545c33f_c2aadabc-01ae-454d-aac9-65ce51923753: Pipeline translated successfully. Computing outputs
INFO:apache_beam.utils.subprocess_server:23/06/10 06:28:55 WARN software.amazon.awssdk.regions.internal.util.EC2MetadataUtils: Unable to retrieve the requested metadata.
INFO:apache_beam.utils.subprocess_server:23/06/10 06:28:55 WARN software.amazon.awssdk.regions.internal.util.EC2MetadataUtils: Unable to retrieve the requested metadata.
INFO:apache_beam.utils.subprocess_server:23/06/10 06:28:55 WARN software.amazon.awssdk.regions.internal.util.EC2MetadataUtils: Unable to retrieve the requested metadata.
INFO:apache_beam.utils.subprocess_server:23/06/10 06:28:55 WARN software.amazon.awssdk.regions.internal.util.EC2MetadataUtils: Unable to retrieve the requested metadata.
INFO:apache_beam.utils.subprocess_server:23/06/10 06:28:55 INFO org.apache.beam.runners.fnexecution.control.FnApiControlClientPoolService: getProcessBundleDescriptor request with id 1-16
INFO:apache_beam.io.filebasedsink:Starting finalize_write threads with num_shards: 4 (skipped: 0), batches: 4, num_threads: 4
INFO:apache_beam.io.filebasedsink:Renamed 4 shards in 0.01 seconds.
INFO:apache_beam.utils.subprocess_server:23/06/10 06:28:55 INFO org.apache.beam.runners.spark.SparkPipelineRunner: Job BeamApp-jenkins-0610062848-8545c33f_c2aadabc-01ae-454d-aac9-65ce51923753 finished.
INFO:apache_beam.utils.subprocess_server:23/06/10 06:28:55 INFO org.sparkproject.jetty.server.AbstractConnector: Stopped Spark@1392e828{HTTP/1.1, (http/1.1)}{127.0.0.1:4040}
INFO:apache_beam.runners.portability.portable_runner:Job state changed to DONE
Exception in thread read_state:
Traceback (most recent call last):
  File "/usr/lib/python3.9/threading.py", line 973, in _bootstrap_inner
    self.run()
  File "/usr/lib/python3.9/threading.py", line 910, in run
Exception in thread run_worker_1-1:
Traceback (most recent call last):
  File "/usr/lib/python3.9/threading.py", line 973, in _bootstrap_inner
    self._target(*self._args, **self._kwargs)
    self.run()
  File "<https://ci-beam.apache.org/job/beam_PostCommit_Python39/ws/src/sdks/python/apache_beam/runners/worker/sdk_worker.py",> line 1039, in pull_responses
  File "/usr/lib/python3.9/threading.py", line 910, in run
    for response in responses:
  File "<https://ci-beam.apache.org/job/beam_PostCommit_Python39/ws/src/build/gradleenv/2022703443/lib/python3.9/site-packages/grpc/_channel.py",> line 475, in __next__
ERROR:apache_beam.runners.worker.data_plane:Failed to read inputs in the data plane.
Traceback (most recent call last):
  File "<https://ci-beam.apache.org/job/beam_PostCommit_Python39/ws/src/sdks/python/apache_beam/runners/worker/data_plane.py",> line 652, in _read_inputs
    for elements in elements_iterator:
  File "<https://ci-beam.apache.org/job/beam_PostCommit_Python39/ws/src/build/gradleenv/2022703443/lib/python3.9/site-packages/grpc/_channel.py",> line 475, in __next__
    return self._next()
  File "<https://ci-beam.apache.org/job/beam_PostCommit_Python39/ws/src/build/gradleenv/2022703443/lib/python3.9/site-packages/grpc/_channel.py",> line 881, in _next
    raise self
grpc._channel._MultiThreadedRendezvous: <_MultiThreadedRendezvous of RPC that terminated with:
	status = StatusCode.UNAVAILABLE
	details = "Socket closed"
	debug_error_string = "UNKNOWN:Error received from peer ipv6:%5B::1%5D:39119 {grpc_message:"Socket closed", grpc_status:14, created_time:"2023-06-10T06:28:56.359925247+00:00"}"
>
Exception in thread read_grpc_client_inputs:
Traceback (most recent call last):
  File "/usr/lib/python3.9/threading.py", line 973, in _bootstrap_inner
    return self._next()
  File "<https://ci-beam.apache.org/job/beam_PostCommit_Python39/ws/src/build/gradleenv/2022703443/lib/python3.9/site-packages/grpc/_channel.py",> line 881, in _next
    self._target(*self._args, **self._kwargs)
  File "<https://ci-beam.apache.org/job/beam_PostCommit_Python39/ws/src/sdks/python/apache_beam/runners/worker/sdk_worker.py",> line 262, in run
    self.run()
    raise self
  File "/usr/lib/python3.9/threading.py", line 910, in run
grpc._channel._MultiThreadedRendezvous: <_MultiThreadedRendezvous of RPC that terminated with:
	status = StatusCode.UNAVAILABLE
	details = "recvmsg:Connection reset by peer"
	debug_error_string = "UNKNOWN:Error received from peer ipv6:%5B::1%5D:35617 {grpc_message:"recvmsg:Connection reset by peer", grpc_status:14, created_time:"2023-06-10T06:28:56.359940749+00:00"}"
>
    for work_request in self._control_stub.Control(get_responses()):
  File "<https://ci-beam.apache.org/job/beam_PostCommit_Python39/ws/src/build/gradleenv/2022703443/lib/python3.9/site-packages/grpc/_channel.py",> line 475, in __next__
    self._target(*self._args, **self._kwargs)
  File "<https://ci-beam.apache.org/job/beam_PostCommit_Python39/ws/src/sdks/python/apache_beam/runners/worker/data_plane.py",> line 669, in <lambda>
    return self._next()
  File "<https://ci-beam.apache.org/job/beam_PostCommit_Python39/ws/src/build/gradleenv/2022703443/lib/python3.9/site-packages/grpc/_channel.py",> line 881, in _next
    target=lambda: self._read_inputs(elements_iterator),
  File "<https://ci-beam.apache.org/job/beam_PostCommit_Python39/ws/src/sdks/python/apache_beam/runners/worker/data_plane.py",> line 652, in _read_inputs
    raise self
grpc._channel._MultiThreadedRendezvous: <_MultiThreadedRendezvous of RPC that terminated with:
	status = StatusCode.UNAVAILABLE
	details = "Socket closed"
	debug_error_string = "UNKNOWN:Error received from peer ipv6:%5B::1%5D:35353 {created_time:"2023-06-10T06:28:56.359940366+00:00", grpc_status:14, grpc_message:"Socket closed"}"
>
    for elements in elements_iterator:
  File "<https://ci-beam.apache.org/job/beam_PostCommit_Python39/ws/src/build/gradleenv/2022703443/lib/python3.9/site-packages/grpc/_channel.py",> line 475, in __next__
    return self._next()
  File "<https://ci-beam.apache.org/job/beam_PostCommit_Python39/ws/src/build/gradleenv/2022703443/lib/python3.9/site-packages/grpc/_channel.py",> line 881, in _next
    raise self
grpc._channel._MultiThreadedRendezvous: <_MultiThreadedRendezvous of RPC that terminated with:
	status = StatusCode.UNAVAILABLE
	details = "Socket closed"
	debug_error_string = "UNKNOWN:Error received from peer ipv6:%5B::1%5D:39119 {grpc_message:"Socket closed", grpc_status:14, created_time:"2023-06-10T06:28:56.359925247+00:00"}"
>

> Task :sdks:python:test-suites:portable:py39:postCommitPy39

> Task :sdks:python:test-suites:dataflow:py39:postCommitIT
warning: sdist: standard file not found: should have one of README, README.rst, README.txt, README.md

warning: check: missing required meta-data: url

warning: check: missing meta-data: either (author and author_email) or (maintainer and maintainer_email) should be supplied


FAILURE: Build failed with an exception.

* Where:
Script '<https://ci-beam.apache.org/job/beam_PostCommit_Python39/ws/src/sdks/python/test-suites/direct/common.gradle'> line: 186

* What went wrong:
Execution failed for task ':sdks:python:test-suites:direct:py39:hdfsIntegrationTest'.
> Process 'command 'sh'' finished with non-zero exit value 1

* Try:
> Run with --stacktrace option to get the stack trace.
> Run with --info or --debug option to get more log output.

* Get more help at https://help.gradle.org

Deprecated Gradle features were used in this build, making it incompatible with Gradle 8.0.

You can use '--warning-mode all' to show the individual deprecation warnings and determine if they come from your own scripts or plugins.

See https://docs.gradle.org/7.5.1/userguide/command_line_interface.html#sec:command_line_warnings

Execution optimizations have been disabled for 1 invalid unit(s) of work during this build to ensure correctness.
Please consult deprecation warnings for more details.

BUILD FAILED in 2h 19m 19s
213 actionable tasks: 148 executed, 59 from cache, 6 up-to-date

Publishing build scan...
https://ge.apache.org/s/biincjemskgoc

Build step 'Invoke Gradle script' changed build result to FAILURE
Build step 'Invoke Gradle script' marked build as failure

---------------------------------------------------------------------
To unsubscribe, e-mail: builds-unsubscribe@beam.apache.org
For additional commands, e-mail: builds-help@beam.apache.org


Build failed in Jenkins: beam_PostCommit_Python39 #1923

Posted by Apache Jenkins Server <je...@builds.apache.org>.
See <https://ci-beam.apache.org/job/beam_PostCommit_Python39/1923/display/redirect>

Changes:


------------------------------------------
[...truncated 11.21 MB...]
../../build/gradleenv/-1734967050/lib/python3.9/site-packages/pkg_resources/__init__.py:2870
../../build/gradleenv/-1734967050/lib/python3.9/site-packages/pkg_resources/__init__.py:2870
../../build/gradleenv/-1734967050/lib/python3.9/site-packages/pkg_resources/__init__.py:2870
../../build/gradleenv/-1734967050/lib/python3.9/site-packages/pkg_resources/__init__.py:2870
../../build/gradleenv/-1734967050/lib/python3.9/site-packages/pkg_resources/__init__.py:2870
  <https://ci-beam.apache.org/job/beam_PostCommit_Python39/ws/src/build/gradleenv/-1734967050/lib/python3.9/site-packages/pkg_resources/__init__.py>:2870: DeprecationWarning: Deprecated call to `pkg_resources.declare_namespace('google.logging')`.
  Implementing implicit namespace packages (as specified in PEP 420) is preferred to `pkg_resources.declare_namespace`. See https://setuptools.pypa.io/en/latest/references/keywords.html#keyword-namespace-packages
    declare_namespace(pkg)

../../build/gradleenv/-1734967050/lib/python3.9/site-packages/pkg_resources/__init__.py:2870
../../build/gradleenv/-1734967050/lib/python3.9/site-packages/pkg_resources/__init__.py:2870
../../build/gradleenv/-1734967050/lib/python3.9/site-packages/pkg_resources/__init__.py:2870
../../build/gradleenv/-1734967050/lib/python3.9/site-packages/pkg_resources/__init__.py:2870
../../build/gradleenv/-1734967050/lib/python3.9/site-packages/pkg_resources/__init__.py:2870
../../build/gradleenv/-1734967050/lib/python3.9/site-packages/pkg_resources/__init__.py:2870
../../build/gradleenv/-1734967050/lib/python3.9/site-packages/pkg_resources/__init__.py:2870
../../build/gradleenv/-1734967050/lib/python3.9/site-packages/pkg_resources/__init__.py:2870
../../build/gradleenv/-1734967050/lib/python3.9/site-packages/pkg_resources/__init__.py:2870
  <https://ci-beam.apache.org/job/beam_PostCommit_Python39/ws/src/build/gradleenv/-1734967050/lib/python3.9/site-packages/pkg_resources/__init__.py>:2870: DeprecationWarning: Deprecated call to `pkg_resources.declare_namespace('google.iam')`.
  Implementing implicit namespace packages (as specified in PEP 420) is preferred to `pkg_resources.declare_namespace`. See https://setuptools.pypa.io/en/latest/references/keywords.html#keyword-namespace-packages
    declare_namespace(pkg)

../../build/gradleenv/-1734967050/lib/python3.9/site-packages/google/rpc/__init__.py:20
../../build/gradleenv/-1734967050/lib/python3.9/site-packages/google/rpc/__init__.py:20
../../build/gradleenv/-1734967050/lib/python3.9/site-packages/google/rpc/__init__.py:20
../../build/gradleenv/-1734967050/lib/python3.9/site-packages/google/rpc/__init__.py:20
../../build/gradleenv/-1734967050/lib/python3.9/site-packages/google/rpc/__init__.py:20
../../build/gradleenv/-1734967050/lib/python3.9/site-packages/google/rpc/__init__.py:20
../../build/gradleenv/-1734967050/lib/python3.9/site-packages/google/rpc/__init__.py:20
../../build/gradleenv/-1734967050/lib/python3.9/site-packages/google/rpc/__init__.py:20
../../build/gradleenv/-1734967050/lib/python3.9/site-packages/google/rpc/__init__.py:20
  <https://ci-beam.apache.org/job/beam_PostCommit_Python39/ws/src/build/gradleenv/-1734967050/lib/python3.9/site-packages/google/rpc/__init__.py>:20: DeprecationWarning: Deprecated call to `pkg_resources.declare_namespace('google.rpc')`.
  Implementing implicit namespace packages (as specified in PEP 420) is preferred to `pkg_resources.declare_namespace`. See https://setuptools.pypa.io/en/latest/references/keywords.html#keyword-namespace-packages
    pkg_resources.declare_namespace(__name__)

apache_beam/typehints/pandas_type_compatibility_test.py:67
apache_beam/typehints/pandas_type_compatibility_test.py:67
apache_beam/typehints/pandas_type_compatibility_test.py:67
apache_beam/typehints/pandas_type_compatibility_test.py:67
apache_beam/typehints/pandas_type_compatibility_test.py:67
apache_beam/typehints/pandas_type_compatibility_test.py:67
apache_beam/typehints/pandas_type_compatibility_test.py:67
apache_beam/typehints/pandas_type_compatibility_test.py:67
  <https://ci-beam.apache.org/job/beam_PostCommit_Python39/ws/src/sdks/python/apache_beam/typehints/pandas_type_compatibility_test.py>:67: FutureWarning: pandas.Int64Index is deprecated and will be removed from pandas in a future version. Use pandas.Index with the appropriate dtype instead.
    }).set_index(pd.Int64Index(range(123, 223), name='an_index')),

apache_beam/typehints/pandas_type_compatibility_test.py:90
apache_beam/typehints/pandas_type_compatibility_test.py:90
apache_beam/typehints/pandas_type_compatibility_test.py:90
apache_beam/typehints/pandas_type_compatibility_test.py:90
apache_beam/typehints/pandas_type_compatibility_test.py:90
apache_beam/typehints/pandas_type_compatibility_test.py:90
apache_beam/typehints/pandas_type_compatibility_test.py:90
apache_beam/typehints/pandas_type_compatibility_test.py:90
  <https://ci-beam.apache.org/job/beam_PostCommit_Python39/ws/src/sdks/python/apache_beam/typehints/pandas_type_compatibility_test.py>:90: FutureWarning: pandas.Int64Index is deprecated and will be removed from pandas in a future version. Use pandas.Index with the appropriate dtype instead.
    pd.Int64Index(range(123, 223), name='an_index'),

apache_beam/typehints/pandas_type_compatibility_test.py:91
apache_beam/typehints/pandas_type_compatibility_test.py:91
apache_beam/typehints/pandas_type_compatibility_test.py:91
apache_beam/typehints/pandas_type_compatibility_test.py:91
apache_beam/typehints/pandas_type_compatibility_test.py:91
apache_beam/typehints/pandas_type_compatibility_test.py:91
apache_beam/typehints/pandas_type_compatibility_test.py:91
apache_beam/typehints/pandas_type_compatibility_test.py:91
  <https://ci-beam.apache.org/job/beam_PostCommit_Python39/ws/src/sdks/python/apache_beam/typehints/pandas_type_compatibility_test.py>:91: FutureWarning: pandas.Int64Index is deprecated and will be removed from pandas in a future version. Use pandas.Index with the appropriate dtype instead.
    pd.Int64Index(range(475, 575), name='another_index'),

apache_beam/dataframe/io_it_test.py: 3 warnings
apache_beam/examples/cookbook/bigquery_tornadoes_it_test.py: 1 warning
apache_beam/examples/dataframe/flight_delays_it_test.py: 1 warning
apache_beam/io/gcp/bigquery_io_read_it_test.py: 2 warnings
apache_beam/io/gcp/bigquery_read_it_test.py: 7 warnings
apache_beam/io/gcp/bigquery_json_it_test.py: 3 warnings
apache_beam/io/gcp/big_query_query_to_table_it_test.py: 4 warnings
  <https://ci-beam.apache.org/job/beam_PostCommit_Python39/ws/src/sdks/python/apache_beam/io/gcp/bigquery.py>:2664: BeamDeprecationWarning: options is deprecated since First stable release. References to <pipeline>.options will not be supported
    temp_location = pcoll.pipeline.options.view_as(

apache_beam/dataframe/io_it_test.py: 3 warnings
apache_beam/examples/cookbook/bigquery_tornadoes_it_test.py: 1 warning
apache_beam/examples/dataframe/flight_delays_it_test.py: 1 warning
apache_beam/io/gcp/bigquery_io_read_it_test.py: 2 warnings
apache_beam/io/gcp/bigquery_read_it_test.py: 7 warnings
apache_beam/io/gcp/bigquery_json_it_test.py: 3 warnings
apache_beam/io/gcp/big_query_query_to_table_it_test.py: 4 warnings
  <https://ci-beam.apache.org/job/beam_PostCommit_Python39/ws/src/sdks/python/apache_beam/io/gcp/bigquery.py>:2666: BeamDeprecationWarning: options is deprecated since First stable release. References to <pipeline>.options will not be supported
    job_name = pcoll.pipeline.options.view_as(GoogleCloudOptions).job_name

apache_beam/dataframe/io_it_test.py: 3 warnings
apache_beam/examples/cookbook/bigquery_tornadoes_it_test.py: 1 warning
apache_beam/examples/dataframe/flight_delays_it_test.py: 1 warning
apache_beam/io/gcp/bigquery_io_read_it_test.py: 2 warnings
apache_beam/io/gcp/bigquery_read_it_test.py: 7 warnings
apache_beam/io/gcp/bigquery_json_it_test.py: 3 warnings
apache_beam/io/gcp/big_query_query_to_table_it_test.py: 4 warnings
  <https://ci-beam.apache.org/job/beam_PostCommit_Python39/ws/src/sdks/python/apache_beam/io/gcp/bigquery.py>:2690: BeamDeprecationWarning: options is deprecated since First stable release. References to <pipeline>.options will not be supported
    pipeline_options=pcoll.pipeline.options,

apache_beam/examples/complete/game/game_stats_it_test.py::GameStatsIT::test_game_stats_it
apache_beam/examples/complete/game/hourly_team_score_it_test.py::HourlyTeamScoreIT::test_hourly_team_score_it
apache_beam/examples/complete/game/leader_board_it_test.py::LeaderBoardIT::test_leader_board_it
apache_beam/io/gcp/bigquery_test.py::PubSubBigQueryIT::test_file_loads
apache_beam/io/gcp/bigquery_test.py::PubSubBigQueryIT::test_streaming_inserts
  <https://ci-beam.apache.org/job/beam_PostCommit_Python39/ws/src/sdks/python/apache_beam/io/gcp/tests/utils.py>:63: PendingDeprecationWarning: Client.dataset is deprecated and will be removed in a future version. Use a string like 'my_project.my_dataset' or a cloud.google.bigquery.DatasetReference object, instead.
    dataset_ref = client.dataset(unique_dataset_name, project=project)

apache_beam/examples/complete/game/game_stats_it_test.py: 2 warnings
apache_beam/examples/cookbook/bigquery_tornadoes_it_test.py: 1 warning
apache_beam/examples/complete/game/hourly_team_score_it_test.py: 1 warning
apache_beam/examples/complete/game/leader_board_it_test.py: 2 warnings
apache_beam/io/gcp/bigquery_test.py: 6 warnings
apache_beam/io/gcp/bigquery_file_loads_test.py: 3 warnings
apache_beam/io/gcp/bigquery_write_it_test.py: 4 warnings
apache_beam/io/gcp/bigquery_json_it_test.py: 2 warnings
apache_beam/io/gcp/big_query_query_to_table_it_test.py: 4 warnings
  <https://ci-beam.apache.org/job/beam_PostCommit_Python39/ws/src/sdks/python/apache_beam/io/gcp/bigquery.py>:2028: BeamDeprecationWarning: options is deprecated since First stable release. References to <pipeline>.options will not be supported
    is_streaming_pipeline = p.options.view_as(StandardOptions).streaming

apache_beam/examples/complete/game/game_stats_it_test.py: 2 warnings
apache_beam/examples/cookbook/bigquery_tornadoes_it_test.py: 1 warning
apache_beam/examples/complete/game/hourly_team_score_it_test.py: 1 warning
apache_beam/examples/complete/game/leader_board_it_test.py: 2 warnings
apache_beam/io/gcp/bigquery_test.py: 6 warnings
apache_beam/io/gcp/bigquery_file_loads_test.py: 3 warnings
apache_beam/io/gcp/bigquery_write_it_test.py: 4 warnings
apache_beam/io/gcp/bigquery_json_it_test.py: 2 warnings
apache_beam/io/gcp/big_query_query_to_table_it_test.py: 4 warnings
  <https://ci-beam.apache.org/job/beam_PostCommit_Python39/ws/src/sdks/python/apache_beam/io/gcp/bigquery.py>:2034: BeamDeprecationWarning: options is deprecated since First stable release. References to <pipeline>.options will not be supported
    experiments = p.options.view_as(DebugOptions).experiments or []

apache_beam/dataframe/io_it_test.py: 2 warnings
apache_beam/io/gcp/bigquery_json_it_test.py: 1 warning
apache_beam/io/gcp/bigquery_read_it_test.py: 9 warnings
  <https://ci-beam.apache.org/job/beam_PostCommit_Python39/ws/src/sdks/python/apache_beam/io/gcp/bigquery.py>:2708: BeamDeprecationWarning: options is deprecated since First stable release. References to <pipeline>.options will not be supported
    project_id = pcoll.pipeline.options.view_as(GoogleCloudOptions).project

apache_beam/dataframe/io_it_test.py: 2 warnings
apache_beam/io/gcp/bigquery_json_it_test.py: 1 warning
apache_beam/io/gcp/bigquery_read_it_test.py: 9 warnings
  <https://ci-beam.apache.org/job/beam_PostCommit_Python39/ws/src/sdks/python/apache_beam/io/gcp/bigquery.py>:2729: BeamDeprecationWarning: options is deprecated since First stable release. References to <pipeline>.options will not be supported
    pipeline_options=pcoll.pipeline.options,

apache_beam/examples/cookbook/bigquery_tornadoes_it_test.py: 1 warning
apache_beam/io/gcp/bigquery_write_it_test.py: 4 warnings
apache_beam/io/gcp/big_query_query_to_table_it_test.py: 4 warnings
apache_beam/io/gcp/bigquery_test.py: 2 warnings
  <https://ci-beam.apache.org/job/beam_PostCommit_Python39/ws/src/sdks/python/apache_beam/io/gcp/bigquery.py>:2024: BeamDeprecationWarning: options is deprecated since First stable release. References to <pipeline>.options will not be supported
    self.table_reference.projectId = pcoll.pipeline.options.view_as(

apache_beam/examples/cookbook/bigquery_tornadoes_it_test.py: 1 warning
apache_beam/io/gcp/bigquery_file_loads_test.py: 3 warnings
apache_beam/io/gcp/bigquery_test.py: 3 warnings
apache_beam/io/gcp/bigquery_write_it_test.py: 3 warnings
apache_beam/io/gcp/big_query_query_to_table_it_test.py: 4 warnings
  <https://ci-beam.apache.org/job/beam_PostCommit_Python39/ws/src/sdks/python/apache_beam/io/gcp/bigquery_file_loads.py>:1169: BeamDeprecationWarning: options is deprecated since First stable release. References to <pipeline>.options will not be supported
    self.project = self.project or p.options.view_as(GoogleCloudOptions).project

apache_beam/examples/cookbook/bigquery_tornadoes_it_test.py: 1 warning
apache_beam/examples/complete/game/hourly_team_score_it_test.py: 1 warning
apache_beam/io/gcp/bigquery_file_loads_test.py: 3 warnings
apache_beam/io/gcp/bigquery_test.py: 3 warnings
apache_beam/io/gcp/bigquery_write_it_test.py: 3 warnings
apache_beam/io/gcp/big_query_query_to_table_it_test.py: 4 warnings
  <https://ci-beam.apache.org/job/beam_PostCommit_Python39/ws/src/sdks/python/apache_beam/io/gcp/bigquery_file_loads.py>:1176: BeamDeprecationWarning: options is deprecated since First stable release. References to <pipeline>.options will not be supported
    temp_location = p.options.view_as(GoogleCloudOptions).temp_location

apache_beam/examples/cookbook/bigquery_tornadoes_it_test.py: 1 warning
apache_beam/examples/complete/game/hourly_team_score_it_test.py: 1 warning
apache_beam/io/gcp/bigquery_file_loads_test.py: 3 warnings
apache_beam/io/gcp/bigquery_test.py: 3 warnings
apache_beam/io/gcp/bigquery_write_it_test.py: 3 warnings
apache_beam/io/gcp/big_query_query_to_table_it_test.py: 4 warnings
  <https://ci-beam.apache.org/job/beam_PostCommit_Python39/ws/src/sdks/python/apache_beam/io/gcp/bigquery_file_loads.py>:1178: BeamDeprecationWarning: options is deprecated since First stable release. References to <pipeline>.options will not be supported
    p.options.view_as(GoogleCloudOptions).job_name or 'AUTOMATIC_JOB_NAME')

apache_beam/examples/cookbook/bigquery_tornadoes_it_test.py::BigqueryTornadoesIT::test_bigquery_tornadoes_it
  <https://ci-beam.apache.org/job/beam_PostCommit_Python39/ws/src/sdks/python/apache_beam/io/gcp/tests/utils.py>:100: PendingDeprecationWarning: Client.dataset is deprecated and will be removed in a future version. Use a string like 'my_project.my_dataset' or a cloud.google.bigquery.DatasetReference object, instead.
    table_ref = client.dataset(dataset_id).table(table_id)

apache_beam/examples/dataframe/flight_delays_it_test.py::FlightDelaysTest::test_flight_delays
  <https://ci-beam.apache.org/job/beam_PostCommit_Python39/ws/src/sdks/python/apache_beam/examples/dataframe/flight_delays.py>:47: FutureWarning: The default value of numeric_only in DataFrame.mean is deprecated. In a future version, it will default to False. In addition, specifying 'numeric_only=None' is deprecated. Select only valid columns or specify the value of numeric_only to silence this warning.
    return airline_df[at_top_airports].mean()

apache_beam/examples/dataframe/flight_delays_it_test.py::FlightDelaysTest::test_flight_delays
apache_beam/examples/dataframe/taxiride_it_test.py::TaxirideIT::test_aggregation
apache_beam/examples/dataframe/taxiride_it_test.py::TaxirideIT::test_enrich
  <https://ci-beam.apache.org/job/beam_PostCommit_Python39/ws/src/sdks/python/apache_beam/io/fileio.py>:593: BeamDeprecationWarning: options is deprecated since First stable release. References to <pipeline>.options will not be supported
    p.options.view_as(GoogleCloudOptions).temp_location or

apache_beam/io/gcp/bigquery_test.py::BigQueryStreamingInsertTransformIntegrationTests::test_multiple_destinations_transform
  <https://ci-beam.apache.org/job/beam_PostCommit_Python39/ws/src/sdks/python/apache_beam/io/gcp/bigquery_test.py>:1694: BeamDeprecationWarning: options is deprecated since First stable release. References to <pipeline>.options will not be supported
    streaming = self.test_pipeline.options.view_as(StandardOptions).streaming

apache_beam/io/gcp/bigquery_read_it_test.py::ReadTests::test_native_source
  <https://ci-beam.apache.org/job/beam_PostCommit_Python39/ws/src/sdks/python/apache_beam/io/gcp/bigquery_read_it_test.py>:170: BeamDeprecationWarning: BigQuerySource is deprecated since 2.25.0. Use ReadFromBigQuery instead.
    beam.io.BigQuerySource(query=self.query, use_standard_sql=True)))

apache_beam/io/gcp/bigquery_read_it_test.py::ReadNewTypesTests::test_native_source
  <https://ci-beam.apache.org/job/beam_PostCommit_Python39/ws/src/sdks/python/apache_beam/io/gcp/bigquery_read_it_test.py>:693: BeamDeprecationWarning: BigQuerySource is deprecated since 2.25.0. Use ReadFromBigQuery instead.
    beam.io.BigQuerySource(query=self.query, use_standard_sql=True)))

apache_beam/io/gcp/bigquery_read_it_test.py::ReadAllBQTests::test_read_queries
  <https://ci-beam.apache.org/job/beam_PostCommit_Python39/ws/src/sdks/python/apache_beam/io/gcp/bigquery.py>:2836: BeamDeprecationWarning: options is deprecated since First stable release. References to <pipeline>.options will not be supported
    job_name = pcoll.pipeline.options.view_as(GoogleCloudOptions).job_name

apache_beam/io/gcp/bigquery_read_it_test.py::ReadAllBQTests::test_read_queries
  <https://ci-beam.apache.org/job/beam_PostCommit_Python39/ws/src/sdks/python/apache_beam/io/gcp/bigquery.py>:2837: BeamDeprecationWarning: options is deprecated since First stable release. References to <pipeline>.options will not be supported
    project = pcoll.pipeline.options.view_as(GoogleCloudOptions).project

apache_beam/io/gcp/bigquery_read_it_test.py::ReadAllBQTests::test_read_queries
  <https://ci-beam.apache.org/job/beam_PostCommit_Python39/ws/src/sdks/python/apache_beam/io/gcp/bigquery.py>:2850: BeamDeprecationWarning: options is deprecated since First stable release. References to <pipeline>.options will not be supported
    options=pcoll.pipeline.options,

-- Docs: https://docs.pytest.org/en/stable/how-to/capture-warnings.html
- generated xml file: <https://ci-beam.apache.org/job/beam_PostCommit_Python39/ws/src/sdks/python/pytest_postCommitIT-df-py39.xml> -
========== 83 passed, 39 skipped, 592 warnings in 7788.73s (2:09:48) ===========

FAILURE: Build failed with an exception.

* Where:
Script '<https://ci-beam.apache.org/job/beam_PostCommit_Python39/ws/src/sdks/python/test-suites/direct/common.gradle'> line: 186

* What went wrong:
Execution failed for task ':sdks:python:test-suites:direct:py39:hdfsIntegrationTest'.
> Process 'command 'sh'' finished with non-zero exit value 1

* Try:
> Run with --stacktrace option to get the stack trace.
> Run with --info or --debug option to get more log output.

* Get more help at https://help.gradle.org

Deprecated Gradle features were used in this build, making it incompatible with Gradle 8.0.

You can use '--warning-mode all' to show the individual deprecation warnings and determine if they come from your own scripts or plugins.

See https://docs.gradle.org/7.5.1/userguide/command_line_interface.html#sec:command_line_warnings

Execution optimizations have been disabled for 1 invalid unit(s) of work during this build to ensure correctness.
Please consult deprecation warnings for more details.

BUILD FAILED in 2h 16m 10s
213 actionable tasks: 148 executed, 59 from cache, 6 up-to-date

Publishing build scan...
https://ge.apache.org/s/a22yinqux7u7u

Build step 'Invoke Gradle script' changed build result to FAILURE
Build step 'Invoke Gradle script' marked build as failure

---------------------------------------------------------------------
To unsubscribe, e-mail: builds-unsubscribe@beam.apache.org
For additional commands, e-mail: builds-help@beam.apache.org