You are viewing a plain text version of this content. The canonical link for it is here.
Posted to yarn-dev@hadoop.apache.org by Apache Jenkins Server <je...@builds.apache.org> on 2014/12/06 17:24:36 UTC

Failed: YARN-2921 PreCommit Build #6021

Jira: https://issues.apache.org/jira/browse/YARN-2921
Build: https://builds.apache.org/job/PreCommit-YARN-Build/6021/

###################################################################################
########################## LAST 60 LINES OF THE CONSOLE ###########################
[...truncated 24777 lines...]
Received 59 blocks and 8564279 bytes
Compression is 18.4%
Took 2.5 sec
[description-setter] Could not determine description.
Recording test results
ERROR: Failed to archive test reports
java.io.IOException: remote file operation failed: /home/jenkins/jenkins-slave/workspace/PreCommit-YARN-Build at hudson.remoting.Channel@3d14a1af:H5
	at hudson.FilePath.act(FilePath.java:916)
	at hudson.FilePath.act(FilePath.java:893)
	at hudson.tasks.junit.JUnitParser.parse(JUnitParser.java:87)
	at hudson.tasks.junit.JUnitResultArchiver.parse(JUnitResultArchiver.java:117)
	at hudson.tasks.junit.JUnitResultArchiver.perform(JUnitResultArchiver.java:129)
	at hudson.tasks.BuildStepMonitor$1.perform(BuildStepMonitor.java:20)
	at hudson.model.AbstractBuild$AbstractBuildExecution.perform(AbstractBuild.java:756)
	at hudson.model.AbstractBuild$AbstractBuildExecution.performAllBuildSteps(AbstractBuild.java:720)
	at hudson.model.Build$BuildExecution.post2(Build.java:182)
	at hudson.model.AbstractBuild$AbstractBuildExecution.post(AbstractBuild.java:669)
	at hudson.model.Run.execute(Run.java:1731)
	at hudson.model.FreeStyleBuild.run(FreeStyleBuild.java:43)
	at hudson.model.ResourceController.execute(ResourceController.java:88)
	at hudson.model.Executor.run(Executor.java:232)
Caused by: java.io.IOException: Remote call on H5 failed
	at hudson.remoting.Channel.call(Channel.java:751)
	at hudson.FilePath.act(FilePath.java:909)
	... 13 more
Caused by: java.lang.OutOfMemoryError: Java heap space
	at com.sun.org.apache.xerces.internal.util.XMLStringBuffer.append(XMLStringBuffer.java:208)
	at com.sun.org.apache.xerces.internal.impl.XMLEntityScanner.scanData(XMLEntityScanner.java:1390)
	at com.sun.org.apache.xerces.internal.impl.XMLDocumentFragmentScannerImpl.scanCDATASection(XMLDocumentFragmentScannerImpl.java:1654)
	at com.sun.org.apache.xerces.internal.impl.XMLDocumentFragmentScannerImpl$FragmentContentDriver.next(XMLDocumentFragmentScannerImpl.java:3020)
	at com.sun.org.apache.xerces.internal.impl.XMLDocumentScannerImpl.next(XMLDocumentScannerImpl.java:606)
	at com.sun.org.apache.xerces.internal.impl.XMLNSDocumentScannerImpl.next(XMLNSDocumentScannerImpl.java:117)
	at com.sun.org.apache.xerces.internal.impl.XMLDocumentFragmentScannerImpl.scanDocument(XMLDocumentFragmentScannerImpl.java:510)
	at com.sun.org.apache.xerces.internal.parsers.XML11Configuration.parse(XML11Configuration.java:848)
	at com.sun.org.apache.xerces.internal.parsers.XML11Configuration.parse(XML11Configuration.java:777)
	at com.sun.org.apache.xerces.internal.parsers.XMLParser.parse(XMLParser.java:141)
	at com.sun.org.apache.xerces.internal.parsers.AbstractSAXParser.parse(AbstractSAXParser.java:1213)
	at com.sun.org.apache.xerces.internal.jaxp.SAXParserImpl$JAXPSAXParser.parse(SAXParserImpl.java:648)
	at org.dom4j.io.SAXReader.read(SAXReader.java:465)
	at org.dom4j.io.SAXReader.read(SAXReader.java:264)
	at hudson.tasks.junit.SuiteResult.parse(SuiteResult.java:123)
	at hudson.tasks.junit.TestResult.parse(TestResult.java:273)
	at hudson.tasks.junit.TestResult.parsePossiblyEmpty(TestResult.java:229)
	at hudson.tasks.junit.TestResult.parse(TestResult.java:164)
	at hudson.tasks.junit.TestResult.parse(TestResult.java:147)
	at hudson.tasks.junit.TestResult.<init>(TestResult.java:123)
	at hudson.tasks.junit.JUnitParser$ParseResultCallable.invoke(JUnitParser.java:117)
	at hudson.tasks.junit.JUnitParser$ParseResultCallable.invoke(JUnitParser.java:90)
	at hudson.FilePath$FileCallableWrapper.call(FilePath.java:2474)
	at hudson.remoting.UserRequest.perform(UserRequest.java:118)
	at hudson.remoting.UserRequest.perform(UserRequest.java:48)
	at hudson.remoting.Request$2.run(Request.java:328)
	at hudson.remoting.InterceptingExecutorService$1.call(InterceptingExecutorService.java:72)
	at java.util.concurrent.FutureTask.run(FutureTask.java:262)
	at java.util.concurrent.ThreadPoolExecutor.runWorker(ThreadPoolExecutor.java:1145)
	at java.util.concurrent.ThreadPoolExecutor$Worker.run(ThreadPoolExecutor.java:615)
	at java.lang.Thread.run(Thread.java:745)
Email was triggered for: Failure
Sending email for trigger: Failure



###################################################################################
############################## FAILED TESTS (if any) ##############################
No tests ran.

Success: YARN-2902 PreCommit Build #6024

Posted by Apache Jenkins Server <je...@builds.apache.org>.
Jira: https://issues.apache.org/jira/browse/YARN-2902
Build: https://builds.apache.org/job/PreCommit-YARN-Build/6024/

###################################################################################
########################## LAST 60 LINES OF THE CONSOLE ###########################
[...truncated 3328 lines...]


{color:green}+1 overall{color}.  Here are the results of testing the latest attachment 
  http://issues.apache.org/jira/secure/attachment/12685562/YARN-2902.patch
  against trunk revision e227fb8.

    {color:green}+1 @author{color}.  The patch does not contain any @author tags.

    {color:green}+1 tests included{color}.  The patch appears to include 1 new or modified test files.

    {color:green}+1 javac{color}.  The applied patch does not increase the total number of javac compiler warnings.

    {color:green}+1 javadoc{color}.  There were no new javadoc warning messages.

    {color:green}+1 eclipse:eclipse{color}.  The patch built with eclipse:eclipse.

    {color:green}+1 findbugs{color}.  The patch does not introduce any new Findbugs (version 2.0.3) warnings.

    {color:green}+1 release audit{color}.  The applied patch does not increase the total number of release audit warnings.

    {color:green}+1 core tests{color}.  The patch passed unit tests in hadoop-yarn-project/hadoop-yarn/hadoop-yarn-server/hadoop-yarn-server-nodemanager.

    {color:green}+1 contrib tests{color}.  The patch passed contrib unit tests.

Test results: https://builds.apache.org/job/PreCommit-YARN-Build/6024//testReport/
Console output: https://builds.apache.org/job/PreCommit-YARN-Build/6024//console

This message is automatically generated.


======================================================================
======================================================================
    Adding comment to Jira.
======================================================================
======================================================================


Comment added.
577f62b5c66f266e2d1ea38d704f0eef4acda56c logged out


======================================================================
======================================================================
    Finished build.
======================================================================
======================================================================


Archiving artifacts
Sending artifact delta relative to PreCommit-YARN-Build #6019
Archived 15 artifacts
Archive block size is 32768
Received 58 blocks and 7084344 bytes
Compression is 21.2%
Took 1.6 sec
Description set: YARN-2902
Recording test results
Email was triggered for: Success
Sending email for trigger: Success



###################################################################################
############################## FAILED TESTS (if any) ##############################
All tests passed

Failed: YARN-2921 PreCommit Build #6023

Posted by Apache Jenkins Server <je...@builds.apache.org>.
Jira: https://issues.apache.org/jira/browse/YARN-2921
Build: https://builds.apache.org/job/PreCommit-YARN-Build/6023/

###################################################################################
########################## LAST 60 LINES OF THE CONSOLE ###########################
[...truncated 7458 lines...]

    {color:green}+1 tests included{color}.  The patch appears to include 2 new or modified test files.

    {color:green}+1 javac{color}.  The applied patch does not increase the total number of javac compiler warnings.

    {color:green}+1 javadoc{color}.  There were no new javadoc warning messages.

    {color:green}+1 eclipse:eclipse{color}.  The patch built with eclipse:eclipse.

    {color:green}+1 findbugs{color}.  The patch does not introduce any new Findbugs (version 2.0.3) warnings.

    {color:green}+1 release audit{color}.  The applied patch does not increase the total number of release audit warnings.

    {color:red}-1 core tests{color}.  The patch failed these unit tests in hadoop-yarn-project/hadoop-yarn/hadoop-yarn-server/hadoop-yarn-server-resourcemanager:

                  org.apache.hadoop.yarn.server.resourcemanager.TestRMRestart
                  org.apache.hadoop.yarn.server.resourcemanager.applicationsmanager.TestAMRestart
                  org.apache.hadoop.yarn.server.resourcemanager.TestContainerResourceUsage
                  org.apache.hadoop.yarn.server.resourcemanager.TestWorkPreservingRMRestart
                  org.apache.hadoop.yarn.server.resourcemanager.webapp.TestRMWebServicesApps

    {color:green}+1 contrib tests{color}.  The patch passed contrib unit tests.

Test results: https://builds.apache.org/job/PreCommit-YARN-Build/6023//testReport/
Console output: https://builds.apache.org/job/PreCommit-YARN-Build/6023//console

This message is automatically generated.


======================================================================
======================================================================
    Adding comment to Jira.
======================================================================
======================================================================


Comment added.
f9acf4bf6a341657b32a6c9ded9614f2489552ea logged out


======================================================================
======================================================================
    Finished build.
======================================================================
======================================================================


Build step 'Execute shell' marked build as failure
Archiving artifacts
Sending artifact delta relative to PreCommit-YARN-Build #6019
Archived 15 artifacts
Archive block size is 32768
Received 61 blocks and 7312872 bytes
Compression is 21.5%
Took 1.6 sec
[description-setter] Could not determine description.
Recording test results
Email was triggered for: Failure
Sending email for trigger: Failure



###################################################################################
############################## FAILED TESTS (if any) ##############################
13 tests failed.
FAILED:  org.apache.hadoop.yarn.server.resourcemanager.TestContainerResourceUsage.testUsageAfterAMRestartWithMultipleContainers

Error Message:
AppAttempt state is not correct (timedout) expected: [ALLOCATED], actual: SCHEDULED

Stack Trace:
java.lang.AssertionError: AppAttempt state is not correct (timedout) expected: [ALLOCATED], actual: SCHEDULED
	at org.junit.Assert.fail(Assert.java:88)
	at org.junit.Assert.assertTrue(Assert.java:41)
	at org.apache.hadoop.yarn.server.resourcemanager.MockAM.waitForState(MockAM.java:99)
	at org.apache.hadoop.yarn.server.resourcemanager.MockRM.sendAMLaunched(MockRM.java:529)
	at org.apache.hadoop.yarn.server.resourcemanager.MockRM.launchAM(MockRM.java:694)
	at org.apache.hadoop.yarn.server.resourcemanager.MockRM.launchAndRegisterAM(MockRM.java:701)
	at org.apache.hadoop.yarn.server.resourcemanager.TestContainerResourceUsage.amRestartTests(TestContainerResourceUsage.java:272)
	at org.apache.hadoop.yarn.server.resourcemanager.TestContainerResourceUsage.testUsageAfterAMRestartWithMultipleContainers(TestContainerResourceUsage.java:251)


FAILED:  org.apache.hadoop.yarn.server.resourcemanager.TestContainerResourceUsage.testUsageWithOneAttemptAndOneContainer

Error Message:
AppAttempt state is not correct (timedout) expected: [ALLOCATED], actual: SCHEDULED

Stack Trace:
java.lang.AssertionError: AppAttempt state is not correct (timedout) expected: [ALLOCATED], actual: SCHEDULED
	at org.junit.Assert.fail(Assert.java:88)
	at org.junit.Assert.assertTrue(Assert.java:41)
	at org.apache.hadoop.yarn.server.resourcemanager.MockAM.waitForState(MockAM.java:99)
	at org.apache.hadoop.yarn.server.resourcemanager.MockRM.sendAMLaunched(MockRM.java:529)
	at org.apache.hadoop.yarn.server.resourcemanager.TestContainerResourceUsage.testUsageWithOneAttemptAndOneContainer(TestContainerResourceUsage.java:97)


FAILED:  org.apache.hadoop.yarn.server.resourcemanager.TestContainerResourceUsage.testUsageAfterAMRestartKeepContainers

Error Message:
AppAttempt state is not correct (timedout) expected: [ALLOCATED], actual: SCHEDULED

Stack Trace:
java.lang.AssertionError: AppAttempt state is not correct (timedout) expected: [ALLOCATED], actual: SCHEDULED
	at org.junit.Assert.fail(Assert.java:88)
	at org.junit.Assert.assertTrue(Assert.java:41)
	at org.apache.hadoop.yarn.server.resourcemanager.MockAM.waitForState(MockAM.java:99)
	at org.apache.hadoop.yarn.server.resourcemanager.MockRM.sendAMLaunched(MockRM.java:529)
	at org.apache.hadoop.yarn.server.resourcemanager.MockRM.launchAM(MockRM.java:694)
	at org.apache.hadoop.yarn.server.resourcemanager.MockRM.launchAndRegisterAM(MockRM.java:701)
	at org.apache.hadoop.yarn.server.resourcemanager.TestContainerResourceUsage.amRestartTests(TestContainerResourceUsage.java:272)
	at org.apache.hadoop.yarn.server.resourcemanager.TestContainerResourceUsage.testUsageAfterAMRestartKeepContainers(TestContainerResourceUsage.java:256)


FAILED:  org.apache.hadoop.yarn.server.resourcemanager.TestRMRestart.testSynchronouslyRenewDTOnRecovery[0]

Error Message:
test timed out after 20000 milliseconds

Stack Trace:
java.lang.Exception: test timed out after 20000 milliseconds
	at java.lang.Thread.sleep(Native Method)
	at org.apache.hadoop.yarn.server.resourcemanager.MockAM.waitForState(MockAM.java:96)
	at org.apache.hadoop.yarn.server.resourcemanager.MockRM.finishAMAndVerifyAppState(MockRM.java:684)
	at org.apache.hadoop.yarn.server.resourcemanager.TestRMRestart.testSynchronouslyRenewDTOnRecovery(TestRMRestart.java:1948)


FAILED:  org.apache.hadoop.yarn.server.resourcemanager.TestRMRestart.testSynchronouslyRenewDTOnRecovery[1]

Error Message:
test timed out after 20000 milliseconds

Stack Trace:
java.lang.Exception: test timed out after 20000 milliseconds
	at java.lang.Thread.sleep(Native Method)
	at org.apache.hadoop.yarn.server.resourcemanager.MockAM.waitForState(MockAM.java:96)
	at org.apache.hadoop.yarn.server.resourcemanager.MockRM.finishAMAndVerifyAppState(MockRM.java:684)
	at org.apache.hadoop.yarn.server.resourcemanager.TestRMRestart.testSynchronouslyRenewDTOnRecovery(TestRMRestart.java:1948)


FAILED:  org.apache.hadoop.yarn.server.resourcemanager.TestWorkPreservingRMRestart.testCapacitySchedulerRecovery[0]

Error Message:
test timed out after 30000 milliseconds

Stack Trace:
java.lang.Exception: test timed out after 30000 milliseconds
	at java.lang.Thread.sleep(Native Method)
	at org.apache.hadoop.yarn.server.resourcemanager.MockRM.waitForState(MockRM.java:147)
	at org.apache.hadoop.yarn.server.resourcemanager.MockRM.launchAndRegisterAM(MockRM.java:703)
	at org.apache.hadoop.yarn.server.resourcemanager.TestWorkPreservingRMRestart.testCapacitySchedulerRecovery(TestWorkPreservingRMRestart.java:496)


FAILED:  org.apache.hadoop.yarn.server.resourcemanager.TestWorkPreservingRMRestart.testCapacitySchedulerQueueRemovedRecovery[0]

Error Message:
test timed out after 30000 milliseconds

Stack Trace:
java.lang.Exception: test timed out after 30000 milliseconds
	at java.lang.Thread.sleep(Native Method)
	at org.apache.hadoop.yarn.server.resourcemanager.MockRM.waitForState(MockRM.java:147)
	at org.apache.hadoop.yarn.server.resourcemanager.MockRM.launchAndRegisterAM(MockRM.java:703)
	at org.apache.hadoop.yarn.server.resourcemanager.TestWorkPreservingRMRestart.testCapacitySchedulerQueueRemovedRecovery(TestWorkPreservingRMRestart.java:613)


FAILED:  org.apache.hadoop.yarn.server.resourcemanager.TestWorkPreservingRMRestart.testAMfailedBetweenRMRestart[0]

Error Message:
test timed out after 20000 milliseconds

Stack Trace:
java.lang.Exception: test timed out after 20000 milliseconds
	at java.lang.Thread.sleep(Native Method)
	at org.apache.hadoop.yarn.server.resourcemanager.MockRM.waitForState(MockRM.java:147)
	at org.apache.hadoop.yarn.server.resourcemanager.MockRM.launchAndRegisterAM(MockRM.java:703)
	at org.apache.hadoop.yarn.server.resourcemanager.MockRM.waitForNewAMToLaunchAndRegister(MockRM.java:225)
	at org.apache.hadoop.yarn.server.resourcemanager.TestWorkPreservingRMRestart.testAMfailedBetweenRMRestart(TestWorkPreservingRMRestart.java:682)


FAILED:  org.apache.hadoop.yarn.server.resourcemanager.TestWorkPreservingRMRestart.testAMfailedBetweenRMRestart[1]

Error Message:
test timed out after 20000 milliseconds

Stack Trace:
java.lang.Exception: test timed out after 20000 milliseconds
	at java.lang.Thread.sleep(Native Method)
	at org.apache.hadoop.yarn.server.resourcemanager.MockRM.waitForState(MockRM.java:147)
	at org.apache.hadoop.yarn.server.resourcemanager.MockRM.launchAndRegisterAM(MockRM.java:703)
	at org.apache.hadoop.yarn.server.resourcemanager.MockRM.waitForNewAMToLaunchAndRegister(MockRM.java:225)
	at org.apache.hadoop.yarn.server.resourcemanager.TestWorkPreservingRMRestart.testAMfailedBetweenRMRestart(TestWorkPreservingRMRestart.java:682)


FAILED:  org.apache.hadoop.yarn.server.resourcemanager.TestWorkPreservingRMRestart.testAMfailedBetweenRMRestart[2]

Error Message:
test timed out after 20000 milliseconds

Stack Trace:
java.lang.Exception: test timed out after 20000 milliseconds
	at java.lang.Thread.sleep(Native Method)
	at org.apache.hadoop.yarn.server.resourcemanager.MockRM.waitForState(MockRM.java:147)
	at org.apache.hadoop.yarn.server.resourcemanager.MockRM.launchAndRegisterAM(MockRM.java:703)
	at org.apache.hadoop.yarn.server.resourcemanager.MockRM.waitForNewAMToLaunchAndRegister(MockRM.java:225)
	at org.apache.hadoop.yarn.server.resourcemanager.TestWorkPreservingRMRestart.testAMfailedBetweenRMRestart(TestWorkPreservingRMRestart.java:682)


FAILED:  org.apache.hadoop.yarn.server.resourcemanager.applicationsmanager.TestAMRestart.testRMAppAttemptFailuresValidityInterval

Error Message:
test timed out after 50000 milliseconds

Stack Trace:
java.lang.Exception: test timed out after 50000 milliseconds
	at java.lang.Thread.sleep(Native Method)
	at org.apache.hadoop.yarn.server.resourcemanager.MockRM.waitForState(MockRM.java:180)
	at org.apache.hadoop.yarn.server.resourcemanager.MockRM.launchAM(MockRM.java:695)
	at org.apache.hadoop.yarn.server.resourcemanager.MockRM.launchAndRegisterAM(MockRM.java:701)
	at org.apache.hadoop.yarn.server.resourcemanager.applicationsmanager.TestAMRestart.testRMAppAttemptFailuresValidityInterval(TestAMRestart.java:664)


FAILED:  org.apache.hadoop.yarn.server.resourcemanager.applicationsmanager.TestAMRestart.testPreemptedAMRestartOnRMRestart

Error Message:
test timed out after 20000 milliseconds

Stack Trace:
java.lang.Exception: test timed out after 20000 milliseconds
	at java.lang.Thread.sleep(Native Method)
	at org.apache.hadoop.yarn.server.resourcemanager.MockRM.waitForState(MockRM.java:147)
	at org.apache.hadoop.yarn.server.resourcemanager.MockRM.launchAndRegisterAM(MockRM.java:703)
	at org.apache.hadoop.yarn.server.resourcemanager.MockRM.waitForNewAMToLaunchAndRegister(MockRM.java:225)
	at org.apache.hadoop.yarn.server.resourcemanager.applicationsmanager.TestAMRestart.testPreemptedAMRestartOnRMRestart(TestAMRestart.java:514)


FAILED:  org.apache.hadoop.yarn.server.resourcemanager.webapp.TestRMWebServicesApps.testMultipleAppAttempts

Error Message:
test timed out after 20000 milliseconds

Stack Trace:
java.lang.Exception: test timed out after 20000 milliseconds
	at java.lang.Thread.sleep(Native Method)
	at org.apache.hadoop.yarn.server.resourcemanager.MockRM.waitForState(MockRM.java:147)
	at org.apache.hadoop.yarn.server.resourcemanager.MockRM.launchAndRegisterAM(MockRM.java:703)
	at org.apache.hadoop.yarn.server.resourcemanager.webapp.TestRMWebServicesApps.testMultipleAppAttempts(TestRMWebServicesApps.java:1424)



Failed: YARN-1723 PreCommit Build #6022

Posted by Apache Jenkins Server <je...@builds.apache.org>.
Jira: https://issues.apache.org/jira/browse/YARN-1723
Build: https://builds.apache.org/job/PreCommit-YARN-Build/6022/

###################################################################################
########################## LAST 60 LINES OF THE CONSOLE ###########################
[...truncated 3267 lines...]
    {color:green}+1 @author{color}.  The patch does not contain any @author tags.

    {color:red}-1 tests included{color}.  The patch doesn't appear to include any new or modified tests.
                        Please justify why no new tests are needed for this patch.
                        Also please list what manual steps were performed to verify this patch.

    {color:green}+1 javac{color}.  The applied patch does not increase the total number of javac compiler warnings.

    {color:green}+1 javadoc{color}.  There were no new javadoc warning messages.

    {color:green}+1 eclipse:eclipse{color}.  The patch built with eclipse:eclipse.

    {color:green}+1 findbugs{color}.  The patch does not introduce any new Findbugs (version 2.0.3) warnings.

    {color:green}+1 release audit{color}.  The applied patch does not increase the total number of release audit warnings.

    {color:red}-1 core tests{color}.  The patch failed these unit tests in hadoop-yarn-project/hadoop-yarn/hadoop-yarn-client:

                  org.apache.hadoop.yarn.client.TestApplicationClientProtocolOnHA

    {color:green}+1 contrib tests{color}.  The patch passed contrib unit tests.

Test results: https://builds.apache.org/job/PreCommit-YARN-Build/6022//testReport/
Console output: https://builds.apache.org/job/PreCommit-YARN-Build/6022//console

This message is automatically generated.


======================================================================
======================================================================
    Adding comment to Jira.
======================================================================
======================================================================


Comment added.
f7137afa25e4ea8a0fbe6e66b7f535bd1c8b1a13 logged out


======================================================================
======================================================================
    Finished build.
======================================================================
======================================================================


Build step 'Execute shell' marked build as failure
Archiving artifacts
Sending artifact delta relative to PreCommit-YARN-Build #6019
Archived 15 artifacts
Archive block size is 32768
Received 63 blocks and 6779160 bytes
Compression is 23.3%
Took 1.7 sec
[description-setter] Could not determine description.
Recording test results
Publish JUnit test result report is waiting for a checkpoint on PreCommit-YARN-Build #6021
Email was triggered for: Failure
Sending email for trigger: Failure



###################################################################################
############################## FAILED TESTS (if any) ##############################
5 tests failed.
REGRESSION:  org.apache.hadoop.yarn.client.TestApplicationClientProtocolOnHA.testGetApplicationAttemptsOnHA

Error Message:
Call From asf908.gq1.ygridcore.net/67.195.81.152 to asf908.gq1.ygridcore.net:28032 failed on connection exception: java.net.ConnectException: Connection refused; For more details see:  http://wiki.apache.org/hadoop/ConnectionRefused

Stack Trace:
java.net.ConnectException: Call From asf908.gq1.ygridcore.net/67.195.81.152 to asf908.gq1.ygridcore.net:28032 failed on connection exception: java.net.ConnectException: Connection refused; For more details see:  http://wiki.apache.org/hadoop/ConnectionRefused
	at sun.nio.ch.SocketChannelImpl.checkConnect(Native Method)
	at sun.nio.ch.SocketChannelImpl.finishConnect(SocketChannelImpl.java:599)
	at org.apache.hadoop.net.SocketIOWithTimeout.connect(SocketIOWithTimeout.java:206)
	at org.apache.hadoop.net.NetUtils.connect(NetUtils.java:530)
	at org.apache.hadoop.net.NetUtils.connect(NetUtils.java:494)
	at org.apache.hadoop.ipc.Client$Connection.setupConnection(Client.java:607)
	at org.apache.hadoop.ipc.Client$Connection.setupIOstreams(Client.java:705)
	at org.apache.hadoop.ipc.Client$Connection.access$2800(Client.java:368)
	at org.apache.hadoop.ipc.Client.getConnection(Client.java:1521)
	at org.apache.hadoop.ipc.Client.call(Client.java:1438)
	at org.apache.hadoop.ipc.Client.call(Client.java:1399)
	at org.apache.hadoop.ipc.ProtobufRpcEngine$Invoker.invoke(ProtobufRpcEngine.java:230)
	at com.sun.proxy.$Proxy17.getApplicationAttempts(Unknown Source)
	at org.apache.hadoop.yarn.api.impl.pb.client.ApplicationClientProtocolPBClientImpl.getApplicationAttempts(ApplicationClientProtocolPBClientImpl.java:382)
	at sun.reflect.NativeMethodAccessorImpl.invoke0(Native Method)
	at sun.reflect.NativeMethodAccessorImpl.invoke(NativeMethodAccessorImpl.java:39)
	at sun.reflect.DelegatingMethodAccessorImpl.invoke(DelegatingMethodAccessorImpl.java:25)
	at java.lang.reflect.Method.invoke(Method.java:597)
	at org.apache.hadoop.io.retry.RetryInvocationHandler.invokeMethod(RetryInvocationHandler.java:186)
	at org.apache.hadoop.io.retry.RetryInvocationHandler.invoke(RetryInvocationHandler.java:101)
	at com.sun.proxy.$Proxy18.getApplicationAttempts(Unknown Source)
	at org.apache.hadoop.yarn.client.api.impl.YarnClientImpl.getApplicationAttempts(YarnClientImpl.java:605)
	at org.apache.hadoop.yarn.client.TestApplicationClientProtocolOnHA.testGetApplicationAttemptsOnHA(TestApplicationClientProtocolOnHA.java:137)


REGRESSION:  org.apache.hadoop.yarn.client.TestApplicationClientProtocolOnHA.testGetApplicationAttemptReportOnHA

Error Message:
Call From asf908.gq1.ygridcore.net/67.195.81.152 to asf908.gq1.ygridcore.net:28032 failed on connection exception: java.net.ConnectException: Connection refused; For more details see:  http://wiki.apache.org/hadoop/ConnectionRefused

Stack Trace:
java.net.ConnectException: Call From asf908.gq1.ygridcore.net/67.195.81.152 to asf908.gq1.ygridcore.net:28032 failed on connection exception: java.net.ConnectException: Connection refused; For more details see:  http://wiki.apache.org/hadoop/ConnectionRefused
	at sun.nio.ch.SocketChannelImpl.checkConnect(Native Method)
	at sun.nio.ch.SocketChannelImpl.finishConnect(SocketChannelImpl.java:599)
	at org.apache.hadoop.net.SocketIOWithTimeout.connect(SocketIOWithTimeout.java:206)
	at org.apache.hadoop.net.NetUtils.connect(NetUtils.java:530)
	at org.apache.hadoop.net.NetUtils.connect(NetUtils.java:494)
	at org.apache.hadoop.ipc.Client$Connection.setupConnection(Client.java:607)
	at org.apache.hadoop.ipc.Client$Connection.setupIOstreams(Client.java:705)
	at org.apache.hadoop.ipc.Client$Connection.access$2800(Client.java:368)
	at org.apache.hadoop.ipc.Client.getConnection(Client.java:1521)
	at org.apache.hadoop.ipc.Client.call(Client.java:1438)
	at org.apache.hadoop.ipc.Client.call(Client.java:1399)
	at org.apache.hadoop.ipc.ProtobufRpcEngine$Invoker.invoke(ProtobufRpcEngine.java:230)
	at com.sun.proxy.$Proxy17.getApplicationAttemptReport(Unknown Source)
	at org.apache.hadoop.yarn.api.impl.pb.client.ApplicationClientProtocolPBClientImpl.getApplicationAttemptReport(ApplicationClientProtocolPBClientImpl.java:368)
	at sun.reflect.NativeMethodAccessorImpl.invoke0(Native Method)
	at sun.reflect.NativeMethodAccessorImpl.invoke(NativeMethodAccessorImpl.java:39)
	at sun.reflect.DelegatingMethodAccessorImpl.invoke(DelegatingMethodAccessorImpl.java:25)
	at java.lang.reflect.Method.invoke(Method.java:597)
	at org.apache.hadoop.io.retry.RetryInvocationHandler.invokeMethod(RetryInvocationHandler.java:186)
	at org.apache.hadoop.io.retry.RetryInvocationHandler.invoke(RetryInvocationHandler.java:101)
	at com.sun.proxy.$Proxy18.getApplicationAttemptReport(Unknown Source)
	at org.apache.hadoop.yarn.client.api.impl.YarnClientImpl.getApplicationAttemptReport(YarnClientImpl.java:581)
	at org.apache.hadoop.yarn.client.TestApplicationClientProtocolOnHA.testGetApplicationAttemptReportOnHA(TestApplicationClientProtocolOnHA.java:128)


REGRESSION:  org.apache.hadoop.yarn.client.TestApplicationClientProtocolOnHA.testRenewDelegationTokenOnHA

Error Message:
Call From asf908.gq1.ygridcore.net/67.195.81.152 to asf908.gq1.ygridcore.net:28032 failed on connection exception: java.net.ConnectException: Connection refused; For more details see:  http://wiki.apache.org/hadoop/ConnectionRefused

Stack Trace:
java.net.ConnectException: Call From asf908.gq1.ygridcore.net/67.195.81.152 to asf908.gq1.ygridcore.net:28032 failed on connection exception: java.net.ConnectException: Connection refused; For more details see:  http://wiki.apache.org/hadoop/ConnectionRefused
	at sun.nio.ch.SocketChannelImpl.checkConnect(Native Method)
	at sun.nio.ch.SocketChannelImpl.finishConnect(SocketChannelImpl.java:599)
	at org.apache.hadoop.net.SocketIOWithTimeout.connect(SocketIOWithTimeout.java:206)
	at org.apache.hadoop.net.NetUtils.connect(NetUtils.java:530)
	at org.apache.hadoop.net.NetUtils.connect(NetUtils.java:494)
	at org.apache.hadoop.ipc.Client$Connection.setupConnection(Client.java:607)
	at org.apache.hadoop.ipc.Client$Connection.setupIOstreams(Client.java:705)
	at org.apache.hadoop.ipc.Client$Connection.access$2800(Client.java:368)
	at org.apache.hadoop.ipc.Client.getConnection(Client.java:1521)
	at org.apache.hadoop.ipc.Client.call(Client.java:1438)
	at org.apache.hadoop.ipc.Client.call(Client.java:1399)
	at org.apache.hadoop.ipc.ProtobufRpcEngine$Invoker.invoke(ProtobufRpcEngine.java:230)
	at com.sun.proxy.$Proxy17.renewDelegationToken(Unknown Source)
	at org.apache.hadoop.yarn.api.impl.pb.client.ApplicationClientProtocolPBClientImpl.renewDelegationToken(ApplicationClientProtocolPBClientImpl.java:321)
	at sun.reflect.NativeMethodAccessorImpl.invoke0(Native Method)
	at sun.reflect.NativeMethodAccessorImpl.invoke(NativeMethodAccessorImpl.java:39)
	at sun.reflect.DelegatingMethodAccessorImpl.invoke(DelegatingMethodAccessorImpl.java:25)
	at java.lang.reflect.Method.invoke(Method.java:597)
	at org.apache.hadoop.io.retry.RetryInvocationHandler.invokeMethod(RetryInvocationHandler.java:186)
	at org.apache.hadoop.io.retry.RetryInvocationHandler.invoke(RetryInvocationHandler.java:101)
	at com.sun.proxy.$Proxy18.renewDelegationToken(Unknown Source)
	at org.apache.hadoop.yarn.client.TestApplicationClientProtocolOnHA.testRenewDelegationTokenOnHA(TestApplicationClientProtocolOnHA.java:198)


REGRESSION:  org.apache.hadoop.yarn.client.TestApplicationClientProtocolOnHA.testGetApplicationsOnHA

Error Message:
Call From asf908.gq1.ygridcore.net/67.195.81.152 to asf908.gq1.ygridcore.net:28032 failed on connection exception: java.net.ConnectException: Connection refused; For more details see:  http://wiki.apache.org/hadoop/ConnectionRefused

Stack Trace:
java.net.ConnectException: Call From asf908.gq1.ygridcore.net/67.195.81.152 to asf908.gq1.ygridcore.net:28032 failed on connection exception: java.net.ConnectException: Connection refused; For more details see:  http://wiki.apache.org/hadoop/ConnectionRefused
	at sun.nio.ch.SocketChannelImpl.checkConnect(Native Method)
	at sun.nio.ch.SocketChannelImpl.finishConnect(SocketChannelImpl.java:599)
	at org.apache.hadoop.net.SocketIOWithTimeout.connect(SocketIOWithTimeout.java:206)
	at org.apache.hadoop.net.NetUtils.connect(NetUtils.java:530)
	at org.apache.hadoop.net.NetUtils.connect(NetUtils.java:494)
	at org.apache.hadoop.ipc.Client$Connection.setupConnection(Client.java:607)
	at org.apache.hadoop.ipc.Client$Connection.setupIOstreams(Client.java:705)
	at org.apache.hadoop.ipc.Client$Connection.access$2800(Client.java:368)
	at org.apache.hadoop.ipc.Client.getConnection(Client.java:1521)
	at org.apache.hadoop.ipc.Client.call(Client.java:1438)
	at org.apache.hadoop.ipc.Client.call(Client.java:1399)
	at org.apache.hadoop.ipc.ProtobufRpcEngine$Invoker.invoke(ProtobufRpcEngine.java:230)
	at com.sun.proxy.$Proxy17.getApplications(Unknown Source)
	at org.apache.hadoop.yarn.api.impl.pb.client.ApplicationClientProtocolPBClientImpl.getApplications(ApplicationClientProtocolPBClientImpl.java:247)
	at sun.reflect.GeneratedMethodAccessor41.invoke(Unknown Source)
	at sun.reflect.DelegatingMethodAccessorImpl.invoke(DelegatingMethodAccessorImpl.java:25)
	at java.lang.reflect.Method.invoke(Method.java:597)
	at org.apache.hadoop.io.retry.RetryInvocationHandler.invokeMethod(RetryInvocationHandler.java:186)
	at org.apache.hadoop.io.retry.RetryInvocationHandler.invoke(RetryInvocationHandler.java:101)
	at com.sun.proxy.$Proxy18.getApplications(Unknown Source)
	at org.apache.hadoop.yarn.client.api.impl.YarnClientImpl.getApplications(YarnClientImpl.java:452)
	at org.apache.hadoop.yarn.client.api.impl.YarnClientImpl.getApplications(YarnClientImpl.java:429)
	at org.apache.hadoop.yarn.client.TestApplicationClientProtocolOnHA.testGetApplicationsOnHA(TestApplicationClientProtocolOnHA.java:94)


FAILED:  org.apache.hadoop.yarn.client.TestApplicationClientProtocolOnHA.testMoveApplicationAcrossQueuesOnHA

Error Message:
Call From asf908.gq1.ygridcore.net/67.195.81.152 to asf908.gq1.ygridcore.net:28032 failed on connection exception: java.net.ConnectException: Connection refused; For more details see:  http://wiki.apache.org/hadoop/ConnectionRefused

Stack Trace:
java.net.ConnectException: Call From asf908.gq1.ygridcore.net/67.195.81.152 to asf908.gq1.ygridcore.net:28032 failed on connection exception: java.net.ConnectException: Connection refused; For more details see:  http://wiki.apache.org/hadoop/ConnectionRefused
	at sun.nio.ch.SocketChannelImpl.checkConnect(Native Method)
	at sun.nio.ch.SocketChannelImpl.finishConnect(SocketChannelImpl.java:599)
	at org.apache.hadoop.net.SocketIOWithTimeout.connect(SocketIOWithTimeout.java:206)
	at org.apache.hadoop.net.NetUtils.connect(NetUtils.java:530)
	at org.apache.hadoop.net.NetUtils.connect(NetUtils.java:494)
	at org.apache.hadoop.ipc.Client$Connection.setupConnection(Client.java:607)
	at org.apache.hadoop.ipc.Client$Connection.setupIOstreams(Client.java:705)
	at org.apache.hadoop.ipc.Client$Connection.access$2800(Client.java:368)
	at org.apache.hadoop.ipc.Client.getConnection(Client.java:1521)
	at org.apache.hadoop.ipc.Client.call(Client.java:1438)
	at org.apache.hadoop.ipc.Client.call(Client.java:1399)
	at org.apache.hadoop.ipc.ProtobufRpcEngine$Invoker.invoke(ProtobufRpcEngine.java:230)
	at com.sun.proxy.$Proxy17.moveApplicationAcrossQueues(Unknown Source)
	at org.apache.hadoop.yarn.api.impl.pb.client.ApplicationClientProtocolPBClientImpl.moveApplicationAcrossQueues(ApplicationClientProtocolPBClientImpl.java:352)
	at sun.reflect.NativeMethodAccessorImpl.invoke0(Native Method)
	at sun.reflect.NativeMethodAccessorImpl.invoke(NativeMethodAccessorImpl.java:39)
	at sun.reflect.DelegatingMethodAccessorImpl.invoke(DelegatingMethodAccessorImpl.java:25)
	at java.lang.reflect.Method.invoke(Method.java:597)
	at org.apache.hadoop.io.retry.RetryInvocationHandler.invokeMethod(RetryInvocationHandler.java:186)
	at org.apache.hadoop.io.retry.RetryInvocationHandler.invoke(RetryInvocationHandler.java:101)
	at com.sun.proxy.$Proxy18.moveApplicationAcrossQueues(Unknown Source)
	at org.apache.hadoop.yarn.client.api.impl.YarnClientImpl.moveApplicationAcrossQueues(YarnClientImpl.java:675)
	at org.apache.hadoop.yarn.client.TestApplicationClientProtocolOnHA.testMoveApplicationAcrossQueuesOnHA(TestApplicationClientProtocolOnHA.java:180)